hadoop-yarn-dev mailing list archives

Site index · List index
Message view « Date » · « Thread »
Top « Date » · « Thread »
From Apache Jenkins Server <jenk...@builds.apache.org>
Subject Hadoop-Yarn-trunk - Build # 351 - Still Failing
Date Thu, 03 Oct 2013 10:58:41 GMT
See https://builds.apache.org/job/Hadoop-Yarn-trunk/351/

###################################################################################
########################## LAST 60 LINES OF THE CONSOLE ###########################
[...truncated 16477 lines...]
  TestDistributedShell.testDSShell:124 ยป  test timed out after 90000 millisecond...

Tests run: 2, Failures: 0, Errors: 1, Skipped: 0

[INFO] ------------------------------------------------------------------------
[INFO] Reactor Summary:
[INFO] 
[INFO] hadoop-yarn ....................................... SUCCESS [4.682s]
[INFO] hadoop-yarn-api ................................... SUCCESS [2:01.442s]
[INFO] hadoop-yarn-common ................................ SUCCESS [2:06.607s]
[INFO] hadoop-yarn-server ................................ SUCCESS [0.416s]
[INFO] hadoop-yarn-server-common ......................... SUCCESS [30.907s]
[INFO] hadoop-yarn-server-nodemanager .................... SUCCESS [4:05.167s]
[INFO] hadoop-yarn-server-web-proxy ...................... SUCCESS [13.575s]
[INFO] hadoop-yarn-server-resourcemanager ................ SUCCESS [10:53.174s]
[INFO] hadoop-yarn-server-tests .......................... SUCCESS [36.578s]
[INFO] hadoop-yarn-client ................................ SUCCESS [2:23.432s]
[INFO] hadoop-yarn-applications .......................... SUCCESS [0.122s]
[INFO] hadoop-yarn-applications-distributedshell ......... FAILURE [1:39.938s]
[INFO] hadoop-yarn-applications-unmanaged-am-launcher .... SKIPPED
[INFO] hadoop-yarn-site .................................. SKIPPED
[INFO] hadoop-yarn-project ............................... SKIPPED
[INFO] ------------------------------------------------------------------------
[INFO] BUILD FAILURE
[INFO] ------------------------------------------------------------------------
[INFO] Total time: 24:37.527s
[INFO] Finished at: Thu Oct 03 10:58:34 UTC 2013
[INFO] Final Memory: 51M/728M
[INFO] ------------------------------------------------------------------------
[ERROR] Failed to execute goal org.apache.maven.plugins:maven-surefire-plugin:2.16:test (default-test)
on project hadoop-yarn-applications-distributedshell: There are test failures.
[ERROR] 
[ERROR] Please refer to /home/jenkins/jenkins-slave/workspace/Hadoop-Yarn-trunk/trunk/hadoop-yarn-project/hadoop-yarn/hadoop-yarn-applications/hadoop-yarn-applications-distributedshell/target/surefire-reports
for the individual test results.
[ERROR] -> [Help 1]
[ERROR] 
[ERROR] To see the full stack trace of the errors, re-run Maven with the -e switch.
[ERROR] Re-run Maven using the -X switch to enable full debug logging.
[ERROR] 
[ERROR] For more information about the errors and possible solutions, please read the following
articles:
[ERROR] [Help 1] http://cwiki.apache.org/confluence/display/MAVEN/MojoFailureException
[ERROR] 
[ERROR] After correcting the problems, you can resume the build with the command
[ERROR]   mvn <goals> -rf :hadoop-yarn-applications-distributedshell
Build step 'Execute shell' marked build as failure
Archiving artifacts
Updating YARN-876
Updating YARN-1213
Updating YARN-425
Updating MAPREDUCE-5554
Updating YARN-1141
Updating YARN-677
Updating HADOOP-1
Updating MAPREDUCE-5530
Updating HADOOP-9254
Updating MAPREDUCE-5459
Updating HDFS-5289
Updating HADOOP-9063
Sending e-mails to: yarn-dev@hadoop.apache.org
Email was triggered for: Failure
Sending email for trigger: Failure



###################################################################################
############################## FAILED TESTS (if any) ##############################
No tests ran.
Mime
  • Unnamed multipart/mixed (inline, None, 0 bytes)
View raw message