hadoop-yarn-dev mailing list archives

Site index · List index
Message view « Date » · « Thread »
Top « Date » · « Thread »
From Apache Jenkins Server <jenk...@builds.apache.org>
Subject Failed: YARN-1021 PreCommit Build #1961
Date Wed, 18 Sep 2013 20:15:31 GMT
Jira: https://issues.apache.org/jira/browse/YARN-1021
Build: https://builds.apache.org/job/PreCommit-YARN-Build/1961/

###################################################################################
########################## LAST 60 LINES OF THE CONSOLE ###########################
[...truncated 3051 lines...]
NOP




{color:red}-1 overall{color}.  Here are the results of testing the latest attachment 
  http://issues.apache.org/jira/secure/attachment/12603903/YARN-1021.patch
  against trunk revision .

    {color:green}+1 @author{color}.  The patch does not contain any @author tags.

    {color:green}+1 tests included{color}.  The patch appears to include 8 new or modified
test files.

    {color:green}+1 javac{color}.  The applied patch does not increase the total number of
javac compiler warnings.

    {color:green}+1 javadoc{color}.  The javadoc tool did not generate any warning messages.

    {color:green}+1 eclipse:eclipse{color}.  The patch built with eclipse:eclipse.

    {color:green}+1 findbugs{color}.  The patch does not introduce any new Findbugs (version
1.3.9) warnings.

    {color:green}+1 release audit{color}.  The applied patch does not increase the total number
of release audit warnings.

    {color:red}-1 core tests{color}.  The patch failed these unit tests in hadoop-assemblies
hadoop-tools/hadoop-sls hadoop-tools/hadoop-tools-dist:

                  org.apache.hadoop.yarn.sls.TestSLSRunner

    {color:green}+1 contrib tests{color}.  The patch passed contrib unit tests.

Test results: https://builds.apache.org/job/PreCommit-YARN-Build/1961//testReport/
Console output: https://builds.apache.org/job/PreCommit-YARN-Build/1961//console

This message is automatically generated.


======================================================================
======================================================================
    Adding comment to Jira.
======================================================================
======================================================================


Comment added.
44d3ecfe603489b66286c64c4a5a5eb955f5c649 logged out


======================================================================
======================================================================
    Finished build.
======================================================================
======================================================================


Build step 'Execute shell' marked build as failure
Archiving artifacts
[description-setter] Could not determine description.
Recording test results
Email was triggered for: Failure
Sending email for trigger: Failure



###################################################################################
############################## FAILED TESTS (if any) ##############################
1 tests failed.
FAILED:  org.apache.hadoop.yarn.sls.TestSLSRunner.testSimulatorRunning

Error Message:
java.lang.NullPointerException

Stack Trace:
java.lang.AssertionError: java.lang.NullPointerException
	at org.junit.Assert.fail(Assert.java:93)
	at org.apache.hadoop.yarn.sls.TestSLSRunner.testSimulatorRunning(TestSLSRunner.java:50)



Mime
  • Unnamed multipart/mixed (inline, None, 0 bytes)
View raw message