hadoop-yarn-dev mailing list archives

Site index · List index
Message view « Date » · « Thread »
Top « Date » · « Thread »
From Apache Jenkins Server <jenk...@builds.apache.org>
Subject Hadoop-Yarn-trunk - Build # 344 - Failure
Date Thu, 26 Sep 2013 10:57:52 GMT
See https://builds.apache.org/job/Hadoop-Yarn-trunk/344/

###################################################################################
########################## LAST 60 LINES OF THE CONSOLE ###########################
[...truncated 16101 lines...]

Results :

Tests in error: 
  TestDistributedShell.testDSShell:124 ยป  test timed out after 90000 millisecond...

Tests run: 2, Failures: 0, Errors: 1, Skipped: 0

[INFO] ------------------------------------------------------------------------
[INFO] Reactor Summary:
[INFO] 
[INFO] hadoop-yarn ....................................... SUCCESS [6.477s]
[INFO] hadoop-yarn-api ................................... SUCCESS [1:59.979s]
[INFO] hadoop-yarn-common ................................ SUCCESS [2:08.295s]
[INFO] hadoop-yarn-server ................................ SUCCESS [0.301s]
[INFO] hadoop-yarn-server-common ......................... SUCCESS [29.623s]
[INFO] hadoop-yarn-server-nodemanager .................... SUCCESS [4:00.545s]
[INFO] hadoop-yarn-server-web-proxy ...................... SUCCESS [14.584s]
[INFO] hadoop-yarn-server-resourcemanager ................ SUCCESS [10:07.155s]
[INFO] hadoop-yarn-server-tests .......................... SUCCESS [36.575s]
[INFO] hadoop-yarn-client ................................ SUCCESS [2:24.309s]
[INFO] hadoop-yarn-applications .......................... SUCCESS [0.108s]
[INFO] hadoop-yarn-applications-distributedshell ......... FAILURE [1:39.994s]
[INFO] hadoop-yarn-applications-unmanaged-am-launcher .... SKIPPED
[INFO] hadoop-yarn-site .................................. SKIPPED
[INFO] hadoop-yarn-project ............................... SKIPPED
[INFO] ------------------------------------------------------------------------
[INFO] BUILD FAILURE
[INFO] ------------------------------------------------------------------------
[INFO] Total time: 23:49.616s
[INFO] Finished at: Thu Sep 26 10:57:45 UTC 2013
[INFO] Final Memory: 55M/732M
[INFO] ------------------------------------------------------------------------
[ERROR] Failed to execute goal org.apache.maven.plugins:maven-surefire-plugin:2.16:test (default-test)
on project hadoop-yarn-applications-distributedshell: There are test failures.
[ERROR] 
[ERROR] Please refer to /home/jenkins/jenkins-slave/workspace/Hadoop-Yarn-trunk/trunk/hadoop-yarn-project/hadoop-yarn/hadoop-yarn-applications/hadoop-yarn-applications-distributedshell/target/surefire-reports
for the individual test results.
[ERROR] -> [Help 1]
[ERROR] 
[ERROR] To see the full stack trace of the errors, re-run Maven with the -e switch.
[ERROR] Re-run Maven using the -X switch to enable full debug logging.
[ERROR] 
[ERROR] For more information about the errors and possible solutions, please read the following
articles:
[ERROR] [Help 1] http://cwiki.apache.org/confluence/display/MAVEN/MojoFailureException
[ERROR] 
[ERROR] After correcting the problems, you can resume the build with the command
[ERROR]   mvn <goals> -rf :hadoop-yarn-applications-distributedshell
Build step 'Execute shell' marked build as failure
Archiving artifacts
Updating HDFS-5041
Updating YARN-49
Updating MAPREDUCE-5503
Updating HADOOP-9981
Updating HDFS-5246
Updating MAPREDUCE-5170
Updating YARN-1157
Updating HADOOP-9761
Sending e-mails to: yarn-dev@hadoop.apache.org
Email was triggered for: Failure
Sending email for trigger: Failure



###################################################################################
############################## FAILED TESTS (if any) ##############################
No tests ran.
Mime
  • Unnamed multipart/mixed (inline, None, 0 bytes)
View raw message