hadoop-yarn-dev mailing list archives

Site index · List index
Message view « Date » · « Thread »
Top « Date » · « Thread »
From Apache Jenkins Server <jenk...@builds.apache.org>
Subject Failed: YARN-1144 PreCommit Build #1875
Date Sun, 08 Sep 2013 11:44:24 GMT
Jira: https://issues.apache.org/jira/browse/YARN-1144
Build: https://builds.apache.org/job/PreCommit-YARN-Build/1875/

###################################################################################
########################## LAST 60 LINES OF THE CONSOLE ###########################
[...truncated 2890 lines...]
NOP




{color:red}-1 overall{color}.  Here are the results of testing the latest attachment 
  http://issues.apache.org/jira/secure/attachment/12602049/YARN-1144.patch
  against trunk revision .

    {color:green}+1 @author{color}.  The patch does not contain any @author tags.

    {color:green}+1 tests included{color}.  The patch appears to include 2 new or modified
test files.

    {color:green}+1 javac{color}.  The applied patch does not increase the total number of
javac compiler warnings.

    {color:green}+1 javadoc{color}.  The javadoc tool did not generate any warning messages.

    {color:green}+1 eclipse:eclipse{color}.  The patch built with eclipse:eclipse.

    {color:green}+1 findbugs{color}.  The patch does not introduce any new Findbugs (version
1.3.9) warnings.

    {color:green}+1 release audit{color}.  The applied patch does not increase the total number
of release audit warnings.

    {color:red}-1 core tests{color}.  The patch failed these unit tests in hadoop-yarn-project/hadoop-yarn/hadoop-yarn-server/hadoop-yarn-server-resourcemanager:

                  org.apache.hadoop.yarn.server.resourcemanager.rmapp.attempt.TestRMAppAttemptTransitions

    {color:green}+1 contrib tests{color}.  The patch passed contrib unit tests.

Test results: https://builds.apache.org/job/PreCommit-YARN-Build/1875//testReport/
Console output: https://builds.apache.org/job/PreCommit-YARN-Build/1875//console

This message is automatically generated.


======================================================================
======================================================================
    Adding comment to Jira.
======================================================================
======================================================================


Comment added.
045f70df459473990c7b89d3062d03e5edbb14dd logged out


======================================================================
======================================================================
    Finished build.
======================================================================
======================================================================


Build step 'Execute shell' marked build as failure
Archiving artifacts
[description-setter] Could not determine description.
Recording test results
Email was triggered for: Failure
Sending email for trigger: Failure



###################################################################################
############################## FAILED TESTS (if any) ##############################
11 tests failed.
FAILED:  org.apache.hadoop.yarn.server.resourcemanager.rmapp.attempt.TestRMAppAttemptTransitions.testUnmanagedAMSuccess

Error Message:
expected:<[asf004.sp2.ygridcore.net:8088/proxy/application_1378640314364_0001/]> but
was:<[mytrackingurl]>

Stack Trace:
org.junit.ComparisonFailure: expected:<[asf004.sp2.ygridcore.net:8088/proxy/application_1378640314364_0001/]>
but was:<[mytrackingurl]>
	at org.junit.Assert.assertEquals(Assert.java:125)
	at org.junit.Assert.assertEquals(Assert.java:147)
	at org.apache.hadoop.yarn.server.resourcemanager.rmapp.attempt.TestRMAppAttemptTransitions.testAppAttemptFinishedState(TestRMAppAttemptTransitions.java:453)
	at org.apache.hadoop.yarn.server.resourcemanager.rmapp.attempt.TestRMAppAttemptTransitions.testUnmanagedAMSuccess(TestRMAppAttemptTransitions.java:583)


FAILED:  org.apache.hadoop.yarn.server.resourcemanager.rmapp.attempt.TestRMAppAttemptTransitions.testRunningToFailed

Error Message:
expected:<[oldtrackingurl]> but was:<[asf004.sp2.ygridcore.net:8088/proxy/application_1378640314364_0011/]>

Stack Trace:
org.junit.ComparisonFailure: expected:<[oldtrackingurl]> but was:<[asf004.sp2.ygridcore.net:8088/proxy/application_1378640314364_0011/]>
	at org.junit.Assert.assertEquals(Assert.java:125)
	at org.junit.Assert.assertEquals(Assert.java:147)
	at org.apache.hadoop.yarn.server.resourcemanager.rmapp.attempt.TestRMAppAttemptTransitions.testAppAttemptRunningState(TestRMAppAttemptTransitions.java:418)
	at org.apache.hadoop.yarn.server.resourcemanager.rmapp.attempt.TestRMAppAttemptTransitions.runApplicationAttempt(TestRMAppAttemptTransitions.java:543)
	at org.apache.hadoop.yarn.server.resourcemanager.rmapp.attempt.TestRMAppAttemptTransitions.testRunningToFailed(TestRMAppAttemptTransitions.java:692)


FAILED:  org.apache.hadoop.yarn.server.resourcemanager.rmapp.attempt.TestRMAppAttemptTransitions.testRunningToKilled

Error Message:
expected:<[oldtrackingurl]> but was:<[asf004.sp2.ygridcore.net:8088/proxy/application_1378640314364_0012/]>

Stack Trace:
org.junit.ComparisonFailure: expected:<[oldtrackingurl]> but was:<[asf004.sp2.ygridcore.net:8088/proxy/application_1378640314364_0012/]>
	at org.junit.Assert.assertEquals(Assert.java:125)
	at org.junit.Assert.assertEquals(Assert.java:147)
	at org.apache.hadoop.yarn.server.resourcemanager.rmapp.attempt.TestRMAppAttemptTransitions.testAppAttemptRunningState(TestRMAppAttemptTransitions.java:418)
	at org.apache.hadoop.yarn.server.resourcemanager.rmapp.attempt.TestRMAppAttemptTransitions.runApplicationAttempt(TestRMAppAttemptTransitions.java:543)
	at org.apache.hadoop.yarn.server.resourcemanager.rmapp.attempt.TestRMAppAttemptTransitions.testRunningToKilled(TestRMAppAttemptTransitions.java:715)


FAILED:  org.apache.hadoop.yarn.server.resourcemanager.rmapp.attempt.TestRMAppAttemptTransitions.testRunningExpire

Error Message:
expected:<[oldtrackingurl]> but was:<[asf004.sp2.ygridcore.net:8088/proxy/application_1378640314364_0014/]>

Stack Trace:
org.junit.ComparisonFailure: expected:<[oldtrackingurl]> but was:<[asf004.sp2.ygridcore.net:8088/proxy/application_1378640314364_0014/]>
	at org.junit.Assert.assertEquals(Assert.java:125)
	at org.junit.Assert.assertEquals(Assert.java:147)
	at org.apache.hadoop.yarn.server.resourcemanager.rmapp.attempt.TestRMAppAttemptTransitions.testAppAttemptRunningState(TestRMAppAttemptTransitions.java:418)
	at org.apache.hadoop.yarn.server.resourcemanager.rmapp.attempt.TestRMAppAttemptTransitions.runApplicationAttempt(TestRMAppAttemptTransitions.java:543)
	at org.apache.hadoop.yarn.server.resourcemanager.rmapp.attempt.TestRMAppAttemptTransitions.testRunningExpire(TestRMAppAttemptTransitions.java:753)


FAILED:  org.apache.hadoop.yarn.server.resourcemanager.rmapp.attempt.TestRMAppAttemptTransitions.testUnregisterToKilledFinishing

Error Message:
expected:<[oldtrackingurl]> but was:<[asf004.sp2.ygridcore.net:8088/proxy/application_1378640314364_0015/]>

Stack Trace:
org.junit.ComparisonFailure: expected:<[oldtrackingurl]> but was:<[asf004.sp2.ygridcore.net:8088/proxy/application_1378640314364_0015/]>
	at org.junit.Assert.assertEquals(Assert.java:125)
	at org.junit.Assert.assertEquals(Assert.java:147)
	at org.apache.hadoop.yarn.server.resourcemanager.rmapp.attempt.TestRMAppAttemptTransitions.testAppAttemptRunningState(TestRMAppAttemptTransitions.java:418)
	at org.apache.hadoop.yarn.server.resourcemanager.rmapp.attempt.TestRMAppAttemptTransitions.runApplicationAttempt(TestRMAppAttemptTransitions.java:543)
	at org.apache.hadoop.yarn.server.resourcemanager.rmapp.attempt.TestRMAppAttemptTransitions.testUnregisterToKilledFinishing(TestRMAppAttemptTransitions.java:771)


FAILED:  org.apache.hadoop.yarn.server.resourcemanager.rmapp.attempt.TestRMAppAttemptTransitions.testNoTrackingUrl

Error Message:
expected:<[oldtrackingurl]> but was:<[asf004.sp2.ygridcore.net:8088/proxy/application_1378640314364_0016/]>

Stack Trace:
org.junit.ComparisonFailure: expected:<[oldtrackingurl]> but was:<[asf004.sp2.ygridcore.net:8088/proxy/application_1378640314364_0016/]>
	at org.junit.Assert.assertEquals(Assert.java:125)
	at org.junit.Assert.assertEquals(Assert.java:147)
	at org.apache.hadoop.yarn.server.resourcemanager.rmapp.attempt.TestRMAppAttemptTransitions.testAppAttemptRunningState(TestRMAppAttemptTransitions.java:418)
	at org.apache.hadoop.yarn.server.resourcemanager.rmapp.attempt.TestRMAppAttemptTransitions.runApplicationAttempt(TestRMAppAttemptTransitions.java:543)
	at org.apache.hadoop.yarn.server.resourcemanager.rmapp.attempt.TestRMAppAttemptTransitions.testNoTrackingUrl(TestRMAppAttemptTransitions.java:782)


FAILED:  org.apache.hadoop.yarn.server.resourcemanager.rmapp.attempt.TestRMAppAttemptTransitions.testUnregisterToSuccessfulFinishing

Error Message:
expected:<[oldtrackingurl]> but was:<[asf004.sp2.ygridcore.net:8088/proxy/application_1378640314364_0017/]>

Stack Trace:
org.junit.ComparisonFailure: expected:<[oldtrackingurl]> but was:<[asf004.sp2.ygridcore.net:8088/proxy/application_1378640314364_0017/]>
	at org.junit.Assert.assertEquals(Assert.java:125)
	at org.junit.Assert.assertEquals(Assert.java:147)
	at org.apache.hadoop.yarn.server.resourcemanager.rmapp.attempt.TestRMAppAttemptTransitions.testAppAttemptRunningState(TestRMAppAttemptTransitions.java:418)
	at org.apache.hadoop.yarn.server.resourcemanager.rmapp.attempt.TestRMAppAttemptTransitions.runApplicationAttempt(TestRMAppAttemptTransitions.java:543)
	at org.apache.hadoop.yarn.server.resourcemanager.rmapp.attempt.TestRMAppAttemptTransitions.testUnregisterToSuccessfulFinishing(TestRMAppAttemptTransitions.java:789)


FAILED:  org.apache.hadoop.yarn.server.resourcemanager.rmapp.attempt.TestRMAppAttemptTransitions.testFinishingKill

Error Message:
expected:<[oldtrackingurl]> but was:<[asf004.sp2.ygridcore.net:8088/proxy/application_1378640314364_0018/]>

Stack Trace:
org.junit.ComparisonFailure: expected:<[oldtrackingurl]> but was:<[asf004.sp2.ygridcore.net:8088/proxy/application_1378640314364_0018/]>
	at org.junit.Assert.assertEquals(Assert.java:125)
	at org.junit.Assert.assertEquals(Assert.java:147)
	at org.apache.hadoop.yarn.server.resourcemanager.rmapp.attempt.TestRMAppAttemptTransitions.testAppAttemptRunningState(TestRMAppAttemptTransitions.java:418)
	at org.apache.hadoop.yarn.server.resourcemanager.rmapp.attempt.TestRMAppAttemptTransitions.runApplicationAttempt(TestRMAppAttemptTransitions.java:543)
	at org.apache.hadoop.yarn.server.resourcemanager.rmapp.attempt.TestRMAppAttemptTransitions.testFinishingKill(TestRMAppAttemptTransitions.java:798)


FAILED:  org.apache.hadoop.yarn.server.resourcemanager.rmapp.attempt.TestRMAppAttemptTransitions.testFinishingExpire

Error Message:
expected:<[oldtrackingurl]> but was:<[asf004.sp2.ygridcore.net:8088/proxy/application_1378640314364_0019/]>

Stack Trace:
org.junit.ComparisonFailure: expected:<[oldtrackingurl]> but was:<[asf004.sp2.ygridcore.net:8088/proxy/application_1378640314364_0019/]>
	at org.junit.Assert.assertEquals(Assert.java:125)
	at org.junit.Assert.assertEquals(Assert.java:147)
	at org.apache.hadoop.yarn.server.resourcemanager.rmapp.attempt.TestRMAppAttemptTransitions.testAppAttemptRunningState(TestRMAppAttemptTransitions.java:418)
	at org.apache.hadoop.yarn.server.resourcemanager.rmapp.attempt.TestRMAppAttemptTransitions.runApplicationAttempt(TestRMAppAttemptTransitions.java:543)
	at org.apache.hadoop.yarn.server.resourcemanager.rmapp.attempt.TestRMAppAttemptTransitions.testFinishingExpire(TestRMAppAttemptTransitions.java:816)


FAILED:  org.apache.hadoop.yarn.server.resourcemanager.rmapp.attempt.TestRMAppAttemptTransitions.testFinishingToFinishing

Error Message:
expected:<[oldtrackingurl]> but was:<[asf004.sp2.ygridcore.net:8088/proxy/application_1378640314364_0020/]>

Stack Trace:
org.junit.ComparisonFailure: expected:<[oldtrackingurl]> but was:<[asf004.sp2.ygridcore.net:8088/proxy/application_1378640314364_0020/]>
	at org.junit.Assert.assertEquals(Assert.java:125)
	at org.junit.Assert.assertEquals(Assert.java:147)
	at org.apache.hadoop.yarn.server.resourcemanager.rmapp.attempt.TestRMAppAttemptTransitions.testAppAttemptRunningState(TestRMAppAttemptTransitions.java:418)
	at org.apache.hadoop.yarn.server.resourcemanager.rmapp.attempt.TestRMAppAttemptTransitions.runApplicationAttempt(TestRMAppAttemptTransitions.java:543)
	at org.apache.hadoop.yarn.server.resourcemanager.rmapp.attempt.TestRMAppAttemptTransitions.testFinishingToFinishing(TestRMAppAttemptTransitions.java:834)


FAILED:  org.apache.hadoop.yarn.server.resourcemanager.rmapp.attempt.TestRMAppAttemptTransitions.testSuccessfulFinishingToFinished

Error Message:
expected:<[oldtrackingurl]> but was:<[asf004.sp2.ygridcore.net:8088/proxy/application_1378640314364_0021/]>

Stack Trace:
org.junit.ComparisonFailure: expected:<[oldtrackingurl]> but was:<[asf004.sp2.ygridcore.net:8088/proxy/application_1378640314364_0021/]>
	at org.junit.Assert.assertEquals(Assert.java:125)
	at org.junit.Assert.assertEquals(Assert.java:147)
	at org.apache.hadoop.yarn.server.resourcemanager.rmapp.attempt.TestRMAppAttemptTransitions.testAppAttemptRunningState(TestRMAppAttemptTransitions.java:418)
	at org.apache.hadoop.yarn.server.resourcemanager.rmapp.attempt.TestRMAppAttemptTransitions.runApplicationAttempt(TestRMAppAttemptTransitions.java:543)
	at org.apache.hadoop.yarn.server.resourcemanager.rmapp.attempt.TestRMAppAttemptTransitions.testSuccessfulFinishingToFinished(TestRMAppAttemptTransitions.java:856)



Mime
  • Unnamed multipart/mixed (inline, None, 0 bytes)
View raw message