hadoop-yarn-dev mailing list archives

Site index · List index
Message view « Date » · « Thread »
Top « Date » · « Thread »
From Apache Jenkins Server <jenk...@builds.apache.org>
Subject Failed: YARN-415 PreCommit Build #1975
Date Thu, 19 Sep 2013 22:41:19 GMT
Jira: https://issues.apache.org/jira/browse/YARN-415
Build: https://builds.apache.org/job/PreCommit-YARN-Build/1975/

###################################################################################
########################## LAST 60 LINES OF THE CONSOLE ###########################
[...truncated 3421 lines...]




{color:red}-1 overall{color}.  Here are the results of testing the latest attachment 
  http://issues.apache.org/jira/secure/attachment/12604132/YARN-415--n2.patch
  against trunk revision .

    {color:green}+1 @author{color}.  The patch does not contain any @author tags.

    {color:green}+1 tests included{color}.  The patch appears to include 4 new or modified
test files.

    {color:green}+1 javac{color}.  The applied patch does not increase the total number of
javac compiler warnings.

    {color:green}+1 javadoc{color}.  The javadoc tool did not generate any warning messages.

    {color:green}+1 eclipse:eclipse{color}.  The patch built with eclipse:eclipse.

    {color:green}+1 findbugs{color}.  The patch does not introduce any new Findbugs (version
1.3.9) warnings.

    {color:green}+1 release audit{color}.  The applied patch does not increase the total number
of release audit warnings.

    {color:red}-1 core tests{color}.  The patch failed these unit tests in hadoop-yarn-project/hadoop-yarn/hadoop-yarn-api
hadoop-yarn-project/hadoop-yarn/hadoop-yarn-client hadoop-yarn-project/hadoop-yarn/hadoop-yarn-common
hadoop-yarn-project/hadoop-yarn/hadoop-yarn-server/hadoop-yarn-server-common hadoop-yarn-project/hadoop-yarn/hadoop-yarn-server/hadoop-yarn-server-resourcemanager:

                  org.apache.hadoop.yarn.server.resourcemanager.webapp.TestRMWebServicesApps
                  org.apache.hadoop.yarn.server.resourcemanager.webapp.TestRMWebApp

    {color:green}+1 contrib tests{color}.  The patch passed contrib unit tests.

Test results: https://builds.apache.org/job/PreCommit-YARN-Build/1975//testReport/
Console output: https://builds.apache.org/job/PreCommit-YARN-Build/1975//console

This message is automatically generated.


======================================================================
======================================================================
    Adding comment to Jira.
======================================================================
======================================================================


Comment added.
455bf1cb91b20d61b6262ebd3b86f153397c9439 logged out


======================================================================
======================================================================
    Finished build.
======================================================================
======================================================================


Build step 'Execute shell' marked build as failure
Archiving artifacts
[description-setter] Could not determine description.
Recording test results
Email was triggered for: Failure
Sending email for trigger: Failure



###################################################################################
############################## FAILED TESTS (if any) ##############################
9 tests failed.
FAILED:  org.apache.hadoop.yarn.server.resourcemanager.webapp.TestRMWebApp.testView

Error Message:
Not supported yet.

Stack Trace:
java.lang.UnsupportedOperationException: Not supported yet.
	at org.apache.hadoop.yarn.server.resourcemanager.applicationsmanager.MockAsm$ApplicationBase.createAndGetApplicationReport(MockAsm.java:121)
	at org.apache.hadoop.yarn.server.resourcemanager.webapp.dao.AppInfo.<init>(AppInfo.java:137)
	at org.apache.hadoop.yarn.server.resourcemanager.webapp.AppsBlock.render(AppsBlock.java:82)
	at org.apache.hadoop.yarn.webapp.view.HtmlBlock.render(HtmlBlock.java:66)
	at org.apache.hadoop.yarn.webapp.view.HtmlBlock.renderPartial(HtmlBlock.java:76)
	at org.apache.hadoop.yarn.webapp.View.render(View.java:235)
	at org.apache.hadoop.yarn.webapp.view.HtmlBlock$Block.subView(HtmlBlock.java:40)
	at org.apache.hadoop.yarn.webapp.hamlet.Hamlet._(Hamlet.java:30347)
	at org.apache.hadoop.yarn.server.resourcemanager.webapp.AppsBlockWithMetrics.render(AppsBlockWithMetrics.java:29)
	at org.apache.hadoop.yarn.webapp.view.HtmlBlock.render(HtmlBlock.java:66)
	at org.apache.hadoop.yarn.webapp.view.HtmlBlock.renderPartial(HtmlBlock.java:76)
	at org.apache.hadoop.yarn.webapp.View.render(View.java:235)
	at org.apache.hadoop.yarn.webapp.view.HtmlPage$Page.subView(HtmlPage.java:49)
	at org.apache.hadoop.yarn.webapp.hamlet.HamletImpl$EImp._v(HamletImpl.java:117)
	at org.apache.hadoop.yarn.webapp.hamlet.Hamlet$TD._(Hamlet.java:845)
	at org.apache.hadoop.yarn.webapp.view.TwoColumnLayout.render(TwoColumnLayout.java:56)
	at org.apache.hadoop.yarn.webapp.view.HtmlPage.render(HtmlPage.java:82)
	at org.apache.hadoop.yarn.server.resourcemanager.webapp.TestRMWebApp.testView(TestRMWebApp.java:97)


FAILED:  org.apache.hadoop.yarn.server.resourcemanager.webapp.TestRMWebServicesApps.testApps

Error Message:
incorrect number of elements expected:<16> but was:<18>

Stack Trace:
java.lang.AssertionError: incorrect number of elements expected:<16> but was:<18>
	at org.junit.Assert.fail(Assert.java:93)
	at org.junit.Assert.failNotEquals(Assert.java:647)
	at org.junit.Assert.assertEquals(Assert.java:128)
	at org.junit.Assert.assertEquals(Assert.java:472)
	at org.apache.hadoop.yarn.server.resourcemanager.webapp.TestRMWebServicesApps.verifyAppInfo(TestRMWebServicesApps.java:1316)
	at org.apache.hadoop.yarn.server.resourcemanager.webapp.TestRMWebServicesApps.testAppsHelper(TestRMWebServicesApps.java:218)
	at org.apache.hadoop.yarn.server.resourcemanager.webapp.TestRMWebServicesApps.testApps(TestRMWebServicesApps.java:129)


FAILED:  org.apache.hadoop.yarn.server.resourcemanager.webapp.TestRMWebServicesApps.testAppsSlash

Error Message:
incorrect number of elements expected:<16> but was:<18>

Stack Trace:
java.lang.AssertionError: incorrect number of elements expected:<16> but was:<18>
	at org.junit.Assert.fail(Assert.java:93)
	at org.junit.Assert.failNotEquals(Assert.java:647)
	at org.junit.Assert.assertEquals(Assert.java:128)
	at org.junit.Assert.assertEquals(Assert.java:472)
	at org.apache.hadoop.yarn.server.resourcemanager.webapp.TestRMWebServicesApps.verifyAppInfo(TestRMWebServicesApps.java:1316)
	at org.apache.hadoop.yarn.server.resourcemanager.webapp.TestRMWebServicesApps.testAppsHelper(TestRMWebServicesApps.java:218)
	at org.apache.hadoop.yarn.server.resourcemanager.webapp.TestRMWebServicesApps.testAppsSlash(TestRMWebServicesApps.java:139)


FAILED:  org.apache.hadoop.yarn.server.resourcemanager.webapp.TestRMWebServicesApps.testAppsDefault

Error Message:
incorrect number of elements expected:<16> but was:<18>

Stack Trace:
java.lang.AssertionError: incorrect number of elements expected:<16> but was:<18>
	at org.junit.Assert.fail(Assert.java:93)
	at org.junit.Assert.failNotEquals(Assert.java:647)
	at org.junit.Assert.assertEquals(Assert.java:128)
	at org.junit.Assert.assertEquals(Assert.java:472)
	at org.apache.hadoop.yarn.server.resourcemanager.webapp.TestRMWebServicesApps.verifyAppInfo(TestRMWebServicesApps.java:1316)
	at org.apache.hadoop.yarn.server.resourcemanager.webapp.TestRMWebServicesApps.testAppsHelper(TestRMWebServicesApps.java:218)
	at org.apache.hadoop.yarn.server.resourcemanager.webapp.TestRMWebServicesApps.testAppsDefault(TestRMWebServicesApps.java:149)


FAILED:  org.apache.hadoop.yarn.server.resourcemanager.webapp.TestRMWebServicesApps.testAppsQueryState

Error Message:
incorrect number of elements expected:<16> but was:<18>

Stack Trace:
java.lang.AssertionError: incorrect number of elements expected:<16> but was:<18>
	at org.junit.Assert.fail(Assert.java:93)
	at org.junit.Assert.failNotEquals(Assert.java:647)
	at org.junit.Assert.assertEquals(Assert.java:128)
	at org.junit.Assert.assertEquals(Assert.java:472)
	at org.apache.hadoop.yarn.server.resourcemanager.webapp.TestRMWebServicesApps.verifyAppInfo(TestRMWebServicesApps.java:1316)
	at org.apache.hadoop.yarn.server.resourcemanager.webapp.TestRMWebServicesApps.testAppsQueryState(TestRMWebServicesApps.java:241)


FAILED:  org.apache.hadoop.yarn.server.resourcemanager.webapp.TestRMWebServicesApps.testAppsQueryFinalStatus

Error Message:
incorrect number of elements expected:<16> but was:<18>

Stack Trace:
java.lang.AssertionError: incorrect number of elements expected:<16> but was:<18>
	at org.junit.Assert.fail(Assert.java:93)
	at org.junit.Assert.failNotEquals(Assert.java:647)
	at org.junit.Assert.assertEquals(Assert.java:128)
	at org.junit.Assert.assertEquals(Assert.java:472)
	at org.apache.hadoop.yarn.server.resourcemanager.webapp.TestRMWebServicesApps.verifyAppInfo(TestRMWebServicesApps.java:1316)
	at org.apache.hadoop.yarn.server.resourcemanager.webapp.TestRMWebServicesApps.testAppsQueryFinalStatus(TestRMWebServicesApps.java:474)


FAILED:  org.apache.hadoop.yarn.server.resourcemanager.webapp.TestRMWebServicesApps.testSingleApp

Error Message:
incorrect number of elements expected:<16> but was:<18>

Stack Trace:
java.lang.AssertionError: incorrect number of elements expected:<16> but was:<18>
	at org.junit.Assert.fail(Assert.java:93)
	at org.junit.Assert.failNotEquals(Assert.java:647)
	at org.junit.Assert.assertEquals(Assert.java:128)
	at org.junit.Assert.assertEquals(Assert.java:472)
	at org.apache.hadoop.yarn.server.resourcemanager.webapp.TestRMWebServicesApps.verifyAppInfo(TestRMWebServicesApps.java:1316)
	at org.apache.hadoop.yarn.server.resourcemanager.webapp.TestRMWebServicesApps.testSingleAppsHelper(TestRMWebServicesApps.java:1259)
	at org.apache.hadoop.yarn.server.resourcemanager.webapp.TestRMWebServicesApps.testSingleApp(TestRMWebServicesApps.java:1151)


FAILED:  org.apache.hadoop.yarn.server.resourcemanager.webapp.TestRMWebServicesApps.testSingleAppsSlash

Error Message:
incorrect number of elements expected:<16> but was:<18>

Stack Trace:
java.lang.AssertionError: incorrect number of elements expected:<16> but was:<18>
	at org.junit.Assert.fail(Assert.java:93)
	at org.junit.Assert.failNotEquals(Assert.java:647)
	at org.junit.Assert.assertEquals(Assert.java:128)
	at org.junit.Assert.assertEquals(Assert.java:472)
	at org.apache.hadoop.yarn.server.resourcemanager.webapp.TestRMWebServicesApps.verifyAppInfo(TestRMWebServicesApps.java:1316)
	at org.apache.hadoop.yarn.server.resourcemanager.webapp.TestRMWebServicesApps.testSingleAppsHelper(TestRMWebServicesApps.java:1259)
	at org.apache.hadoop.yarn.server.resourcemanager.webapp.TestRMWebServicesApps.testSingleAppsSlash(TestRMWebServicesApps.java:1162)


FAILED:  org.apache.hadoop.yarn.server.resourcemanager.webapp.TestRMWebServicesApps.testSingleAppsDefault

Error Message:
incorrect number of elements expected:<16> but was:<18>

Stack Trace:
java.lang.AssertionError: incorrect number of elements expected:<16> but was:<18>
	at org.junit.Assert.fail(Assert.java:93)
	at org.junit.Assert.failNotEquals(Assert.java:647)
	at org.junit.Assert.assertEquals(Assert.java:128)
	at org.junit.Assert.assertEquals(Assert.java:472)
	at org.apache.hadoop.yarn.server.resourcemanager.webapp.TestRMWebServicesApps.verifyAppInfo(TestRMWebServicesApps.java:1316)
	at org.apache.hadoop.yarn.server.resourcemanager.webapp.TestRMWebServicesApps.testSingleAppsHelper(TestRMWebServicesApps.java:1259)
	at org.apache.hadoop.yarn.server.resourcemanager.webapp.TestRMWebServicesApps.testSingleAppsDefault(TestRMWebServicesApps.java:1173)



Mime
  • Unnamed multipart/mixed (inline, None, 0 bytes)
View raw message