hadoop-yarn-dev mailing list archives

Site index · List index
Message view « Date » · « Thread »
Top « Date » · « Thread »
From Apache Jenkins Server <jenk...@builds.apache.org>
Subject Failed: YARN-1214 PreCommit Build #1979
Date Fri, 20 Sep 2013 22:44:54 GMT
Jira: https://issues.apache.org/jira/browse/YARN-1214
Build: https://builds.apache.org/job/PreCommit-YARN-Build/1979/

###################################################################################
########################## LAST 60 LINES OF THE CONSOLE ###########################
[...truncated 3012 lines...]
NOP




{color:red}-1 overall{color}.  Here are the results of testing the latest attachment 
  http://issues.apache.org/jira/secure/attachment/12604327/YARN-1214.3.patch
  against trunk revision .

    {color:green}+1 @author{color}.  The patch does not contain any @author tags.

    {color:green}+1 tests included{color}.  The patch appears to include 4 new or modified
test files.

    {color:green}+1 javac{color}.  The applied patch does not increase the total number of
javac compiler warnings.

    {color:green}+1 javadoc{color}.  The javadoc tool did not generate any warning messages.

    {color:green}+1 eclipse:eclipse{color}.  The patch built with eclipse:eclipse.

    {color:green}+1 findbugs{color}.  The patch does not introduce any new Findbugs (version
1.3.9) warnings.

    {color:green}+1 release audit{color}.  The applied patch does not increase the total number
of release audit warnings.

    {color:red}-1 core tests{color}.  The patch failed these unit tests in hadoop-yarn-project/hadoop-yarn/hadoop-yarn-server/hadoop-yarn-server-resourcemanager:

                  org.apache.hadoop.yarn.server.resourcemanager.rmapp.TestRMAppTransitions

    {color:green}+1 contrib tests{color}.  The patch passed contrib unit tests.

Test results: https://builds.apache.org/job/PreCommit-YARN-Build/1979//testReport/
Console output: https://builds.apache.org/job/PreCommit-YARN-Build/1979//console

This message is automatically generated.


======================================================================
======================================================================
    Adding comment to Jira.
======================================================================
======================================================================


Comment added.
692d12a3793d015358cce67e17167d18ab51020b logged out


======================================================================
======================================================================
    Finished build.
======================================================================
======================================================================


Build step 'Execute shell' marked build as failure
Archiving artifacts
[description-setter] Could not determine description.
Recording test results
Email was triggered for: Failure
Sending email for trigger: Failure



###################################################################################
############################## FAILED TESTS (if any) ##############################
6 tests failed.
REGRESSION:  org.apache.hadoop.yarn.server.resourcemanager.rmapp.TestRMAppTransitions.testAppSuccessPath[0]

Error Message:
org.apache.hadoop.yarn.server.resourcemanager.rmapp.RMAppEvent cannot be cast to org.apache.hadoop.yarn.server.resourcemanager.rmapp.RMAppRemovedEvent

Stack Trace:
java.lang.ClassCastException: org.apache.hadoop.yarn.server.resourcemanager.rmapp.RMAppEvent
cannot be cast to org.apache.hadoop.yarn.server.resourcemanager.rmapp.RMAppRemovedEvent
	at org.apache.hadoop.yarn.server.resourcemanager.rmapp.RMAppImpl$RMAppFinishingTransition.transition(RMAppImpl.java:659)
	at org.apache.hadoop.yarn.server.resourcemanager.rmapp.RMAppImpl$RMAppFinishingTransition.transition(RMAppImpl.java:655)
	at org.apache.hadoop.yarn.state.StateMachineFactory$SingleInternalArc.doTransition(StateMachineFactory.java:362)
	at org.apache.hadoop.yarn.state.StateMachineFactory.doTransition(StateMachineFactory.java:302)
	at org.apache.hadoop.yarn.state.StateMachineFactory.access$300(StateMachineFactory.java:46)
	at org.apache.hadoop.yarn.state.StateMachineFactory$InternalStateMachine.doTransition(StateMachineFactory.java:448)
	at org.apache.hadoop.yarn.server.resourcemanager.rmapp.RMAppImpl.handle(RMAppImpl.java:571)
	at org.apache.hadoop.yarn.server.resourcemanager.rmapp.RMAppImpl.handle(RMAppImpl.java:79)
	at org.apache.hadoop.yarn.server.resourcemanager.rmapp.TestRMAppTransitions.testCreateAppFinishing(TestRMAppTransitions.java:410)
	at org.apache.hadoop.yarn.server.resourcemanager.rmapp.TestRMAppTransitions.testCreateAppFinished(TestRMAppTransitions.java:424)
	at org.apache.hadoop.yarn.server.resourcemanager.rmapp.TestRMAppTransitions.testAppSuccessPath(TestRMAppTransitions.java:468)


REGRESSION:  org.apache.hadoop.yarn.server.resourcemanager.rmapp.TestRMAppTransitions.testAppFinishingKill[0]

Error Message:
org.apache.hadoop.yarn.server.resourcemanager.rmapp.RMAppEvent cannot be cast to org.apache.hadoop.yarn.server.resourcemanager.rmapp.RMAppRemovedEvent

Stack Trace:
java.lang.ClassCastException: org.apache.hadoop.yarn.server.resourcemanager.rmapp.RMAppEvent
cannot be cast to org.apache.hadoop.yarn.server.resourcemanager.rmapp.RMAppRemovedEvent
	at org.apache.hadoop.yarn.server.resourcemanager.rmapp.RMAppImpl$RMAppFinishingTransition.transition(RMAppImpl.java:659)
	at org.apache.hadoop.yarn.server.resourcemanager.rmapp.RMAppImpl$RMAppFinishingTransition.transition(RMAppImpl.java:655)
	at org.apache.hadoop.yarn.state.StateMachineFactory$SingleInternalArc.doTransition(StateMachineFactory.java:362)
	at org.apache.hadoop.yarn.state.StateMachineFactory.doTransition(StateMachineFactory.java:302)
	at org.apache.hadoop.yarn.state.StateMachineFactory.access$300(StateMachineFactory.java:46)
	at org.apache.hadoop.yarn.state.StateMachineFactory$InternalStateMachine.doTransition(StateMachineFactory.java:448)
	at org.apache.hadoop.yarn.server.resourcemanager.rmapp.RMAppImpl.handle(RMAppImpl.java:571)
	at org.apache.hadoop.yarn.server.resourcemanager.rmapp.RMAppImpl.handle(RMAppImpl.java:79)
	at org.apache.hadoop.yarn.server.resourcemanager.rmapp.TestRMAppTransitions.testCreateAppFinishing(TestRMAppTransitions.java:410)
	at org.apache.hadoop.yarn.server.resourcemanager.rmapp.TestRMAppTransitions.testAppFinishingKill(TestRMAppTransitions.java:697)


REGRESSION:  org.apache.hadoop.yarn.server.resourcemanager.rmapp.TestRMAppTransitions.testAppFinishedFinished[0]

Error Message:
org.apache.hadoop.yarn.server.resourcemanager.rmapp.RMAppEvent cannot be cast to org.apache.hadoop.yarn.server.resourcemanager.rmapp.RMAppRemovedEvent

Stack Trace:
java.lang.ClassCastException: org.apache.hadoop.yarn.server.resourcemanager.rmapp.RMAppEvent
cannot be cast to org.apache.hadoop.yarn.server.resourcemanager.rmapp.RMAppRemovedEvent
	at org.apache.hadoop.yarn.server.resourcemanager.rmapp.RMAppImpl$RMAppFinishingTransition.transition(RMAppImpl.java:659)
	at org.apache.hadoop.yarn.server.resourcemanager.rmapp.RMAppImpl$RMAppFinishingTransition.transition(RMAppImpl.java:655)
	at org.apache.hadoop.yarn.state.StateMachineFactory$SingleInternalArc.doTransition(StateMachineFactory.java:362)
	at org.apache.hadoop.yarn.state.StateMachineFactory.doTransition(StateMachineFactory.java:302)
	at org.apache.hadoop.yarn.state.StateMachineFactory.access$300(StateMachineFactory.java:46)
	at org.apache.hadoop.yarn.state.StateMachineFactory$InternalStateMachine.doTransition(StateMachineFactory.java:448)
	at org.apache.hadoop.yarn.server.resourcemanager.rmapp.RMAppImpl.handle(RMAppImpl.java:571)
	at org.apache.hadoop.yarn.server.resourcemanager.rmapp.RMAppImpl.handle(RMAppImpl.java:79)
	at org.apache.hadoop.yarn.server.resourcemanager.rmapp.TestRMAppTransitions.testCreateAppFinishing(TestRMAppTransitions.java:410)
	at org.apache.hadoop.yarn.server.resourcemanager.rmapp.TestRMAppTransitions.testCreateAppFinished(TestRMAppTransitions.java:424)
	at org.apache.hadoop.yarn.server.resourcemanager.rmapp.TestRMAppTransitions.testAppFinishedFinished(TestRMAppTransitions.java:710)


REGRESSION:  org.apache.hadoop.yarn.server.resourcemanager.rmapp.TestRMAppTransitions.testAppSuccessPath[1]

Error Message:
org.apache.hadoop.yarn.server.resourcemanager.rmapp.RMAppEvent cannot be cast to org.apache.hadoop.yarn.server.resourcemanager.rmapp.RMAppRemovedEvent

Stack Trace:
java.lang.ClassCastException: org.apache.hadoop.yarn.server.resourcemanager.rmapp.RMAppEvent
cannot be cast to org.apache.hadoop.yarn.server.resourcemanager.rmapp.RMAppRemovedEvent
	at org.apache.hadoop.yarn.server.resourcemanager.rmapp.RMAppImpl$RMAppFinishingTransition.transition(RMAppImpl.java:659)
	at org.apache.hadoop.yarn.server.resourcemanager.rmapp.RMAppImpl$RMAppFinishingTransition.transition(RMAppImpl.java:655)
	at org.apache.hadoop.yarn.state.StateMachineFactory$SingleInternalArc.doTransition(StateMachineFactory.java:362)
	at org.apache.hadoop.yarn.state.StateMachineFactory.doTransition(StateMachineFactory.java:302)
	at org.apache.hadoop.yarn.state.StateMachineFactory.access$300(StateMachineFactory.java:46)
	at org.apache.hadoop.yarn.state.StateMachineFactory$InternalStateMachine.doTransition(StateMachineFactory.java:448)
	at org.apache.hadoop.yarn.server.resourcemanager.rmapp.RMAppImpl.handle(RMAppImpl.java:571)
	at org.apache.hadoop.yarn.server.resourcemanager.rmapp.RMAppImpl.handle(RMAppImpl.java:79)
	at org.apache.hadoop.yarn.server.resourcemanager.rmapp.TestRMAppTransitions.testCreateAppFinishing(TestRMAppTransitions.java:410)
	at org.apache.hadoop.yarn.server.resourcemanager.rmapp.TestRMAppTransitions.testCreateAppFinished(TestRMAppTransitions.java:424)
	at org.apache.hadoop.yarn.server.resourcemanager.rmapp.TestRMAppTransitions.testAppSuccessPath(TestRMAppTransitions.java:468)


REGRESSION:  org.apache.hadoop.yarn.server.resourcemanager.rmapp.TestRMAppTransitions.testAppFinishingKill[1]

Error Message:
org.apache.hadoop.yarn.server.resourcemanager.rmapp.RMAppEvent cannot be cast to org.apache.hadoop.yarn.server.resourcemanager.rmapp.RMAppRemovedEvent

Stack Trace:
java.lang.ClassCastException: org.apache.hadoop.yarn.server.resourcemanager.rmapp.RMAppEvent
cannot be cast to org.apache.hadoop.yarn.server.resourcemanager.rmapp.RMAppRemovedEvent
	at org.apache.hadoop.yarn.server.resourcemanager.rmapp.RMAppImpl$RMAppFinishingTransition.transition(RMAppImpl.java:659)
	at org.apache.hadoop.yarn.server.resourcemanager.rmapp.RMAppImpl$RMAppFinishingTransition.transition(RMAppImpl.java:655)
	at org.apache.hadoop.yarn.state.StateMachineFactory$SingleInternalArc.doTransition(StateMachineFactory.java:362)
	at org.apache.hadoop.yarn.state.StateMachineFactory.doTransition(StateMachineFactory.java:302)
	at org.apache.hadoop.yarn.state.StateMachineFactory.access$300(StateMachineFactory.java:46)
	at org.apache.hadoop.yarn.state.StateMachineFactory$InternalStateMachine.doTransition(StateMachineFactory.java:448)
	at org.apache.hadoop.yarn.server.resourcemanager.rmapp.RMAppImpl.handle(RMAppImpl.java:571)
	at org.apache.hadoop.yarn.server.resourcemanager.rmapp.RMAppImpl.handle(RMAppImpl.java:79)
	at org.apache.hadoop.yarn.server.resourcemanager.rmapp.TestRMAppTransitions.testCreateAppFinishing(TestRMAppTransitions.java:410)
	at org.apache.hadoop.yarn.server.resourcemanager.rmapp.TestRMAppTransitions.testAppFinishingKill(TestRMAppTransitions.java:697)


REGRESSION:  org.apache.hadoop.yarn.server.resourcemanager.rmapp.TestRMAppTransitions.testAppFinishedFinished[1]

Error Message:
org.apache.hadoop.yarn.server.resourcemanager.rmapp.RMAppEvent cannot be cast to org.apache.hadoop.yarn.server.resourcemanager.rmapp.RMAppRemovedEvent

Stack Trace:
java.lang.ClassCastException: org.apache.hadoop.yarn.server.resourcemanager.rmapp.RMAppEvent
cannot be cast to org.apache.hadoop.yarn.server.resourcemanager.rmapp.RMAppRemovedEvent
	at org.apache.hadoop.yarn.server.resourcemanager.rmapp.RMAppImpl$RMAppFinishingTransition.transition(RMAppImpl.java:659)
	at org.apache.hadoop.yarn.server.resourcemanager.rmapp.RMAppImpl$RMAppFinishingTransition.transition(RMAppImpl.java:655)
	at org.apache.hadoop.yarn.state.StateMachineFactory$SingleInternalArc.doTransition(StateMachineFactory.java:362)
	at org.apache.hadoop.yarn.state.StateMachineFactory.doTransition(StateMachineFactory.java:302)
	at org.apache.hadoop.yarn.state.StateMachineFactory.access$300(StateMachineFactory.java:46)
	at org.apache.hadoop.yarn.state.StateMachineFactory$InternalStateMachine.doTransition(StateMachineFactory.java:448)
	at org.apache.hadoop.yarn.server.resourcemanager.rmapp.RMAppImpl.handle(RMAppImpl.java:571)
	at org.apache.hadoop.yarn.server.resourcemanager.rmapp.RMAppImpl.handle(RMAppImpl.java:79)
	at org.apache.hadoop.yarn.server.resourcemanager.rmapp.TestRMAppTransitions.testCreateAppFinishing(TestRMAppTransitions.java:410)
	at org.apache.hadoop.yarn.server.resourcemanager.rmapp.TestRMAppTransitions.testCreateAppFinished(TestRMAppTransitions.java:424)
	at org.apache.hadoop.yarn.server.resourcemanager.rmapp.TestRMAppTransitions.testAppFinishedFinished(TestRMAppTransitions.java:710)



Mime
  • Unnamed multipart/mixed (inline, None, 0 bytes)
View raw message