hadoop-yarn-dev mailing list archives

Site index · List index
Message view « Date » · « Thread »
Top « Date » · « Thread »
From Apache Jenkins Server <jenk...@builds.apache.org>
Subject Hadoop-Yarn-trunk - Build # 348 - Still Failing
Date Mon, 30 Sep 2013 10:57:58 GMT
See https://builds.apache.org/job/Hadoop-Yarn-trunk/348/

###################################################################################
########################## LAST 60 LINES OF THE CONSOLE ###########################
[...truncated 16439 lines...]
	at $Proxy71.getApplicationReport(Unknown Source)
	at org.apache.hadoop.yarn.client.api.impl.YarnClientImpl.getApplicationReport(YarnClientImpl.java:195)
	at org.apache.hadoop.yarn.applications.distributedshell.Client.monitorApplication(Client.java:622)
	at org.apache.hadoop.yarn.applications.distributedshell.Client.run(Client.java:597)
	at org.apache.hadoop.yarn.applications.distributedshell.TestDistributedShell.testDSShell(TestDistributedShell.java:124)

java.lang.Thread.State: W

Results :

Tests in error: 
  TestDistributedShell.testDSShell:124 ยป  test timed out after 90000 millisecond...

Tests run: 2, Failures: 0, Errors: 1, Skipped: 0

[INFO] ------------------------------------------------------------------------
[INFO] Reactor Summary:
[INFO] 
[INFO] hadoop-yarn ....................................... SUCCESS [3.864s]
[INFO] hadoop-yarn-api ................................... SUCCESS [2:02.395s]
[INFO] hadoop-yarn-common ................................ SUCCESS [2:04.899s]
[INFO] hadoop-yarn-server ................................ SUCCESS [0.297s]
[INFO] hadoop-yarn-server-common ......................... SUCCESS [29.398s]
[INFO] hadoop-yarn-server-nodemanager .................... SUCCESS [3:58.149s]
[INFO] hadoop-yarn-server-web-proxy ...................... SUCCESS [14.882s]
[INFO] hadoop-yarn-server-resourcemanager ................ SUCCESS [10:43.831s]
[INFO] hadoop-yarn-server-tests .......................... SUCCESS [36.990s]
[INFO] hadoop-yarn-client ................................ SUCCESS [2:18.975s]
[INFO] hadoop-yarn-applications .......................... SUCCESS [0.107s]
[INFO] hadoop-yarn-applications-distributedshell ......... FAILURE [1:39.963s]
[INFO] hadoop-yarn-applications-unmanaged-am-launcher .... SKIPPED
[INFO] hadoop-yarn-site .................................. SKIPPED
[INFO] hadoop-yarn-project ............................... SKIPPED
[INFO] ------------------------------------------------------------------------
[INFO] BUILD FAILURE
[INFO] ------------------------------------------------------------------------
[INFO] Total time: 24:15.153s
[INFO] Finished at: Mon Sep 30 10:57:56 UTC 2013
[INFO] Final Memory: 53M/783M
[INFO] ------------------------------------------------------------------------
[ERROR] Failed to execute goal org.apache.maven.plugins:maven-surefire-plugin:2.16:test (default-test)
on project hadoop-yarn-applications-distributedshell: There are test failures.
[ERROR] 
[ERROR] Please refer to /home/jenkins/jenkins-slave/workspace/Hadoop-Yarn-trunk/trunk/hadoop-yarn-project/hadoop-yarn/hadoop-yarn-applications/hadoop-yarn-applications-distributedshell/target/surefire-reports
for the individual test results.
[ERROR] -> [Help 1]
[ERROR] 
[ERROR] To see the full stack trace of the errors, re-run Maven with the -e switch.
[ERROR] Re-run Maven using the -X switch to enable full debug logging.
[ERROR] 
[ERROR] For more information about the errors and possible solutions, please read the following
articles:
[ERROR] [Help 1] http://cwiki.apache.org/confluence/display/MAVEN/MojoFailureException
[ERROR] 
[ERROR] After correcting the problems, you can resume the build with the command
[ERROR]   mvn <goals> -rf :hadoop-yarn-applications-distributedshell
Build step 'Execute shell' marked build as failure
Archiving artifacts
Updating HDFS-5256
Sending e-mails to: yarn-dev@hadoop.apache.org
Email was triggered for: Failure
Sending email for trigger: Failure



###################################################################################
############################## FAILED TESTS (if any) ##############################
No tests ran.
Mime
  • Unnamed multipart/mixed (inline, None, 0 bytes)
View raw message