hadoop-yarn-dev mailing list archives

Site index · List index
Message view « Date » · « Thread »
Top « Date » · « Thread »
From Apache Jenkins Server <jenk...@builds.apache.org>
Subject Hadoop-Yarn-trunk - Build # 265 - Still Failing
Date Tue, 09 Jul 2013 10:55:22 GMT
See https://builds.apache.org/job/Hadoop-Yarn-trunk/265/

###################################################################################
########################## LAST 60 LINES OF THE CONSOLE ###########################
[...truncated 13871 lines...]
Running org.apache.hadoop.yarn.client.TestGetGroups
Tests run: 6, Failures: 0, Errors: 0, Skipped: 0, Time elapsed: 2.577 sec

Results :

Tests in error: 
  testNMClientNoCleanupOnStop(org.apache.hadoop.yarn.client.api.impl.TestNMClient): test timed
out after 180000 milliseconds

Tests run: 31, Failures: 0, Errors: 1, Skipped: 0

[INFO] ------------------------------------------------------------------------
[INFO] Reactor Summary:
[INFO] 
[INFO] hadoop-yarn ....................................... SUCCESS [2.742s]
[INFO] hadoop-yarn-api ................................... SUCCESS [1:40.465s]
[INFO] hadoop-yarn-common ................................ SUCCESS [2:01.718s]
[INFO] hadoop-yarn-server ................................ SUCCESS [0.110s]
[INFO] hadoop-yarn-server-common ......................... SUCCESS [28.120s]
[INFO] hadoop-yarn-server-nodemanager .................... SUCCESS [4:08.621s]
[INFO] hadoop-yarn-server-web-proxy ...................... SUCCESS [13.696s]
[INFO] hadoop-yarn-server-resourcemanager ................ SUCCESS [8:19.654s]
[INFO] hadoop-yarn-server-tests .......................... SUCCESS [34.578s]
[INFO] hadoop-yarn-client ................................ FAILURE [4:03.464s]
[INFO] hadoop-yarn-applications .......................... SKIPPED
[INFO] hadoop-yarn-applications-distributedshell ......... SKIPPED
[INFO] hadoop-yarn-applications-unmanaged-am-launcher .... SKIPPED
[INFO] hadoop-yarn-site .................................. SKIPPED
[INFO] hadoop-yarn-project ............................... SKIPPED
[INFO] ------------------------------------------------------------------------
[INFO] BUILD FAILURE
[INFO] ------------------------------------------------------------------------
[INFO] Total time: 21:34.438s
[INFO] Finished at: Tue Jul 09 10:55:18 UTC 2013
[INFO] Final Memory: 50M/741M
[INFO] ------------------------------------------------------------------------
[ERROR] Failed to execute goal org.apache.maven.plugins:maven-surefire-plugin:2.12.3:test
(default-test) on project hadoop-yarn-client: There are test failures.
[ERROR] 
[ERROR] Please refer to /home/jenkins/jenkins-slave/workspace/Hadoop-Yarn-trunk/trunk/hadoop-yarn-project/hadoop-yarn/hadoop-yarn-client/target/surefire-reports
for the individual test results.
[ERROR] -> [Help 1]
[ERROR] 
[ERROR] To see the full stack trace of the errors, re-run Maven with the -e switch.
[ERROR] Re-run Maven using the -X switch to enable full debug logging.
[ERROR] 
[ERROR] For more information about the errors and possible solutions, please read the following
articles:
[ERROR] [Help 1] http://cwiki.apache.org/confluence/display/MAVEN/MojoFailureException
[ERROR] 
[ERROR] After correcting the problems, you can resume the build with the command
[ERROR]   mvn <goals> -rf :hadoop-yarn-client
Build step 'Execute shell' marked build as failure
Archiving artifacts
Updating MAPREDUCE-5366
Updating YARN-894
Updating MAPREDUCE-5187
Updating HADOOP-9688
Updating YARN-791
Updating HDFS-4841
Sending e-mails to: yarn-dev@hadoop.apache.org
Email was triggered for: Failure
Sending email for trigger: Failure



###################################################################################
############################## FAILED TESTS (if any) ##############################
No tests ran.
Mime
  • Unnamed multipart/mixed (inline, None, 0 bytes)
View raw message