hadoop-yarn-dev mailing list archives

Site index · List index
Message view « Date » · « Thread »
Top « Date » · « Thread »
From Apache Jenkins Server <jenk...@builds.apache.org>
Subject Hadoop-Yarn-trunk - Build # 282 - Still Failing
Date Fri, 26 Jul 2013 10:55:37 GMT
See https://builds.apache.org/job/Hadoop-Yarn-trunk/282/

###################################################################################
########################## LAST 60 LINES OF THE CONSOLE ###########################
[...truncated 14047 lines...]
	at org.junit.runners.model.FrameworkMethod.invokeExplosively(FrameworkMethod.java:42)
	at org.junit.internal.runners.statements.InvokeMethod.evaluate(InvokeMethod.java:20)
	at org.junit.internal.runners.statements.FailOnTimeout$StatementThread.run(FailOnTimeout.java:62)

Running org.apache.hadoop.yarn.client.TestGetGroups
Tests run: 6, Failures: 0, Errors: 0, Skipped: 0, Time elapsed: 2.608 sec

Results :

Tests in error: 
  testNMClientNoCleanupOnStop(org.apache.hadoop.yarn.client.api.impl.TestNMClient): test timed
out after 180000 milliseconds

Tests run: 42, Failures: 0, Errors: 1, Skipped: 0

[INFO] ------------------------------------------------------------------------
[INFO] Reactor Summary:
[INFO] 
[INFO] hadoop-yarn ....................................... SUCCESS [2.805s]
[INFO] hadoop-yarn-api ................................... SUCCESS [1:52.622s]
[INFO] hadoop-yarn-common ................................ SUCCESS [2:01.943s]
[INFO] hadoop-yarn-server ................................ SUCCESS [0.111s]
[INFO] hadoop-yarn-server-common ......................... SUCCESS [26.779s]
[INFO] hadoop-yarn-server-nodemanager .................... SUCCESS [3:47.022s]
[INFO] hadoop-yarn-server-web-proxy ...................... SUCCESS [13.137s]
[INFO] hadoop-yarn-server-resourcemanager ................ SUCCESS [8:44.138s]
[INFO] hadoop-yarn-server-tests .......................... SUCCESS [36.782s]
[INFO] hadoop-yarn-client ................................ FAILURE [4:22.908s]
[INFO] hadoop-yarn-applications .......................... SKIPPED
[INFO] hadoop-yarn-applications-distributedshell ......... SKIPPED
[INFO] hadoop-yarn-applications-unmanaged-am-launcher .... SKIPPED
[INFO] hadoop-yarn-site .................................. SKIPPED
[INFO] hadoop-yarn-project ............................... SKIPPED
[INFO] ------------------------------------------------------------------------
[INFO] BUILD FAILURE
[INFO] ------------------------------------------------------------------------
[INFO] Total time: 22:09.507s
[INFO] Finished at: Fri Jul 26 10:55:34 UTC 2013
[INFO] Final Memory: 47M/788M
[INFO] ------------------------------------------------------------------------
[ERROR] Failed to execute goal org.apache.maven.plugins:maven-surefire-plugin:2.12.3:test
(default-test) on project hadoop-yarn-client: There are test failures.
[ERROR] 
[ERROR] Please refer to /home/jenkins/jenkins-slave/workspace/Hadoop-Yarn-trunk/trunk/hadoop-yarn-project/hadoop-yarn/hadoop-yarn-client/target/surefire-reports
for the individual test results.
[ERROR] -> [Help 1]
[ERROR] 
[ERROR] To see the full stack trace of the errors, re-run Maven with the -e switch.
[ERROR] Re-run Maven using the -X switch to enable full debug logging.
[ERROR] 
[ERROR] For more information about the errors and possible solutions, please read the following
articles:
[ERROR] [Help 1] http://cwiki.apache.org/confluence/display/MAVEN/MojoFailureException
[ERROR] 
[ERROR] After correcting the problems, you can resume the build with the command
[ERROR]   mvn <goals> -rf :hadoop-yarn-client
Build step 'Execute shell' marked build as failure
Archiving artifacts
Error updating JIRA issues. Saving issues for next build.
com.atlassian.jira.rpc.exception.RemoteAuthenticationException: Attempt to log in user 'hudson'
failed. The maximum number of failed login attempts has been reached. Please log into the
application through the web interface to reset the number of failed login attempts.
Sending e-mails to: yarn-dev@hadoop.apache.org
Email was triggered for: Failure
Sending email for trigger: Failure



###################################################################################
############################## FAILED TESTS (if any) ##############################
No tests ran.
Mime
  • Unnamed multipart/mixed (inline, None, 0 bytes)
View raw message