hadoop-yarn-dev mailing list archives

Site index · List index
Message view « Date » · « Thread »
Top « Date » · « Thread »
From Apache Jenkins Server <jenk...@builds.apache.org>
Subject Build failed in Jenkins: Hadoop-Yarn-trunk #230
Date Tue, 04 Jun 2013 10:50:27 GMT
See <https://builds.apache.org/job/Hadoop-Yarn-trunk/230/changes>

Changes:

[vinodkv] YARN-755. Renamed AllocateResponse.reboot to AllocateResponse.resync. Contributed
by Bikas Saha.

[vinodkv] YARN-756. Move Preemption* records to yarn.api where they really belong. Contributed
by Jian He.

[vinodkv] YARN-635 and MAPREDUCE-5301. Bug fix as the committed patch ended up being stale.

[vinodkv] YARN-635. Renamed YarnRemoteException to YarnException. Contributed by Siddharth
Seth.
MAPREDUCE-5301. Updated MR code to work with YARN-635 changes of renaming YarnRemoteException
to YarnException. Contributed by Siddharth Seth

[jlowe] MAPREDUCE-5283. Over 10 different tests have near identical implementations of AppContext.
Committed by Sandy Ryza

[vinodkv] YARN-757. Changed TestRMRestart to use the default scheduler to avoid test failures.
Contributed by Bikas Saha.

[suresh] HADOOP-9481. Move from trunk to release 2.1.0 section

[jlowe] Move HADOOP-9287 in CHANGES.txt after committing to branch-2

[vinodkv] YARN-748. Moved BuilderUtils from yarn-common to yarn-server-common for eventual
retirement. Contributed by Jian He.
MAPREDUCE-5297. Updated MR App since BuilderUtils is no longer public after YARN-748. Contributed
by Jian He.

[acmurthy] MAPREDUCE-5245. Added back constants to JobConf to fix incompatibilities. Contributed
by Zhijie Shen.

[acmurthy] YARN-726. Fix queue & finish time fields in web-ui for ResourceManager. Contributed
by Mayank Bansal.

[acmurthy] MAPREDUCE-5300. Moved to INCOMPATIBLE CHANGES section in CHANGES.txt.

[acmurthy] MAPREDUCE-5299. Changed jira number for the commit in CHANGES.txt.

[acmurthy] MAPREDUCE-5300. Fix backward incompatibility for o.a.h.mapreduce.filecache.DistributedCache.
Contributed by Zhijie Shen.

[acmurthy] MAPREDUCE-5296. Fix backward incompatibility for JobControl by adding the omitted
addJob. Contributed by Zhijie Shen.

[acmurthy] MAPREDUCE-5220. Fix backward incompatibility for TaskCompletionEvent by adding
back setTaskID. Contributed by Zhijie Shen.

[jeagles] HADOOP-9614. smart-test-patch.sh hangs for new version of patch (2.7.1) (Ravi Prakash
via jeagles)

[acmurthy] YARN-398. Make it possible to specify hard locality constraints in resource requests
for CapacityScheduler. Contributed by Arun C. Murthy.

[cmccabe] Remove extra code that code erroneously committed in HDFS-3934 (cmccabe)

[tucu] YARN-326. Add multi-resource scheduling to the fair scheduler. (sandyr via tucu)

[cmccabe] Add needed file for HDFS-3934 (cmccabe)

[cmccabe] HDFS-3934. duplicative dfs_hosts entries handled wrong. (cmccabe)

[tomwhite] MAPREDUCE-5036. Default shuffle handler port should not be 8080. Contributed by
Sandy Ryza.

[jlowe] Move HADOOP-9397 to 2.1.0-beta after merging it into branch-2.

[jlowe] MAPREDUCE-5268. Improve history server startup performance. Contributed by Karthik
Kambatla

------------------------------------------
[...truncated 13262 lines...]
Generating <https://builds.apache.org/job/Hadoop-Yarn-trunk/ws/trunk/hadoop-yarn-project/hadoop-yarn/hadoop-yarn-server/hadoop-yarn-server-resourcemanager/target/org/apache/hadoop/yarn/server/resourcemanager/scheduler/event//package-use.html...>
Generating <https://builds.apache.org/job/Hadoop-Yarn-trunk/ws/trunk/hadoop-yarn-project/hadoop-yarn/hadoop-yarn-server/hadoop-yarn-server-resourcemanager/target/org/apache/hadoop/yarn/server/resourcemanager/scheduler/fair//package-use.html...>
Generating <https://builds.apache.org/job/Hadoop-Yarn-trunk/ws/trunk/hadoop-yarn-project/hadoop-yarn/hadoop-yarn-server/hadoop-yarn-server-resourcemanager/target/org/apache/hadoop/yarn/server/resourcemanager/scheduler/fair/policies//package-use.html...>
Generating <https://builds.apache.org/job/Hadoop-Yarn-trunk/ws/trunk/hadoop-yarn-project/hadoop-yarn/hadoop-yarn-server/hadoop-yarn-server-resourcemanager/target/org/apache/hadoop/yarn/server/resourcemanager/scheduler/fifo//package-use.html...>
Generating <https://builds.apache.org/job/Hadoop-Yarn-trunk/ws/trunk/hadoop-yarn-project/hadoop-yarn/hadoop-yarn-server/hadoop-yarn-server-resourcemanager/target/org/apache/hadoop/yarn/server/resourcemanager/security//package-use.html...>
Generating <https://builds.apache.org/job/Hadoop-Yarn-trunk/ws/trunk/hadoop-yarn-project/hadoop-yarn/hadoop-yarn-server/hadoop-yarn-server-resourcemanager/target/org/apache/hadoop/yarn/server/resourcemanager/security/authorize//package-use.html...>
Generating <https://builds.apache.org/job/Hadoop-Yarn-trunk/ws/trunk/hadoop-yarn-project/hadoop-yarn/hadoop-yarn-server/hadoop-yarn-server-resourcemanager/target/org/apache/hadoop/yarn/server/resourcemanager/webapp//package-use.html...>
Generating <https://builds.apache.org/job/Hadoop-Yarn-trunk/ws/trunk/hadoop-yarn-project/hadoop-yarn/hadoop-yarn-server/hadoop-yarn-server-resourcemanager/target/org/apache/hadoop/yarn/server/resourcemanager/webapp/dao//package-use.html...>
Building index for all the packages and classes...
Generating <https://builds.apache.org/job/Hadoop-Yarn-trunk/ws/trunk/hadoop-yarn-project/hadoop-yarn/hadoop-yarn-server/hadoop-yarn-server-resourcemanager/target/overview-tree.html...>
Generating <https://builds.apache.org/job/Hadoop-Yarn-trunk/ws/trunk/hadoop-yarn-project/hadoop-yarn/hadoop-yarn-server/hadoop-yarn-server-resourcemanager/target/index-all.html...>
Generating <https://builds.apache.org/job/Hadoop-Yarn-trunk/ws/trunk/hadoop-yarn-project/hadoop-yarn/hadoop-yarn-server/hadoop-yarn-server-resourcemanager/target/deprecated-list.html...>
Building index for all classes...
Generating <https://builds.apache.org/job/Hadoop-Yarn-trunk/ws/trunk/hadoop-yarn-project/hadoop-yarn/hadoop-yarn-server/hadoop-yarn-server-resourcemanager/target/allclasses-frame.html...>
Generating <https://builds.apache.org/job/Hadoop-Yarn-trunk/ws/trunk/hadoop-yarn-project/hadoop-yarn/hadoop-yarn-server/hadoop-yarn-server-resourcemanager/target/allclasses-noframe.html...>
Generating <https://builds.apache.org/job/Hadoop-Yarn-trunk/ws/trunk/hadoop-yarn-project/hadoop-yarn/hadoop-yarn-server/hadoop-yarn-server-resourcemanager/target/index.html...>
Generating <https://builds.apache.org/job/Hadoop-Yarn-trunk/ws/trunk/hadoop-yarn-project/hadoop-yarn/hadoop-yarn-server/hadoop-yarn-server-resourcemanager/target/overview-summary.html...>
Generating <https://builds.apache.org/job/Hadoop-Yarn-trunk/ws/trunk/hadoop-yarn-project/hadoop-yarn/hadoop-yarn-server/hadoop-yarn-server-resourcemanager/target/help-doc.html...>
Generating <https://builds.apache.org/job/Hadoop-Yarn-trunk/ws/trunk/hadoop-yarn-project/hadoop-yarn/hadoop-yarn-server/hadoop-yarn-server-resourcemanager/target/stylesheet.css...>
[INFO] Building jar: <https://builds.apache.org/job/Hadoop-Yarn-trunk/ws/trunk/hadoop-yarn-project/hadoop-yarn/hadoop-yarn-server/hadoop-yarn-server-resourcemanager/target/hadoop-yarn-server-resourcemanager-3.0.0-SNAPSHOT-javadoc.jar>
[INFO] 
[INFO] --- maven-checkstyle-plugin:2.6:checkstyle (default-cli) @ hadoop-yarn-server-resourcemanager
---
[INFO] 
[INFO] There are 9832 checkstyle errors.
[WARNING] Unable to locate Source XRef to link to - DISABLED
[INFO] 
[INFO] --- findbugs-maven-plugin:2.3.2:findbugs (default-cli) @ hadoop-yarn-server-resourcemanager
---
[INFO] ****** FindBugsMojo execute *******
[INFO] canGenerate is true
[INFO] ****** FindBugsMojo executeFindbugs *******
[INFO] Temp File is <https://builds.apache.org/job/Hadoop-Yarn-trunk/ws/trunk/hadoop-yarn-project/hadoop-yarn/hadoop-yarn-server/hadoop-yarn-server-resourcemanager/target/findbugsTemp.xml>
[INFO] Fork Value is true
[INFO] xmlOutput is true
[INFO]                                                                         
[INFO] ------------------------------------------------------------------------
[INFO] Building hadoop-yarn-server-tests 3.0.0-SNAPSHOT
[INFO] ------------------------------------------------------------------------
[WARNING] The POM for org.eclipse.m2e:lifecycle-mapping:jar:1.0.0 is missing, no dependency
information available
[WARNING] Failed to retrieve plugin descriptor for org.eclipse.m2e:lifecycle-mapping:1.0.0:
Plugin org.eclipse.m2e:lifecycle-mapping:1.0.0 or one of its dependencies could not be resolved:
Failed to read artifact descriptor for org.eclipse.m2e:lifecycle-mapping:jar:1.0.0
[INFO] 
[INFO] --- maven-clean-plugin:2.4.1:clean (default-clean) @ hadoop-yarn-server-tests ---
[INFO] Deleting <https://builds.apache.org/job/Hadoop-Yarn-trunk/ws/trunk/hadoop-yarn-project/hadoop-yarn/hadoop-yarn-server/hadoop-yarn-server-tests/target>
[INFO] 
[INFO] --- maven-antrun-plugin:1.6:run (create-testdirs) @ hadoop-yarn-server-tests ---
[INFO] Executing tasks

main:
    [mkdir] Created dir: <https://builds.apache.org/job/Hadoop-Yarn-trunk/ws/trunk/hadoop-yarn-project/hadoop-yarn/hadoop-yarn-server/hadoop-yarn-server-tests/target/test-dir>
[INFO] Executed tasks
[INFO] 
[INFO] --- maven-resources-plugin:2.2:resources (default-resources) @ hadoop-yarn-server-tests
---
[INFO] Using default encoding to copy filtered resources.
[INFO] 
[INFO] --- maven-compiler-plugin:2.5.1:compile (default-compile) @ hadoop-yarn-server-tests
---
[INFO] No sources to compile
[INFO] 
[INFO] --- maven-resources-plugin:2.2:testResources (default-testResources) @ hadoop-yarn-server-tests
---
[INFO] Using default encoding to copy filtered resources.
[INFO] 
[INFO] --- maven-compiler-plugin:2.5.1:testCompile (default-testCompile) @ hadoop-yarn-server-tests
---
[INFO] Compiling 4 source files to <https://builds.apache.org/job/Hadoop-Yarn-trunk/ws/trunk/hadoop-yarn-project/hadoop-yarn/hadoop-yarn-server/hadoop-yarn-server-tests/target/test-classes>
[INFO] 
[INFO] --- maven-jar-plugin:2.3.1:test-jar (default) @ hadoop-yarn-server-tests ---
[INFO] Building jar: <https://builds.apache.org/job/Hadoop-Yarn-trunk/ws/trunk/hadoop-yarn-project/hadoop-yarn/hadoop-yarn-server/hadoop-yarn-server-tests/target/hadoop-yarn-server-tests-3.0.0-SNAPSHOT-tests.jar>
[INFO] 
[INFO] --- maven-surefire-plugin:2.12.3:test (default-test) @ hadoop-yarn-server-tests ---
[INFO] Surefire report directory: <https://builds.apache.org/job/Hadoop-Yarn-trunk/ws/trunk/hadoop-yarn-project/hadoop-yarn/hadoop-yarn-server/hadoop-yarn-server-tests/target/surefire-reports>

-------------------------------------------------------
 T E S T S
-------------------------------------------------------

-------------------------------------------------------
 T E S T S
-------------------------------------------------------
Running org.apache.hadoop.yarn.server.TestContainerManagerSecurity
Tests run: 2, Failures: 0, Errors: 0, Skipped: 0, Time elapsed: 47.139 sec
Running org.apache.hadoop.yarn.server.TestRMNMSecretKeys
Tests run: 1, Failures: 0, Errors: 0, Skipped: 0, Time elapsed: 2.219 sec
Running org.apache.hadoop.yarn.server.TestDiskFailures
Tests run: 3, Failures: 0, Errors: 0, Skipped: 0, Time elapsed: 18.047 sec

Results :

Tests run: 6, Failures: 0, Errors: 0, Skipped: 0

[INFO] 
[INFO] --- maven-jar-plugin:2.3.1:jar (default-jar) @ hadoop-yarn-server-tests ---
[WARNING] JAR will be empty - no content was marked for inclusion!
[INFO] Building jar: <https://builds.apache.org/job/Hadoop-Yarn-trunk/ws/trunk/hadoop-yarn-project/hadoop-yarn/hadoop-yarn-server/hadoop-yarn-server-tests/target/hadoop-yarn-server-tests-3.0.0-SNAPSHOT.jar>
[INFO] 
[INFO] --- maven-source-plugin:2.1.2:jar-no-fork (hadoop-java-sources) @ hadoop-yarn-server-tests
---
[INFO] No sources in project. Archive not created.
[INFO] 
[INFO] --- maven-source-plugin:2.1.2:test-jar-no-fork (hadoop-java-sources) @ hadoop-yarn-server-tests
---
[INFO] Building jar: <https://builds.apache.org/job/Hadoop-Yarn-trunk/ws/trunk/hadoop-yarn-project/hadoop-yarn/hadoop-yarn-server/hadoop-yarn-server-tests/target/hadoop-yarn-server-tests-3.0.0-SNAPSHOT-test-sources.jar>
[INFO] 
[INFO] --- maven-enforcer-plugin:1.0:enforce (dist-enforce) @ hadoop-yarn-server-tests ---
[INFO] 
[INFO] --- maven-site-plugin:3.0:attach-descriptor (attach-descriptor) @ hadoop-yarn-server-tests
---
[INFO] 
[INFO] --- maven-javadoc-plugin:2.8.1:jar (module-javadocs) @ hadoop-yarn-server-tests ---
[INFO] Building jar: <https://builds.apache.org/job/Hadoop-Yarn-trunk/ws/trunk/hadoop-yarn-project/hadoop-yarn/hadoop-yarn-server/hadoop-yarn-server-tests/target/hadoop-yarn-server-tests-3.0.0-SNAPSHOT-javadoc.jar>
[INFO] 
[INFO] --- maven-checkstyle-plugin:2.6:checkstyle (default-cli) @ hadoop-yarn-server-tests
---
[INFO] 
[INFO] --- findbugs-maven-plugin:2.3.2:findbugs (default-cli) @ hadoop-yarn-server-tests ---
[INFO] ****** FindBugsMojo execute *******
[INFO] canGenerate is false
[INFO]                                                                         
[INFO] ------------------------------------------------------------------------
[INFO] Building hadoop-yarn-client 3.0.0-SNAPSHOT
[INFO] ------------------------------------------------------------------------
[WARNING] The POM for org.eclipse.m2e:lifecycle-mapping:jar:1.0.0 is missing, no dependency
information available
[WARNING] Failed to retrieve plugin descriptor for org.eclipse.m2e:lifecycle-mapping:1.0.0:
Plugin org.eclipse.m2e:lifecycle-mapping:1.0.0 or one of its dependencies could not be resolved:
Failed to read artifact descriptor for org.eclipse.m2e:lifecycle-mapping:jar:1.0.0
[INFO] 
[INFO] --- maven-clean-plugin:2.4.1:clean (default-clean) @ hadoop-yarn-client ---
[INFO] Deleting <https://builds.apache.org/job/Hadoop-Yarn-trunk/ws/trunk/hadoop-yarn-project/hadoop-yarn/hadoop-yarn-client/target>
[INFO] 
[INFO] --- maven-antrun-plugin:1.6:run (create-testdirs) @ hadoop-yarn-client ---
[INFO] Executing tasks

main:
    [mkdir] Created dir: <https://builds.apache.org/job/Hadoop-Yarn-trunk/ws/trunk/hadoop-yarn-project/hadoop-yarn/hadoop-yarn-client/target/test-dir>
[INFO] Executed tasks
[INFO] 
[INFO] --- maven-resources-plugin:2.2:resources (default-resources) @ hadoop-yarn-client ---
[INFO] Using default encoding to copy filtered resources.
[INFO] 
[INFO] --- maven-compiler-plugin:2.5.1:compile (default-compile) @ hadoop-yarn-client ---
[INFO] Compiling 12 source files to <https://builds.apache.org/job/Hadoop-Yarn-trunk/ws/trunk/hadoop-yarn-project/hadoop-yarn/hadoop-yarn-client/target/classes>
[INFO] 
[INFO] --- maven-resources-plugin:2.2:testResources (default-testResources) @ hadoop-yarn-client
---
[INFO] Using default encoding to copy filtered resources.
[INFO] 
[INFO] --- maven-compiler-plugin:2.5.1:testCompile (default-testCompile) @ hadoop-yarn-client
---
[INFO] Compiling 8 source files to <https://builds.apache.org/job/Hadoop-Yarn-trunk/ws/trunk/hadoop-yarn-project/hadoop-yarn/hadoop-yarn-client/target/test-classes>
[INFO] 
[INFO] --- maven-surefire-plugin:2.12.3:test (default-test) @ hadoop-yarn-client ---
[INFO] Surefire report directory: <https://builds.apache.org/job/Hadoop-Yarn-trunk/ws/trunk/hadoop-yarn-project/hadoop-yarn/hadoop-yarn-client/target/surefire-reports>

-------------------------------------------------------
 T E S T S
-------------------------------------------------------

-------------------------------------------------------
 T E S T S
-------------------------------------------------------
Running org.apache.hadoop.yarn.client.TestNMClient
Tests run: 1, Failures: 0, Errors: 0, Skipped: 0, Time elapsed: 23.681 sec
Running org.apache.hadoop.yarn.client.cli.TestYarnCLI
Tests run: 8, Failures: 0, Errors: 0, Skipped: 0, Time elapsed: 1.1 sec
Running org.apache.hadoop.yarn.client.TestAMRMClient
Tests run: 3, Failures: 0, Errors: 0, Skipped: 0, Time elapsed: 11.137 sec
Running org.apache.hadoop.yarn.client.TestAMRMClientAsync
Tests run: 3, Failures: 0, Errors: 0, Skipped: 0, Time elapsed: 0.584 sec
Running org.apache.hadoop.yarn.client.TestYarnClient
Tests run: 5, Failures: 0, Errors: 0, Skipped: 0, Time elapsed: 5.625 sec
Running org.apache.hadoop.yarn.client.TestGetGroups
Tests run: 6, Failures: 0, Errors: 0, Skipped: 0, Time elapsed: 2.527 sec
Running org.apache.hadoop.yarn.client.TestNMClientAsync
Tests run: 2, Failures: 1, Errors: 0, Skipped: 0, Time elapsed: 0.772 sec <<< FAILURE!
testNMClientAsync(org.apache.hadoop.yarn.client.TestNMClientAsync)  Time elapsed: 487 sec
 <<< FAILURE!
junit.framework.AssertionFailedError: Completed container is not removed expected:<0>
but was:<4>
	at junit.framework.Assert.fail(Assert.java:50)
	at junit.framework.Assert.failNotEquals(Assert.java:287)
	at junit.framework.Assert.assertEquals(Assert.java:67)
	at junit.framework.Assert.assertEquals(Assert.java:199)
	at org.apache.hadoop.yarn.client.TestNMClientAsync.testNMClientAsync(TestNMClientAsync.java:124)
	at sun.reflect.NativeMethodAccessorImpl.invoke0(Native Method)
	at sun.reflect.NativeMethodAccessorImpl.invoke(NativeMethodAccessorImpl.java:39)
	at sun.reflect.DelegatingMethodAccessorImpl.invoke(DelegatingMethodAccessorImpl.java:25)
	at java.lang.reflect.Method.invoke(Method.java:597)
	at org.junit.runners.model.FrameworkMethod$1.runReflectiveCall(FrameworkMethod.java:45)
	at org.junit.internal.runners.model.ReflectiveCallable.run(ReflectiveCallable.java:15)
	at org.junit.runners.model.FrameworkMethod.invokeExplosively(FrameworkMethod.java:42)
	at org.junit.internal.runners.statements.InvokeMethod.evaluate(InvokeMethod.java:20)
	at org.junit.internal.runners.statements.FailOnTimeout$StatementThread.run(FailOnTimeout.java:62)


Results :

Failed tests:   testNMClientAsync(org.apache.hadoop.yarn.client.TestNMClientAsync): Completed
container is not removed expected:<0> but was:<4>

Tests run: 28, Failures: 1, Errors: 0, Skipped: 0

[INFO] ------------------------------------------------------------------------
[INFO] Reactor Summary:
[INFO] 
[INFO] hadoop-yarn ....................................... SUCCESS [2.881s]
[INFO] hadoop-yarn-api ................................... SUCCESS [1:49.464s]
[INFO] hadoop-yarn-common ................................ SUCCESS [1:51.515s]
[INFO] hadoop-yarn-server ................................ SUCCESS [0.157s]
[INFO] hadoop-yarn-server-common ......................... SUCCESS [21.990s]
[INFO] hadoop-yarn-server-nodemanager .................... SUCCESS [4:07.096s]
[INFO] hadoop-yarn-server-web-proxy ...................... SUCCESS [13.401s]
[INFO] hadoop-yarn-server-resourcemanager ................ SUCCESS [5:18.168s]
[INFO] hadoop-yarn-server-tests .......................... SUCCESS [1:08.580s]
[INFO] hadoop-yarn-client ................................ FAILURE [47.650s]
[INFO] hadoop-yarn-applications .......................... SKIPPED
[INFO] hadoop-yarn-applications-distributedshell ......... SKIPPED
[INFO] hadoop-yarn-applications-unmanaged-am-launcher .... SKIPPED
[INFO] hadoop-yarn-site .................................. SKIPPED
[INFO] hadoop-yarn-project ............................... SKIPPED
[INFO] ------------------------------------------------------------------------
[INFO] BUILD FAILURE
[INFO] ------------------------------------------------------------------------
[INFO] Total time: 15:42.154s
[INFO] Finished at: Tue Jun 04 10:50:19 UTC 2013
[INFO] Final Memory: 50M/757M
[INFO] ------------------------------------------------------------------------
[ERROR] Failed to execute goal org.apache.maven.plugins:maven-surefire-plugin:2.12.3:test
(default-test) on project hadoop-yarn-client: There are test failures.
[ERROR] 
[ERROR] Please refer to <https://builds.apache.org/job/Hadoop-Yarn-trunk/ws/trunk/hadoop-yarn-project/hadoop-yarn/hadoop-yarn-client/target/surefire-reports>
for the individual test results.
[ERROR] -> [Help 1]
[ERROR] 
[ERROR] To see the full stack trace of the errors, re-run Maven with the -e switch.
[ERROR] Re-run Maven using the -X switch to enable full debug logging.
[ERROR] 
[ERROR] For more information about the errors and possible solutions, please read the following
articles:
[ERROR] [Help 1] http://cwiki.apache.org/confluence/display/MAVEN/MojoFailureException
[ERROR] 
[ERROR] After correcting the problems, you can resume the build with the command
[ERROR]   mvn <goals> -rf :hadoop-yarn-client
Build step 'Execute shell' marked build as failure
Archiving artifacts
Updating YARN-326
Updating MAPREDUCE-5036
Updating HADOOP-9397
Updating MAPREDUCE-5301
Updating HADOOP-9481
Updating MAPREDUCE-5300
Updating MAPREDUCE-5220
Updating YARN-755
Updating YARN-748
Updating YARN-756
Updating YARN-726
Updating HADOOP-9287
Updating YARN-635
Updating HADOOP-9614
Updating YARN-757
Updating MAPREDUCE-5299
Updating HDFS-3934
Updating MAPREDUCE-5297
Updating MAPREDUCE-5245
Updating MAPREDUCE-5296
Updating MAPREDUCE-5283
Updating YARN-398
Updating MAPREDUCE-5268

Mime
View raw message