hadoop-yarn-dev mailing list archives

Site index · List index
Message view « Date » · « Thread »
Top « Date » · « Thread »
From Apache Jenkins Server <jenk...@builds.apache.org>
Subject Failed: YARN-814 PreCommit Build #1381
Date Sat, 22 Jun 2013 01:17:47 GMT
Jira: https://issues.apache.org/jira/browse/YARN-814
Build: https://builds.apache.org/job/PreCommit-YARN-Build/1381/

###################################################################################
########################## LAST 60 LINES OF THE CONSOLE ###########################
[...truncated 3313 lines...]
{color:red}-1 overall{color}.  Here are the results of testing the latest attachment 
  http://issues.apache.org/jira/secure/attachment/12589215/YARN-814.1.patch
  against trunk revision .

    {color:green}+1 @author{color}.  The patch does not contain any @author tags.

    {color:green}+1 tests included{color}.  The patch appears to include 2 new or modified
test files.

    {color:green}+1 javac{color}.  The applied patch does not increase the total number of
javac compiler warnings.

    {color:green}+1 javadoc{color}.  The javadoc tool did not generate any warning messages.

    {color:green}+1 eclipse:eclipse{color}.  The patch built with eclipse:eclipse.

    {color:green}+1 findbugs{color}.  The patch does not introduce any new Findbugs (version
1.3.9) warnings.

    {color:green}+1 release audit{color}.  The applied patch does not increase the total number
of release audit warnings.

    {color:red}-1 core tests{color}.  The patch failed these unit tests in hadoop-yarn-project/hadoop-yarn/hadoop-yarn-server/hadoop-yarn-server-nodemanager
hadoop-yarn-project/hadoop-yarn/hadoop-yarn-server/hadoop-yarn-server-tests:

                  org.apache.hadoop.yarn.server.nodemanager.containermanager.launcher.TestContainerLaunch
                  org.apache.hadoop.yarn.server.nodemanager.TestNodeManagerResync
                  org.apache.hadoop.yarn.server.nodemanager.TestNodeManagerShutdown
                  org.apache.hadoop.yarn.server.TestRMNMSecretKeys
                  org.apache.hadoop.yarn.server.TestContainerManagerSecurity
                  org.apache.hadoop.yarn.server.TestDiskFailures

    {color:green}+1 contrib tests{color}.  The patch passed contrib unit tests.

Test results: https://builds.apache.org/job/PreCommit-YARN-Build/1381//testReport/
Console output: https://builds.apache.org/job/PreCommit-YARN-Build/1381//console

This message is automatically generated.


======================================================================
======================================================================
    Adding comment to Jira.
======================================================================
======================================================================


Comment added.
06ccccec93b87f2164ade0e14c84b64a9461cf8e logged out


======================================================================
======================================================================
    Finished build.
======================================================================
======================================================================


Build step 'Execute shell' marked build as failure
Archiving artifacts
[description-setter] Could not determine description.
Recording test results
Email was triggered for: Failure
Sending email for trigger: Failure



###################################################################################
############################## FAILED TESTS (if any) ##############################
10 tests failed.
FAILED:  org.apache.hadoop.yarn.server.nodemanager.containermanager.launcher.TestContainerLaunch.testInvalidSymlinkDiagnostics

Error Message:
null

Stack Trace:
junit.framework.AssertionFailedError
	at junit.framework.Assert.fail(Assert.java:48)
	at junit.framework.Assert.assertTrue(Assert.java:20)
	at junit.framework.Assert.assertTrue(Assert.java:27)
	at org.apache.hadoop.yarn.server.nodemanager.containermanager.launcher.TestContainerLaunch.testInvalidSymlinkDiagnostics(TestContainerLaunch.java:202)
	at sun.reflect.NativeMethodAccessorImpl.invoke0(Native Method)
	at sun.reflect.NativeMethodAccessorImpl.invoke(NativeMethodAccessorImpl.java:39)
	at sun.reflect.DelegatingMethodAccessorImpl.invoke(DelegatingMethodAccessorImpl.java:25)
	at java.lang.reflect.Method.invoke(Method.java:597)
	at org.junit.runners.model.FrameworkMethod$1.runReflectiveCall(FrameworkMethod.java:45)
	at org.junit.internal.runners.model.ReflectiveCallable.run(ReflectiveCallable.java:15)
	at org.junit.runners.model.FrameworkMethod.invokeExplosively(FrameworkMethod.java:42)
	at org.junit.internal.runners.statements.InvokeMethod.evaluate(InvokeMethod.java:20)
	at org.junit.internal.runners.statements.FailOnTimeout$StatementThread.run(FailOnTimeout.java:62)


FAILED:  org.apache.hadoop.yarn.server.TestContainerManagerSecurity.testContainerManagerWithSecurityEnabled

Error Message:
java.lang.RuntimeException: java.lang.RuntimeException: java.lang.ClassNotFoundException:
Class org.apache.hadoop.yarn.server.resourcemanager.resource.DefaultResourceCalculator not
found

Stack Trace:
org.apache.hadoop.yarn.exceptions.YarnRuntimeException: java.lang.RuntimeException: java.lang.RuntimeException:
java.lang.ClassNotFoundException: Class org.apache.hadoop.yarn.server.resourcemanager.resource.DefaultResourceCalculator
not found
	at org.apache.hadoop.yarn.server.MiniYARNCluster$ResourceManagerWrapper.serviceStart(MiniYARNCluster.java:225)
	at org.apache.hadoop.service.AbstractService.start(AbstractService.java:193)
	at org.apache.hadoop.service.CompositeService.serviceStart(CompositeService.java:101)
	at org.apache.hadoop.service.AbstractService.start(AbstractService.java:193)
	at org.apache.hadoop.yarn.server.TestContainerManagerSecurity.testContainerManager(TestContainerManagerSecurity.java:90)
	at org.apache.hadoop.yarn.server.TestContainerManagerSecurity.testContainerManagerWithSecurityEnabled(TestContainerManagerSecurity.java:73)
	at sun.reflect.NativeMethodAccessorImpl.invoke0(Native Method)
	at sun.reflect.NativeMethodAccessorImpl.invoke(NativeMethodAccessorImpl.java:39)
	at sun.reflect.DelegatingMethodAccessorImpl.invoke(DelegatingMethodAccessorImpl.java:25)
	at java.lang.reflect.Method.invoke(Method.java:597)
	at org.junit.runners.model.FrameworkMethod$1.runReflectiveCall(FrameworkMethod.java:45)
	at org.junit.internal.runners.model.ReflectiveCallable.run(ReflectiveCallable.java:15)
	at org.junit.runners.model.FrameworkMethod.invokeExplosively(FrameworkMethod.java:42)
	at org.junit.internal.runners.statements.InvokeMethod.evaluate(InvokeMethod.java:20)
	at org.junit.internal.runners.statements.FailOnTimeout$StatementThread.run(FailOnTimeout.java:62)
Caused by: java.lang.RuntimeException: java.lang.RuntimeException: java.lang.ClassNotFoundException:
Class org.apache.hadoop.yarn.server.resourcemanager.resource.DefaultResourceCalculator not
found
	at org.apache.hadoop.conf.Configuration.getClass(Configuration.java:1753)
	at org.apache.hadoop.yarn.server.resourcemanager.scheduler.capacity.CapacitySchedulerConfiguration.getResourceCalculator(CapacitySchedulerConfiguration.java:333)
	at org.apache.hadoop.yarn.server.resourcemanager.scheduler.capacity.CapacityScheduler.reinitialize(CapacityScheduler.java:257)
	at org.apache.hadoop.yarn.server.resourcemanager.ResourceManager.serviceInit(ResourceManager.java:235)
	at org.apache.hadoop.service.AbstractService.init(AbstractService.java:163)
	at org.apache.hadoop.yarn.server.MiniYARNCluster$ResourceManagerWrapper.serviceStart(MiniYARNCluster.java:205)
	... 14 more
Caused by: java.lang.RuntimeException: java.lang.ClassNotFoundException: Class org.apache.hadoop.yarn.server.resourcemanager.resource.DefaultResourceCalculator
not found
	at org.apache.hadoop.conf.Configuration.getClass(Configuration.java:1721)
	at org.apache.hadoop.conf.Configuration.getClass(Configuration.java:1745)
	... 19 more
Caused by: java.lang.ClassNotFoundException: Class org.apache.hadoop.yarn.server.resourcemanager.resource.DefaultResourceCalculator
not found
	at org.apache.hadoop.conf.Configuration.getClassByName(Configuration.java:1625)
	at org.apache.hadoop.conf.Configuration.getClass(Configuration.java:1719)
	... 20 more


FAILED:  org.apache.hadoop.yarn.server.TestContainerManagerSecurity.testContainerManagerWithSecurityDisabled

Error Message:
java.lang.RuntimeException: java.lang.RuntimeException: java.lang.ClassNotFoundException:
Class org.apache.hadoop.yarn.server.resourcemanager.resource.DefaultResourceCalculator not
found

Stack Trace:
org.apache.hadoop.yarn.exceptions.YarnRuntimeException: java.lang.RuntimeException: java.lang.RuntimeException:
java.lang.ClassNotFoundException: Class org.apache.hadoop.yarn.server.resourcemanager.resource.DefaultResourceCalculator
not found
	at org.apache.hadoop.yarn.server.MiniYARNCluster$ResourceManagerWrapper.serviceStart(MiniYARNCluster.java:225)
	at org.apache.hadoop.service.AbstractService.start(AbstractService.java:193)
	at org.apache.hadoop.service.CompositeService.serviceStart(CompositeService.java:101)
	at org.apache.hadoop.service.AbstractService.start(AbstractService.java:193)
	at org.apache.hadoop.yarn.server.TestContainerManagerSecurity.testContainerManager(TestContainerManagerSecurity.java:90)
	at org.apache.hadoop.yarn.server.TestContainerManagerSecurity.testContainerManagerWithSecurityDisabled(TestContainerManagerSecurity.java:80)
	at sun.reflect.NativeMethodAccessorImpl.invoke0(Native Method)
	at sun.reflect.NativeMethodAccessorImpl.invoke(NativeMethodAccessorImpl.java:39)
	at sun.reflect.DelegatingMethodAccessorImpl.invoke(DelegatingMethodAccessorImpl.java:25)
	at java.lang.reflect.Method.invoke(Method.java:597)
	at org.junit.runners.model.FrameworkMethod$1.runReflectiveCall(FrameworkMethod.java:45)
	at org.junit.internal.runners.model.ReflectiveCallable.run(ReflectiveCallable.java:15)
	at org.junit.runners.model.FrameworkMethod.invokeExplosively(FrameworkMethod.java:42)
	at org.junit.internal.runners.statements.InvokeMethod.evaluate(InvokeMethod.java:20)
	at org.junit.internal.runners.statements.FailOnTimeout$StatementThread.run(FailOnTimeout.java:62)
Caused by: java.lang.RuntimeException: java.lang.RuntimeException: java.lang.ClassNotFoundException:
Class org.apache.hadoop.yarn.server.resourcemanager.resource.DefaultResourceCalculator not
found
	at org.apache.hadoop.conf.Configuration.getClass(Configuration.java:1753)
	at org.apache.hadoop.yarn.server.resourcemanager.scheduler.capacity.CapacitySchedulerConfiguration.getResourceCalculator(CapacitySchedulerConfiguration.java:333)
	at org.apache.hadoop.yarn.server.resourcemanager.scheduler.capacity.CapacityScheduler.reinitialize(CapacityScheduler.java:257)
	at org.apache.hadoop.yarn.server.resourcemanager.ResourceManager.serviceInit(ResourceManager.java:235)
	at org.apache.hadoop.service.AbstractService.init(AbstractService.java:163)
	at org.apache.hadoop.yarn.server.MiniYARNCluster$ResourceManagerWrapper.serviceStart(MiniYARNCluster.java:205)
	... 14 more
Caused by: java.lang.RuntimeException: java.lang.ClassNotFoundException: Class org.apache.hadoop.yarn.server.resourcemanager.resource.DefaultResourceCalculator
not found
	at org.apache.hadoop.conf.Configuration.getClass(Configuration.java:1721)
	at org.apache.hadoop.conf.Configuration.getClass(Configuration.java:1745)
	... 19 more
Caused by: java.lang.ClassNotFoundException: Class org.apache.hadoop.yarn.server.resourcemanager.resource.DefaultResourceCalculator
not found
	at org.apache.hadoop.conf.Configuration.getClassByName(Configuration.java:1625)
	at org.apache.hadoop.conf.Configuration.getClass(Configuration.java:1719)
	... 20 more


FAILED:  org.apache.hadoop.yarn.server.TestDiskFailures.testLocalDirsFailures

Error Message:
java.lang.RuntimeException: java.lang.RuntimeException: java.lang.ClassNotFoundException:
Class org.apache.hadoop.yarn.server.resourcemanager.resource.DefaultResourceCalculator not
found

Stack Trace:
org.apache.hadoop.yarn.exceptions.YarnRuntimeException: java.lang.RuntimeException: java.lang.RuntimeException:
java.lang.ClassNotFoundException: Class org.apache.hadoop.yarn.server.resourcemanager.resource.DefaultResourceCalculator
not found
	at org.apache.hadoop.yarn.server.MiniYARNCluster$ResourceManagerWrapper.serviceStart(MiniYARNCluster.java:225)
	at org.apache.hadoop.service.AbstractService.start(AbstractService.java:193)
	at org.apache.hadoop.service.CompositeService.serviceStart(CompositeService.java:101)
	at org.apache.hadoop.service.AbstractService.start(AbstractService.java:193)
	at org.apache.hadoop.yarn.server.TestDiskFailures.testDirsFailures(TestDiskFailures.java:166)
	at org.apache.hadoop.yarn.server.TestDiskFailures.testLocalDirsFailures(TestDiskFailures.java:99)
	at sun.reflect.NativeMethodAccessorImpl.invoke0(Native Method)
	at sun.reflect.NativeMethodAccessorImpl.invoke(NativeMethodAccessorImpl.java:39)
	at sun.reflect.DelegatingMethodAccessorImpl.invoke(DelegatingMethodAccessorImpl.java:25)
	at java.lang.reflect.Method.invoke(Method.java:597)
	at org.junit.runners.model.FrameworkMethod$1.runReflectiveCall(FrameworkMethod.java:45)
	at org.junit.internal.runners.model.ReflectiveCallable.run(ReflectiveCallable.java:15)
	at org.junit.runners.model.FrameworkMethod.invokeExplosively(FrameworkMethod.java:42)
	at org.junit.internal.runners.statements.InvokeMethod.evaluate(InvokeMethod.java:20)
	at org.junit.runners.ParentRunner.runLeaf(ParentRunner.java:263)
	at org.junit.runners.BlockJUnit4ClassRunner.runChild(BlockJUnit4ClassRunner.java:68)
	at org.junit.runners.BlockJUnit4ClassRunner.runChild(BlockJUnit4ClassRunner.java:47)
	at org.junit.runners.ParentRunner$3.run(ParentRunner.java:231)
	at org.junit.runners.ParentRunner$1.schedule(ParentRunner.java:60)
	at org.junit.runners.ParentRunner.runChildren(ParentRunner.java:229)
	at org.junit.runners.ParentRunner.access$000(ParentRunner.java:50)
	at org.junit.runners.ParentRunner$2.evaluate(ParentRunner.java:222)
	at org.junit.internal.runners.statements.RunBefores.evaluate(RunBefores.java:28)
	at org.junit.internal.runners.statements.RunAfters.evaluate(RunAfters.java:30)
	at org.junit.runners.ParentRunner.run(ParentRunner.java:300)
	at org.apache.maven.surefire.junit4.JUnit4Provider.execute(JUnit4Provider.java:252)
	at org.apache.maven.surefire.junit4.JUnit4Provider.executeTestSet(JUnit4Provider.java:141)
	at org.apache.maven.surefire.junit4.JUnit4Provider.invoke(JUnit4Provider.java:112)
	at sun.reflect.NativeMethodAccessorImpl.invoke0(Native Method)
	at sun.reflect.NativeMethodAccessorImpl.invoke(NativeMethodAccessorImpl.java:39)
	at sun.reflect.DelegatingMethodAccessorImpl.invoke(DelegatingMethodAccessorImpl.java:25)
	at java.lang.reflect.Method.invoke(Method.java:597)
	at org.apache.maven.surefire.util.ReflectionUtils.invokeMethodWithArray(ReflectionUtils.java:189)
	at org.apache.maven.surefire.booter.ProviderFactory$ProviderProxy.invoke(ProviderFactory.java:165)
	at org.apache.maven.surefire.booter.ProviderFactory.invokeProvider(ProviderFactory.java:85)
	at org.apache.maven.surefire.booter.ForkedBooter.runSuitesInProcess(ForkedBooter.java:115)
	at org.apache.maven.surefire.booter.ForkedBooter.main(ForkedBooter.java:75)
Caused by: java.lang.RuntimeException: java.lang.RuntimeException: java.lang.ClassNotFoundException:
Class org.apache.hadoop.yarn.server.resourcemanager.resource.DefaultResourceCalculator not
found
	at org.apache.hadoop.conf.Configuration.getClass(Configuration.java:1753)
	at org.apache.hadoop.yarn.server.resourcemanager.scheduler.capacity.CapacitySchedulerConfiguration.getResourceCalculator(CapacitySchedulerConfiguration.java:333)
	at org.apache.hadoop.yarn.server.resourcemanager.scheduler.capacity.CapacityScheduler.reinitialize(CapacityScheduler.java:257)
	at org.apache.hadoop.yarn.server.resourcemanager.ResourceManager.serviceInit(ResourceManager.java:235)
	at org.apache.hadoop.service.AbstractService.init(AbstractService.java:163)
	at org.apache.hadoop.yarn.server.MiniYARNCluster$ResourceManagerWrapper.serviceStart(MiniYARNCluster.java:205)
	... 36 more
Caused by: java.lang.RuntimeException: java.lang.ClassNotFoundException: Class org.apache.hadoop.yarn.server.resourcemanager.resource.DefaultResourceCalculator
not found
	at org.apache.hadoop.conf.Configuration.getClass(Configuration.java:1721)
	at org.apache.hadoop.conf.Configuration.getClass(Configuration.java:1745)
	... 41 more
Caused by: java.lang.ClassNotFoundException: Class org.apache.hadoop.yarn.server.resourcemanager.resource.DefaultResourceCalculator
not found
	at org.apache.hadoop.conf.Configuration.getClassByName(Configuration.java:1625)
	at org.apache.hadoop.conf.Configuration.getClass(Configuration.java:1719)
	... 42 more


FAILED:  org.apache.hadoop.yarn.server.TestDiskFailures.testLogDirsFailures

Error Message:
java.lang.RuntimeException: java.lang.RuntimeException: java.lang.ClassNotFoundException:
Class org.apache.hadoop.yarn.server.resourcemanager.resource.DefaultResourceCalculator not
found

Stack Trace:
org.apache.hadoop.yarn.exceptions.YarnRuntimeException: java.lang.RuntimeException: java.lang.RuntimeException:
java.lang.ClassNotFoundException: Class org.apache.hadoop.yarn.server.resourcemanager.resource.DefaultResourceCalculator
not found
	at org.apache.hadoop.yarn.server.MiniYARNCluster$ResourceManagerWrapper.serviceStart(MiniYARNCluster.java:225)
	at org.apache.hadoop.service.AbstractService.start(AbstractService.java:193)
	at org.apache.hadoop.service.CompositeService.serviceStart(CompositeService.java:101)
	at org.apache.hadoop.service.AbstractService.start(AbstractService.java:193)
	at org.apache.hadoop.yarn.server.TestDiskFailures.testDirsFailures(TestDiskFailures.java:166)
	at org.apache.hadoop.yarn.server.TestDiskFailures.testLogDirsFailures(TestDiskFailures.java:111)
	at sun.reflect.NativeMethodAccessorImpl.invoke0(Native Method)
	at sun.reflect.NativeMethodAccessorImpl.invoke(NativeMethodAccessorImpl.java:39)
	at sun.reflect.DelegatingMethodAccessorImpl.invoke(DelegatingMethodAccessorImpl.java:25)
	at java.lang.reflect.Method.invoke(Method.java:597)
	at org.junit.runners.model.FrameworkMethod$1.runReflectiveCall(FrameworkMethod.java:45)
	at org.junit.internal.runners.model.ReflectiveCallable.run(ReflectiveCallable.java:15)
	at org.junit.runners.model.FrameworkMethod.invokeExplosively(FrameworkMethod.java:42)
	at org.junit.internal.runners.statements.InvokeMethod.evaluate(InvokeMethod.java:20)
	at org.junit.runners.ParentRunner.runLeaf(ParentRunner.java:263)
	at org.junit.runners.BlockJUnit4ClassRunner.runChild(BlockJUnit4ClassRunner.java:68)
	at org.junit.runners.BlockJUnit4ClassRunner.runChild(BlockJUnit4ClassRunner.java:47)
	at org.junit.runners.ParentRunner$3.run(ParentRunner.java:231)
	at org.junit.runners.ParentRunner$1.schedule(ParentRunner.java:60)
	at org.junit.runners.ParentRunner.runChildren(ParentRunner.java:229)
	at org.junit.runners.ParentRunner.access$000(ParentRunner.java:50)
	at org.junit.runners.ParentRunner$2.evaluate(ParentRunner.java:222)
	at org.junit.internal.runners.statements.RunBefores.evaluate(RunBefores.java:28)
	at org.junit.internal.runners.statements.RunAfters.evaluate(RunAfters.java:30)
	at org.junit.runners.ParentRunner.run(ParentRunner.java:300)
	at org.apache.maven.surefire.junit4.JUnit4Provider.execute(JUnit4Provider.java:252)
	at org.apache.maven.surefire.junit4.JUnit4Provider.executeTestSet(JUnit4Provider.java:141)
	at org.apache.maven.surefire.junit4.JUnit4Provider.invoke(JUnit4Provider.java:112)
	at sun.reflect.NativeMethodAccessorImpl.invoke0(Native Method)
	at sun.reflect.NativeMethodAccessorImpl.invoke(NativeMethodAccessorImpl.java:39)
	at sun.reflect.DelegatingMethodAccessorImpl.invoke(DelegatingMethodAccessorImpl.java:25)
	at java.lang.reflect.Method.invoke(Method.java:597)
	at org.apache.maven.surefire.util.ReflectionUtils.invokeMethodWithArray(ReflectionUtils.java:189)
	at org.apache.maven.surefire.booter.ProviderFactory$ProviderProxy.invoke(ProviderFactory.java:165)
	at org.apache.maven.surefire.booter.ProviderFactory.invokeProvider(ProviderFactory.java:85)
	at org.apache.maven.surefire.booter.ForkedBooter.runSuitesInProcess(ForkedBooter.java:115)
	at org.apache.maven.surefire.booter.ForkedBooter.main(ForkedBooter.java:75)
Caused by: java.lang.RuntimeException: java.lang.RuntimeException: java.lang.ClassNotFoundException:
Class org.apache.hadoop.yarn.server.resourcemanager.resource.DefaultResourceCalculator not
found
	at org.apache.hadoop.conf.Configuration.getClass(Configuration.java:1753)
	at org.apache.hadoop.yarn.server.resourcemanager.scheduler.capacity.CapacitySchedulerConfiguration.getResourceCalculator(CapacitySchedulerConfiguration.java:333)
	at org.apache.hadoop.yarn.server.resourcemanager.scheduler.capacity.CapacityScheduler.reinitialize(CapacityScheduler.java:257)
	at org.apache.hadoop.yarn.server.resourcemanager.ResourceManager.serviceInit(ResourceManager.java:235)
	at org.apache.hadoop.service.AbstractService.init(AbstractService.java:163)
	at org.apache.hadoop.yarn.server.MiniYARNCluster$ResourceManagerWrapper.serviceStart(MiniYARNCluster.java:205)
	... 36 more
Caused by: java.lang.RuntimeException: java.lang.ClassNotFoundException: Class org.apache.hadoop.yarn.server.resourcemanager.resource.DefaultResourceCalculator
not found
	at org.apache.hadoop.conf.Configuration.getClass(Configuration.java:1721)
	at org.apache.hadoop.conf.Configuration.getClass(Configuration.java:1745)
	... 41 more
Caused by: java.lang.ClassNotFoundException: Class org.apache.hadoop.yarn.server.resourcemanager.resource.DefaultResourceCalculator
not found
	at org.apache.hadoop.conf.Configuration.getClassByName(Configuration.java:1625)
	at org.apache.hadoop.conf.Configuration.getClass(Configuration.java:1719)
	... 42 more


FAILED:  org.apache.hadoop.yarn.server.TestDiskFailures.testDirFailuresOnStartup

Error Message:
No such file or directory

Stack Trace:
java.io.IOException: No such file or directory
	at java.io.UnixFileSystem.createFileExclusively(Native Method)
	at java.io.File.createNewFile(File.java:883)
	at org.apache.hadoop.yarn.server.TestDiskFailures.prepareDirToFail(TestDiskFailures.java:274)
	at org.apache.hadoop.yarn.server.TestDiskFailures.testDirFailuresOnStartup(TestDiskFailures.java:130)
	at sun.reflect.NativeMethodAccessorImpl.invoke0(Native Method)
	at sun.reflect.NativeMethodAccessorImpl.invoke(NativeMethodAccessorImpl.java:39)
	at sun.reflect.DelegatingMethodAccessorImpl.invoke(DelegatingMethodAccessorImpl.java:25)
	at java.lang.reflect.Method.invoke(Method.java:597)
	at org.junit.runners.model.FrameworkMethod$1.runReflectiveCall(FrameworkMethod.java:45)
	at org.junit.internal.runners.model.ReflectiveCallable.run(ReflectiveCallable.java:15)
	at org.junit.runners.model.FrameworkMethod.invokeExplosively(FrameworkMethod.java:42)
	at org.junit.internal.runners.statements.InvokeMethod.evaluate(InvokeMethod.java:20)
	at org.junit.runners.ParentRunner.runLeaf(ParentRunner.java:263)
	at org.junit.runners.BlockJUnit4ClassRunner.runChild(BlockJUnit4ClassRunner.java:68)
	at org.junit.runners.BlockJUnit4ClassRunner.runChild(BlockJUnit4ClassRunner.java:47)
	at org.junit.runners.ParentRunner$3.run(ParentRunner.java:231)
	at org.junit.runners.ParentRunner$1.schedule(ParentRunner.java:60)
	at org.junit.runners.ParentRunner.runChildren(ParentRunner.java:229)
	at org.junit.runners.ParentRunner.access$000(ParentRunner.java:50)
	at org.junit.runners.ParentRunner$2.evaluate(ParentRunner.java:222)
	at org.junit.internal.runners.statements.RunBefores.evaluate(RunBefores.java:28)
	at org.junit.internal.runners.statements.RunAfters.evaluate(RunAfters.java:30)
	at org.junit.runners.ParentRunner.run(ParentRunner.java:300)
	at org.apache.maven.surefire.junit4.JUnit4Provider.execute(JUnit4Provider.java:252)
	at org.apache.maven.surefire.junit4.JUnit4Provider.executeTestSet(JUnit4Provider.java:141)
	at org.apache.maven.surefire.junit4.JUnit4Provider.invoke(JUnit4Provider.java:112)
	at sun.reflect.NativeMethodAccessorImpl.invoke0(Native Method)
	at sun.reflect.NativeMethodAccessorImpl.invoke(NativeMethodAccessorImpl.java:39)
	at sun.reflect.DelegatingMethodAccessorImpl.invoke(DelegatingMethodAccessorImpl.java:25)
	at java.lang.reflect.Method.invoke(Method.java:597)
	at org.apache.maven.surefire.util.ReflectionUtils.invokeMethodWithArray(ReflectionUtils.java:189)
	at org.apache.maven.surefire.booter.ProviderFactory$ProviderProxy.invoke(ProviderFactory.java:165)
	at org.apache.maven.surefire.booter.ProviderFactory.invokeProvider(ProviderFactory.java:85)
	at org.apache.maven.surefire.booter.ForkedBooter.runSuitesInProcess(ForkedBooter.java:115)
	at org.apache.maven.surefire.booter.ForkedBooter.main(ForkedBooter.java:75)


FAILED:  org.apache.hadoop.yarn.server.TestRMNMSecretKeys.testNMUpdation

Error Message:
java.lang.RuntimeException: java.lang.ClassNotFoundException: Class org.apache.hadoop.yarn.server.resourcemanager.resource.DefaultResourceCalculator
not found

Stack Trace:
java.lang.RuntimeException: java.lang.RuntimeException: java.lang.ClassNotFoundException:
Class org.apache.hadoop.yarn.server.resourcemanager.resource.DefaultResourceCalculator not
found
	at org.apache.hadoop.conf.Configuration.getClass(Configuration.java:1753)
	at org.apache.hadoop.yarn.server.resourcemanager.scheduler.capacity.CapacitySchedulerConfiguration.getResourceCalculator(CapacitySchedulerConfiguration.java:333)
	at org.apache.hadoop.yarn.server.resourcemanager.scheduler.capacity.CapacityScheduler.reinitialize(CapacityScheduler.java:257)
	at org.apache.hadoop.yarn.server.resourcemanager.ResourceManager.serviceInit(ResourceManager.java:235)
	at org.apache.hadoop.service.AbstractService.init(AbstractService.java:163)
	at org.apache.hadoop.yarn.server.TestRMNMSecretKeys.validateRMNMKeyExchange(TestRMNMSecretKeys.java:68)
	at org.apache.hadoop.yarn.server.TestRMNMSecretKeys.testNMUpdation(TestRMNMSecretKeys.java:43)
	at sun.reflect.NativeMethodAccessorImpl.invoke0(Native Method)
	at sun.reflect.NativeMethodAccessorImpl.invoke(NativeMethodAccessorImpl.java:39)
	at sun.reflect.DelegatingMethodAccessorImpl.invoke(DelegatingMethodAccessorImpl.java:25)
	at java.lang.reflect.Method.invoke(Method.java:597)
	at org.junit.runners.model.FrameworkMethod$1.runReflectiveCall(FrameworkMethod.java:45)
	at org.junit.internal.runners.model.ReflectiveCallable.run(ReflectiveCallable.java:15)
	at org.junit.runners.model.FrameworkMethod.invokeExplosively(FrameworkMethod.java:42)
	at org.junit.internal.runners.statements.InvokeMethod.evaluate(InvokeMethod.java:20)
	at org.junit.internal.runners.statements.FailOnTimeout$StatementThread.run(FailOnTimeout.java:62)
Caused by: java.lang.RuntimeException: java.lang.ClassNotFoundException: Class org.apache.hadoop.yarn.server.resourcemanager.resource.DefaultResourceCalculator
not found
	at org.apache.hadoop.conf.Configuration.getClass(Configuration.java:1721)
	at org.apache.hadoop.conf.Configuration.getClass(Configuration.java:1745)
	... 15 more
Caused by: java.lang.ClassNotFoundException: Class org.apache.hadoop.yarn.server.resourcemanager.resource.DefaultResourceCalculator
not found
	at org.apache.hadoop.conf.Configuration.getClassByName(Configuration.java:1625)
	at org.apache.hadoop.conf.Configuration.getClass(Configuration.java:1719)
	... 16 more


FAILED:  org.apache.hadoop.yarn.server.nodemanager.TestNodeManagerResync.testKillContainersOnResync

Error Message:
Failed on local exception: java.io.IOException: java.io.IOException: Server asks us to fall
back to SIMPLE auth, but this client is configured to only allow secure connections.; Host
Details : local host is: "asf007.sp2.ygridcore.net/67.195.138.25"; destination host is: "127.0.0.1":12345;


Stack Trace:
java.io.IOException: Failed on local exception: java.io.IOException: java.io.IOException:
Server asks us to fall back to SIMPLE auth, but this client is configured to only allow secure
connections.; Host Details : local host is: "asf007.sp2.ygridcore.net/67.195.138.25"; destination
host is: "127.0.0.1":12345; 
	at org.apache.hadoop.net.NetUtils.wrapException(NetUtils.java:764)
	at org.apache.hadoop.ipc.Client.call(Client.java:1318)
	at org.apache.hadoop.ipc.Client.call(Client.java:1266)
	at org.apache.hadoop.ipc.ProtobufRpcEngine$Invoker.invoke(ProtobufRpcEngine.java:206)
	at $Proxy26.startContainer(Unknown Source)
	at org.apache.hadoop.yarn.api.impl.pb.client.ContainerManagementProtocolPBClientImpl.startContainer(ContainerManagementProtocolPBClientImpl.java:110)
	at org.apache.hadoop.yarn.server.nodemanager.TestNodeManagerShutdown.startContainer(TestNodeManagerShutdown.java:213)
	at org.apache.hadoop.yarn.server.nodemanager.TestNodeManagerResync.testKillContainersOnResync(TestNodeManagerResync.java:91)
	at sun.reflect.NativeMethodAccessorImpl.invoke0(Native Method)
	at sun.reflect.NativeMethodAccessorImpl.invoke(NativeMethodAccessorImpl.java:39)
	at sun.reflect.DelegatingMethodAccessorImpl.invoke(DelegatingMethodAccessorImpl.java:25)
	at java.lang.reflect.Method.invoke(Method.java:597)
	at org.junit.runners.model.FrameworkMethod$1.runReflectiveCall(FrameworkMethod.java:45)
	at org.junit.internal.runners.model.ReflectiveCallable.run(ReflectiveCallable.java:15)
	at org.junit.runners.model.FrameworkMethod.invokeExplosively(FrameworkMethod.java:42)
	at org.junit.internal.runners.statements.InvokeMethod.evaluate(InvokeMethod.java:20)
	at org.junit.internal.runners.statements.RunBefores.evaluate(RunBefores.java:28)
	at org.junit.internal.runners.statements.RunAfters.evaluate(RunAfters.java:30)
	at org.junit.runners.ParentRunner.runLeaf(ParentRunner.java:263)
	at org.junit.runners.BlockJUnit4ClassRunner.runChild(BlockJUnit4ClassRunner.java:68)
	at org.junit.runners.BlockJUnit4ClassRunner.runChild(BlockJUnit4ClassRunner.java:47)
	at org.junit.runners.ParentRunner$3.run(ParentRunner.java:231)
	at org.junit.runners.ParentRunner$1.schedule(ParentRunner.java:60)
	at org.junit.runners.ParentRunner.runChildren(ParentRunner.java:229)
	at org.junit.runners.ParentRunner.access$000(ParentRunner.java:50)
	at org.junit.runners.ParentRunner$2.evaluate(ParentRunner.java:222)
	at org.junit.runners.ParentRunner.run(ParentRunner.java:300)
	at org.apache.maven.surefire.junit4.JUnit4Provider.execute(JUnit4Provider.java:252)
	at org.apache.maven.surefire.junit4.JUnit4Provider.executeTestSet(JUnit4Provider.java:141)
	at org.apache.maven.surefire.junit4.JUnit4Provider.invoke(JUnit4Provider.java:112)
	at sun.reflect.NativeMethodAccessorImpl.invoke0(Native Method)
	at sun.reflect.NativeMethodAccessorImpl.invoke(NativeMethodAccessorImpl.java:39)
	at sun.reflect.DelegatingMethodAccessorImpl.invoke(DelegatingMethodAccessorImpl.java:25)
	at java.lang.reflect.Method.invoke(Method.java:597)
	at org.apache.maven.surefire.util.ReflectionUtils.invokeMethodWithArray(ReflectionUtils.java:189)
	at org.apache.maven.surefire.booter.ProviderFactory$ProviderProxy.invoke(ProviderFactory.java:165)
	at org.apache.maven.surefire.booter.ProviderFactory.invokeProvider(ProviderFactory.java:85)
	at org.apache.maven.surefire.booter.ForkedBooter.runSuitesInProcess(ForkedBooter.java:115)
	at org.apache.maven.surefire.booter.ForkedBooter.main(ForkedBooter.java:75)
Caused by: java.io.IOException: java.io.IOException: Server asks us to fall back to SIMPLE
auth, but this client is configured to only allow secure connections.
	at org.apache.hadoop.ipc.Client$Connection$1.run(Client.java:589)
	at java.security.AccessController.doPrivileged(Native Method)
	at javax.security.auth.Subject.doAs(Subject.java:396)
	at org.apache.hadoop.security.UserGroupInformation.doAs(UserGroupInformation.java:1489)
	at org.apache.hadoop.ipc.Client$Connection.handleSaslConnectionFailure(Client.java:552)
	at org.apache.hadoop.ipc.Client$Connection.setupIOstreams(Client.java:635)
	at org.apache.hadoop.ipc.Client$Connection.access$2200(Client.java:258)
	at org.apache.hadoop.ipc.Client.getConnection(Client.java:1367)
	at org.apache.hadoop.ipc.Client.call(Client.java:1285)
	... 37 more
Caused by: java.io.IOException: Server asks us to fall back to SIMPLE auth, but this client
is configured to only allow secure connections.
	at org.apache.hadoop.security.SaslRpcClient.saslConnect(SaslRpcClient.java:250)
	at org.apache.hadoop.ipc.Client$Connection.setupSaslConnection(Client.java:464)
	at org.apache.hadoop.ipc.Client$Connection.access$1500(Client.java:258)
	at org.apache.hadoop.ipc.Client$Connection$2.run(Client.java:628)
	at org.apache.hadoop.ipc.Client$Connection$2.run(Client.java:625)
	at java.security.AccessController.doPrivileged(Native Method)
	at javax.security.auth.Subject.doAs(Subject.java:396)
	at org.apache.hadoop.security.UserGroupInformation.doAs(UserGroupInformation.java:1489)
	at org.apache.hadoop.ipc.Client$Connection.setupIOstreams(Client.java:624)
	... 40 more


FAILED:  org.apache.hadoop.yarn.server.nodemanager.TestNodeManagerResync.testBlockNewContainerRequestsOnStartAndResync

Error Message:
Metrics source JvmMetrics already exists!

Stack Trace:
org.apache.hadoop.metrics2.MetricsException: Metrics source JvmMetrics already exists!
	at org.apache.hadoop.metrics2.lib.DefaultMetricsSystem.newSourceName(DefaultMetricsSystem.java:134)
	at org.apache.hadoop.metrics2.lib.DefaultMetricsSystem.sourceName(DefaultMetricsSystem.java:115)
	at org.apache.hadoop.metrics2.impl.MetricsSystemImpl.register(MetricsSystemImpl.java:217)
	at org.apache.hadoop.metrics2.source.JvmMetrics.create(JvmMetrics.java:79)
	at org.apache.hadoop.yarn.server.nodemanager.metrics.NodeManagerMetrics.create(NodeManagerMetrics.java:49)
	at org.apache.hadoop.yarn.server.nodemanager.metrics.NodeManagerMetrics.create(NodeManagerMetrics.java:45)
	at org.apache.hadoop.yarn.server.nodemanager.NodeManager.<init>(NodeManager.java:76)
	at org.apache.hadoop.yarn.server.nodemanager.TestNodeManagerResync$TestNodeManager2.<init>(TestNodeManagerResync.java:194)
	at org.apache.hadoop.yarn.server.nodemanager.TestNodeManagerResync.testBlockNewContainerRequestsOnStartAndResync(TestNodeManagerResync.java:114)
	at sun.reflect.NativeMethodAccessorImpl.invoke0(Native Method)
	at sun.reflect.NativeMethodAccessorImpl.invoke(NativeMethodAccessorImpl.java:39)
	at sun.reflect.DelegatingMethodAccessorImpl.invoke(DelegatingMethodAccessorImpl.java:25)
	at java.lang.reflect.Method.invoke(Method.java:597)
	at org.junit.runners.model.FrameworkMethod$1.runReflectiveCall(FrameworkMethod.java:45)
	at org.junit.internal.runners.model.ReflectiveCallable.run(ReflectiveCallable.java:15)
	at org.junit.runners.model.FrameworkMethod.invokeExplosively(FrameworkMethod.java:42)
	at org.junit.internal.runners.statements.InvokeMethod.evaluate(InvokeMethod.java:20)
	at org.junit.internal.runners.statements.RunBefores.evaluate(RunBefores.java:28)
	at org.junit.internal.runners.statements.RunAfters.evaluate(RunAfters.java:30)
	at org.junit.runners.ParentRunner.runLeaf(ParentRunner.java:263)
	at org.junit.runners.BlockJUnit4ClassRunner.runChild(BlockJUnit4ClassRunner.java:68)
	at org.junit.runners.BlockJUnit4ClassRunner.runChild(BlockJUnit4ClassRunner.java:47)
	at org.junit.runners.ParentRunner$3.run(ParentRunner.java:231)
	at org.junit.runners.ParentRunner$1.schedule(ParentRunner.java:60)
	at org.junit.runners.ParentRunner.runChildren(ParentRunner.java:229)
	at org.junit.runners.ParentRunner.access$000(ParentRunner.java:50)
	at org.junit.runners.ParentRunner$2.evaluate(ParentRunner.java:222)
	at org.junit.runners.ParentRunner.run(ParentRunner.java:300)
	at org.apache.maven.surefire.junit4.JUnit4Provider.execute(JUnit4Provider.java:252)
	at org.apache.maven.surefire.junit4.JUnit4Provider.executeTestSet(JUnit4Provider.java:141)
	at org.apache.maven.surefire.junit4.JUnit4Provider.invoke(JUnit4Provider.java:112)
	at sun.reflect.NativeMethodAccessorImpl.invoke0(Native Method)
	at sun.reflect.NativeMethodAccessorImpl.invoke(NativeMethodAccessorImpl.java:39)
	at sun.reflect.DelegatingMethodAccessorImpl.invoke(DelegatingMethodAccessorImpl.java:25)
	at java.lang.reflect.Method.invoke(Method.java:597)
	at org.apache.maven.surefire.util.ReflectionUtils.invokeMethodWithArray(ReflectionUtils.java:189)
	at org.apache.maven.surefire.booter.ProviderFactory$ProviderProxy.invoke(ProviderFactory.java:165)
	at org.apache.maven.surefire.booter.ProviderFactory.invokeProvider(ProviderFactory.java:85)
	at org.apache.maven.surefire.booter.ForkedBooter.runSuitesInProcess(ForkedBooter.java:115)
	at org.apache.maven.surefire.booter.ForkedBooter.main(ForkedBooter.java:75)


FAILED:  org.apache.hadoop.yarn.server.nodemanager.TestNodeManagerShutdown.testKillContainersOnShutdown

Error Message:
Failed on local exception: java.io.IOException: java.io.IOException: Server asks us to fall
back to SIMPLE auth, but this client is configured to only allow secure connections.; Host
Details : local host is: "asf007.sp2.ygridcore.net/67.195.138.25"; destination host is: "127.0.0.1":12345;


Stack Trace:
java.io.IOException: Failed on local exception: java.io.IOException: java.io.IOException:
Server asks us to fall back to SIMPLE auth, but this client is configured to only allow secure
connections.; Host Details : local host is: "asf007.sp2.ygridcore.net/67.195.138.25"; destination
host is: "127.0.0.1":12345; 
	at org.apache.hadoop.net.NetUtils.wrapException(NetUtils.java:764)
	at org.apache.hadoop.ipc.Client.call(Client.java:1318)
	at org.apache.hadoop.ipc.Client.call(Client.java:1266)
	at org.apache.hadoop.ipc.ProtobufRpcEngine$Invoker.invoke(ProtobufRpcEngine.java:206)
	at $Proxy26.startContainer(Unknown Source)
	at org.apache.hadoop.yarn.api.impl.pb.client.ContainerManagementProtocolPBClientImpl.startContainer(ContainerManagementProtocolPBClientImpl.java:110)
	at org.apache.hadoop.yarn.server.nodemanager.TestNodeManagerShutdown.startContainer(TestNodeManagerShutdown.java:213)
	at org.apache.hadoop.yarn.server.nodemanager.TestNodeManagerShutdown.testKillContainersOnShutdown(TestNodeManagerShutdown.java:115)
	at sun.reflect.NativeMethodAccessorImpl.invoke0(Native Method)
	at sun.reflect.NativeMethodAccessorImpl.invoke(NativeMethodAccessorImpl.java:39)
	at sun.reflect.DelegatingMethodAccessorImpl.invoke(DelegatingMethodAccessorImpl.java:25)
	at java.lang.reflect.Method.invoke(Method.java:597)
	at org.junit.runners.model.FrameworkMethod$1.runReflectiveCall(FrameworkMethod.java:45)
	at org.junit.internal.runners.model.ReflectiveCallable.run(ReflectiveCallable.java:15)
	at org.junit.runners.model.FrameworkMethod.invokeExplosively(FrameworkMethod.java:42)
	at org.junit.internal.runners.statements.InvokeMethod.evaluate(InvokeMethod.java:20)
	at org.junit.internal.runners.statements.RunBefores.evaluate(RunBefores.java:28)
	at org.junit.internal.runners.statements.RunAfters.evaluate(RunAfters.java:30)
	at org.junit.runners.ParentRunner.runLeaf(ParentRunner.java:263)
	at org.junit.runners.BlockJUnit4ClassRunner.runChild(BlockJUnit4ClassRunner.java:68)
	at org.junit.runners.BlockJUnit4ClassRunner.runChild(BlockJUnit4ClassRunner.java:47)
	at org.junit.runners.ParentRunner$3.run(ParentRunner.java:231)
	at org.junit.runners.ParentRunner$1.schedule(ParentRunner.java:60)
	at org.junit.runners.ParentRunner.runChildren(ParentRunner.java:229)
	at org.junit.runners.ParentRunner.access$000(ParentRunner.java:50)
	at org.junit.runners.ParentRunner$2.evaluate(ParentRunner.java:222)
	at org.junit.runners.ParentRunner.run(ParentRunner.java:300)
	at org.apache.maven.surefire.junit4.JUnit4Provider.execute(JUnit4Provider.java:252)
	at org.apache.maven.surefire.junit4.JUnit4Provider.executeTestSet(JUnit4Provider.java:141)
	at org.apache.maven.surefire.junit4.JUnit4Provider.invoke(JUnit4Provider.java:112)
	at sun.reflect.NativeMethodAccessorImpl.invoke0(Native Method)
	at sun.reflect.NativeMethodAccessorImpl.invoke(NativeMethodAccessorImpl.java:39)
	at sun.reflect.DelegatingMethodAccessorImpl.invoke(DelegatingMethodAccessorImpl.java:25)
	at java.lang.reflect.Method.invoke(Method.java:597)
	at org.apache.maven.surefire.util.ReflectionUtils.invokeMethodWithArray(ReflectionUtils.java:189)
	at org.apache.maven.surefire.booter.ProviderFactory$ProviderProxy.invoke(ProviderFactory.java:165)
	at org.apache.maven.surefire.booter.ProviderFactory.invokeProvider(ProviderFactory.java:85)
	at org.apache.maven.surefire.booter.ForkedBooter.runSuitesInProcess(ForkedBooter.java:115)
	at org.apache.maven.surefire.booter.ForkedBooter.main(ForkedBooter.java:75)
Caused by: java.io.IOException: java.io.IOException: Server asks us to fall back to SIMPLE
auth, but this client is configured to only allow secure connections.
	at org.apache.hadoop.ipc.Client$Connection$1.run(Client.java:589)
	at java.security.AccessController.doPrivileged(Native Method)
	at javax.security.auth.Subject.doAs(Subject.java:396)
	at org.apache.hadoop.security.UserGroupInformation.doAs(UserGroupInformation.java:1489)
	at org.apache.hadoop.ipc.Client$Connection.handleSaslConnectionFailure(Client.java:552)
	at org.apache.hadoop.ipc.Client$Connection.setupIOstreams(Client.java:635)
	at org.apache.hadoop.ipc.Client$Connection.access$2200(Client.java:258)
	at org.apache.hadoop.ipc.Client.getConnection(Client.java:1367)
	at org.apache.hadoop.ipc.Client.call(Client.java:1285)
	... 37 more
Caused by: java.io.IOException: Server asks us to fall back to SIMPLE auth, but this client
is configured to only allow secure connections.
	at org.apache.hadoop.security.SaslRpcClient.saslConnect(SaslRpcClient.java:250)
	at org.apache.hadoop.ipc.Client$Connection.setupSaslConnection(Client.java:464)
	at org.apache.hadoop.ipc.Client$Connection.access$1500(Client.java:258)
	at org.apache.hadoop.ipc.Client$Connection$2.run(Client.java:628)
	at org.apache.hadoop.ipc.Client$Connection$2.run(Client.java:625)
	at java.security.AccessController.doPrivileged(Native Method)
	at javax.security.auth.Subject.doAs(Subject.java:396)
	at org.apache.hadoop.security.UserGroupInformation.doAs(UserGroupInformation.java:1489)
	at org.apache.hadoop.ipc.Client$Connection.setupIOstreams(Client.java:624)
	... 40 more



Mime
  • Unnamed multipart/mixed (inline, None, 0 bytes)
View raw message