hadoop-yarn-dev mailing list archives

Site index · List index
Message view « Date » · « Thread »
Top « Date » · « Thread »
From Apache Jenkins Server <jenk...@builds.apache.org>
Subject Failed: YARN-117 PreCommit Build #1190
Date Tue, 11 Jun 2013 10:18:52 GMT
Jira: https://issues.apache.org/jira/browse/YARN-117
Build: https://builds.apache.org/job/PreCommit-YARN-Build/1190/

###################################################################################
########################## LAST 60 LINES OF THE CONSOLE ###########################
[...truncated 5281 lines...]

{color:red}-1 overall{color}.  Here are the results of testing the latest attachment 
  http://issues.apache.org/jira/secure/attachment/12587223/YARN-117-022.patch
  against trunk revision .

    {color:green}+1 @author{color}.  The patch does not contain any @author tags.

    {color:green}+1 tests included{color}.  The patch appears to include 40 new or modified
test files.

    {color:green}+1 javac{color}.  The applied patch does not increase the total number of
javac compiler warnings.

    {color:red}-1 javadoc{color}.  The javadoc tool appears to have generated 2 warning messages.

    {color:green}+1 eclipse:eclipse{color}.  The patch built with eclipse:eclipse.

    {color:red}-1 findbugs{color}.  The patch appears to introduce 6 new Findbugs (version
1.3.9) warnings.

    {color:green}+1 release audit{color}.  The applied patch does not increase the total number
of release audit warnings.

    {color:green}+1 core tests{color}.  The patch passed unit tests in hadoop-common-project/hadoop-common
hadoop-mapreduce-project/hadoop-mapreduce-client/hadoop-mapreduce-client-app hadoop-mapreduce-project/hadoop-mapreduce-client/hadoop-mapreduce-client-hs
hadoop-mapreduce-project/hadoop-mapreduce-client/hadoop-mapreduce-client-jobclient hadoop-mapreduce-project/hadoop-mapreduce-client/hadoop-mapreduce-client-shuffle
hadoop-yarn-project/hadoop-yarn/hadoop-yarn-applications/hadoop-yarn-applications-distributedshell
hadoop-yarn-project/hadoop-yarn/hadoop-yarn-applications/hadoop-yarn-applications-unmanaged-am-launcher
hadoop-yarn-project/hadoop-yarn/hadoop-yarn-client hadoop-yarn-project/hadoop-yarn/hadoop-yarn-common
hadoop-yarn-project/hadoop-yarn/hadoop-yarn-server/hadoop-yarn-server-nodemanager hadoop-yarn-project/hadoop-yarn/hadoop-yarn-server/hadoop-yarn-server-resourcemanager
hadoop-yarn-project/hadoop-yarn/hadoop-yarn-server/hadoop-yarn-server-tests hadoop-yarn-project/hadoop-yarn/hadoop-yarn-server/hadoop-yarn-server-web-proxy.

    {color:green}+1 contrib tests{color}.  The patch passed contrib unit tests.

Test results: https://builds.apache.org/job/PreCommit-YARN-Build/1190//testReport/
Findbugs warnings: https://builds.apache.org/job/PreCommit-YARN-Build/1190//artifact/trunk/patchprocess/newPatchFindbugsWarningshadoop-yarn-client.html
Findbugs warnings: https://builds.apache.org/job/PreCommit-YARN-Build/1190//artifact/trunk/patchprocess/newPatchFindbugsWarningshadoop-mapreduce-client-app.html
Console output: https://builds.apache.org/job/PreCommit-YARN-Build/1190//console

This message is automatically generated.


======================================================================
======================================================================
    Adding comment to Jira.
======================================================================
======================================================================


Unable to log in to server: https://issues.apache.org/jira/rpc/soap/jirasoapservice-v2 with
user: hadoopqa.
 Cause: ; nested exception is: 
	java.net.ConnectException: Connection timed out
Unable to log in to server: https://issues.apache.org/jira/rpc/soap/jirasoapservice-v2 with
user: hadoopqa.
 Cause: ; nested exception is: 
	java.net.ConnectException: Connection timed out


======================================================================
======================================================================
    Finished build.
======================================================================
======================================================================


Build step 'Execute shell' marked build as failure
Archiving artifacts
[description-setter] Could not determine description.
Recording test results
Email was triggered for: Failure
Sending email for trigger: Failure



###################################################################################
############################## FAILED TESTS (if any) ##############################
All tests passed
Mime
  • Unnamed multipart/mixed (inline, None, 0 bytes)
View raw message