hadoop-yarn-dev mailing list archives

Site index · List index
Message view « Date » · « Thread »
Top « Date » · « Thread »
From Apache Jenkins Server <jenk...@builds.apache.org>
Subject Hadoop-Yarn-trunk - Build # 245 - Failure
Date Wed, 19 Jun 2013 10:41:38 GMT
See https://builds.apache.org/job/Hadoop-Yarn-trunk/245/

###################################################################################
########################## LAST 60 LINES OF THE CONSOLE ###########################
[...truncated 12189 lines...]
Failed tests:   testContainerManagerInitialization(org.apache.hadoop.yarn.server.nodemanager.containermanager.TestContainerManager):
expected:<[asf009.sp2.ygridcore.ne]t> but was:<[localhos]t>

Tests run: 175, Failures: 1, Errors: 0, Skipped: 1

[INFO] ------------------------------------------------------------------------
[INFO] Reactor Summary:
[INFO] 
[INFO] hadoop-yarn ....................................... SUCCESS [2.765s]
[INFO] hadoop-yarn-api ................................... SUCCESS [1:37.358s]
[INFO] hadoop-yarn-common ................................ SUCCESS [1:56.918s]
[INFO] hadoop-yarn-server ................................ SUCCESS [0.148s]
[INFO] hadoop-yarn-server-common ......................... SUCCESS [27.733s]
[INFO] hadoop-yarn-server-nodemanager .................... FAILURE [3:32.932s]
[INFO] hadoop-yarn-server-web-proxy ...................... SKIPPED
[INFO] hadoop-yarn-server-resourcemanager ................ SKIPPED
[INFO] hadoop-yarn-server-tests .......................... SKIPPED
[INFO] hadoop-yarn-client ................................ SKIPPED
[INFO] hadoop-yarn-applications .......................... SKIPPED
[INFO] hadoop-yarn-applications-distributedshell ......... SKIPPED
[INFO] hadoop-yarn-applications-unmanaged-am-launcher .... SKIPPED
[INFO] hadoop-yarn-site .................................. SKIPPED
[INFO] hadoop-yarn-project ............................... SKIPPED
[INFO] ------------------------------------------------------------------------
[INFO] BUILD FAILURE
[INFO] ------------------------------------------------------------------------
[INFO] Total time: 7:39.092s
[INFO] Finished at: Wed Jun 19 10:41:33 UTC 2013
[INFO] Final Memory: 49M/773M
[INFO] ------------------------------------------------------------------------
[ERROR] Failed to execute goal org.apache.maven.plugins:maven-surefire-plugin:2.12.3:test
(default-test) on project hadoop-yarn-server-nodemanager: There are test failures.
[ERROR] 
[ERROR] Please refer to /home/jenkins/jenkins-slave/workspace/Hadoop-Yarn-trunk/trunk/hadoop-yarn-project/hadoop-yarn/hadoop-yarn-server/hadoop-yarn-server-nodemanager/target/surefire-reports
for the individual test results.
[ERROR] -> [Help 1]
[ERROR] 
[ERROR] To see the full stack trace of the errors, re-run Maven with the -e switch.
[ERROR] Re-run Maven using the -X switch to enable full debug logging.
[ERROR] 
[ERROR] For more information about the errors and possible solutions, please read the following
articles:
[ERROR] [Help 1] http://cwiki.apache.org/confluence/display/MAVEN/MojoFailureException
[ERROR] 
[ERROR] After correcting the problems, you can resume the build with the command
[ERROR]   mvn <goals> -rf :hadoop-yarn-server-nodemanager
Build step 'Execute shell' marked build as failure
Archiving artifacts
Updating HADOOP-9637
Updating HDFS-4461
Updating HDFS-4917
Updating HDFS-4906
Updating MAPREDUCE-5194
Updating YARN-848
Updating YARN-553
Updating HADOOP-9582
Updating YARN-850
Updating YARN-694
Updating HADOOP-9624
Updating MAPREDUCE-5316
Sending e-mails to: yarn-dev@hadoop.apache.org
Email was triggered for: Failure
Sending email for trigger: Failure



###################################################################################
############################## FAILED TESTS (if any) ##############################
No tests ran.
Mime
  • Unnamed multipart/mixed (inline, None, 0 bytes)
View raw message