hadoop-yarn-dev mailing list archives

Site index · List index
Message view « Date » · « Thread »
Top « Date » · « Thread »
From Apache Jenkins Server <jenk...@builds.apache.org>
Subject Hadoop-Yarn-trunk - Build # 218 - Still Failing
Date Thu, 23 May 2013 10:45:50 GMT
See https://builds.apache.org/job/Hadoop-Yarn-trunk/218/

###################################################################################
########################## LAST 60 LINES OF THE CONSOLE ###########################
[...truncated 12707 lines...]
Tests run: 2, Failures: 0, Errors: 0, Skipped: 0, Time elapsed: 2.936 sec
Running org.apache.hadoop.yarn.server.resourcemanager.webapp.TestRMWebServicesNodes
Tests run: 24, Failures: 0, Errors: 0, Skipped: 0, Time elapsed: 9.587 sec
Running org.apache.hadoop.yarn.server.resourcemanager.webapp.TestRMWebServicesApps
Tests run: 34, Failures: 0, Errors: 0, Skipped: 0, Time elapsed: 45.481 sec
Running org.apache.hadoop.yarn.server.resourcemanager.TestFifoScheduler
Tests run: 5, Failures: 0, Errors: 0, Skipped: 0, Time elapsed: 10.483 sec
Running org.apache.hadoop.yarn.server.resourcemanager.TestRMAuditLogger
Tests run: 3, Failures: 0, Errors: 0, Skipped: 0, Time elapsed: 0.777 sec

Results :

Tests run: 303, Failures: 0, Errors: 0, Skipped: 0

[INFO] ------------------------------------------------------------------------
[INFO] Reactor Summary:
[INFO] 
[INFO] hadoop-yarn ....................................... SUCCESS [2.712s]
[INFO] hadoop-yarn-api ................................... SUCCESS [1:46.599s]
[INFO] hadoop-yarn-common ................................ SUCCESS [1:52.616s]
[INFO] hadoop-yarn-server ................................ SUCCESS [0.155s]
[INFO] hadoop-yarn-server-common ......................... SUCCESS [23.233s]
[INFO] hadoop-yarn-server-nodemanager .................... SUCCESS [3:41.155s]
[INFO] hadoop-yarn-server-web-proxy ...................... SUCCESS [13.218s]
[INFO] hadoop-yarn-server-resourcemanager ................ FAILURE [4:20.304s]
[INFO] hadoop-yarn-server-tests .......................... SKIPPED
[INFO] hadoop-yarn-client ................................ SKIPPED
[INFO] hadoop-yarn-applications .......................... SKIPPED
[INFO] hadoop-yarn-applications-distributedshell ......... SKIPPED
[INFO] hadoop-yarn-applications-unmanaged-am-launcher .... SKIPPED
[INFO] hadoop-yarn-site .................................. SKIPPED
[INFO] hadoop-yarn-project ............................... SKIPPED
[INFO] ------------------------------------------------------------------------
[INFO] BUILD FAILURE
[INFO] ------------------------------------------------------------------------
[INFO] Total time: 12:21.810s
[INFO] Finished at: Thu May 23 10:45:47 UTC 2013
[INFO] Final Memory: 48M/754M
[INFO] ------------------------------------------------------------------------
[ERROR] Failed to execute goal org.apache.maven.plugins:maven-surefire-plugin:2.12.3:test
(default-test) on project hadoop-yarn-server-resourcemanager: ExecutionException; nested exception
is java.util.concurrent.ExecutionException: java.lang.RuntimeException: The forked VM terminated
without saying properly goodbye. VM crash or System.exit called ? -> [Help 1]
[ERROR] 
[ERROR] To see the full stack trace of the errors, re-run Maven with the -e switch.
[ERROR] Re-run Maven using the -X switch to enable full debug logging.
[ERROR] 
[ERROR] For more information about the errors and possible solutions, please read the following
articles:
[ERROR] [Help 1] http://cwiki.apache.org/confluence/display/MAVEN/MojoExecutionException
[ERROR] 
[ERROR] After correcting the problems, you can resume the build with the command
[ERROR]   mvn <goals> -rf :hadoop-yarn-server-resourcemanager
Build step 'Execute shell' marked build as failure
Archiving artifacts
Updating YARN-708
Updating MAPREDUCE-5233
Updating HDFS-4298
Updating YARN-715
Updating YARN-716
Sending e-mails to: yarn-dev@hadoop.apache.org
Email was triggered for: Failure
Sending email for trigger: Failure



###################################################################################
############################## FAILED TESTS (if any) ##############################
No tests ran.
Mime
  • Unnamed multipart/mixed (inline, None, 0 bytes)
View raw message