hadoop-yarn-dev mailing list archives

Site index · List index
Message view « Date » · « Thread »
Top « Date » · « Thread »
From Apache Jenkins Server <jenk...@builds.apache.org>
Subject Failed: YARN-571 PreCommit Build #998
Date Fri, 24 May 2013 00:00:50 GMT
Jira: https://issues.apache.org/jira/browse/YARN-571
Build: https://builds.apache.org/job/PreCommit-YARN-Build/998/

###################################################################################
########################## LAST 60 LINES OF THE CONSOLE ###########################
[...truncated 3933 lines...]
NOP




{color:red}-1 overall{color}.  Here are the results of testing the latest attachment 
  http://issues.apache.org/jira/secure/attachment/12584601/YARN-571.20130522.patch
  against trunk revision .

    {color:green}+1 @author{color}.  The patch does not contain any @author tags.

    {color:green}+1 tests included{color}.  The patch appears to include 28 new or modified
test files.

    {color:green}+1 javac{color}.  The applied patch does not increase the total number of
javac compiler warnings.

    {color:green}+1 javadoc{color}.  The javadoc tool did not generate any warning messages.

    {color:green}+1 eclipse:eclipse{color}.  The patch built with eclipse:eclipse.

    {color:green}+1 findbugs{color}.  The patch does not introduce any new Findbugs (version
1.3.9) warnings.

    {color:green}+1 release audit{color}.  The applied patch does not increase the total number
of release audit warnings.

    {color:red}-1 core tests{color}.  The patch failed these unit tests in hadoop-mapreduce-project/hadoop-mapreduce-client/hadoop-mapreduce-client-app
hadoop-mapreduce-project/hadoop-mapreduce-client/hadoop-mapreduce-client-jobclient hadoop-yarn-project/hadoop-yarn/hadoop-yarn-api
hadoop-yarn-project/hadoop-yarn/hadoop-yarn-applications/hadoop-yarn-applications-distributedshell
hadoop-yarn-project/hadoop-yarn/hadoop-yarn-common hadoop-yarn-project/hadoop-yarn/hadoop-yarn-server/hadoop-yarn-server-nodemanager
hadoop-yarn-project/hadoop-yarn/hadoop-yarn-server/hadoop-yarn-server-resourcemanager hadoop-yarn-project/hadoop-yarn/hadoop-yarn-server/hadoop-yarn-server-tests:

                  org.apache.hadoop.yarn.server.TestContainerManagerSecurity

    {color:green}+1 contrib tests{color}.  The patch passed contrib unit tests.

Test results: https://builds.apache.org/job/PreCommit-YARN-Build/998//testReport/
Console output: https://builds.apache.org/job/PreCommit-YARN-Build/998//console

This message is automatically generated.


======================================================================
======================================================================
    Adding comment to Jira.
======================================================================
======================================================================


Comment added.
c2247a7a4134fa47a54b20cb8befe0e5fcbf6556 logged out


======================================================================
======================================================================
    Finished build.
======================================================================
======================================================================


Build step 'Execute shell' marked build as failure
Archiving artifacts
[description-setter] Could not determine description.
Recording test results
Email was triggered for: Failure
Sending email for trigger: Failure



###################################################################################
############################## FAILED TESTS (if any) ##############################
2 tests failed.
FAILED:  org.apache.hadoop.yarn.server.TestContainerManagerSecurity.testContainerManagerWithSecurityEnabled

Error Message:
Connection initiation with unauthorized access is expected to fail.

Stack Trace:
java.lang.AssertionError: Connection initiation with unauthorized access is expected to fail.
	at org.junit.Assert.fail(Assert.java:91)
	at org.apache.hadoop.yarn.server.TestContainerManagerSecurity.callWithIllegalUserName(TestContainerManagerSecurity.java:597)
	at org.apache.hadoop.yarn.server.TestContainerManagerSecurity$3.run(TestContainerManagerSecurity.java:324)
	at org.apache.hadoop.yarn.server.TestContainerManagerSecurity$3.run(TestContainerManagerSecurity.java:312)
	at java.security.AccessController.doPrivileged(Native Method)
	at javax.security.auth.Subject.doAs(Subject.java:337)
	at org.apache.hadoop.security.UserGroupInformation.doAs(UserGroupInformation.java:1469)
	at org.apache.hadoop.yarn.server.TestContainerManagerSecurity.testUnauthorizedUser(TestContainerManagerSecurity.java:311)
	at org.apache.hadoop.yarn.server.TestContainerManagerSecurity.testContainerManager(TestContainerManagerSecurity.java:125)
	at org.apache.hadoop.yarn.server.TestContainerManagerSecurity.testContainerManagerWithSecurityEnabled(TestContainerManagerSecurity.java:99)
	at sun.reflect.NativeMethodAccessorImpl.invoke0(Native Method)
	at sun.reflect.NativeMethodAccessorImpl.invoke(NativeMethodAccessorImpl.java:39)
	at sun.reflect.DelegatingMethodAccessorImpl.invoke(DelegatingMethodAccessorImpl.java:25)
	at java.lang.reflect.Method.invoke(Method.java:597)
	at org.junit.runners.model.FrameworkMethod$1.runReflectiveCall(FrameworkMethod.java:44)
	at org.junit.internal.runners.model.ReflectiveCallable.run(ReflectiveCallable.java:15)
	at org.junit.runners.model.FrameworkMethod.invokeExplosively(FrameworkMethod.java:41)
	at org.junit.internal.runners.statements.InvokeMethod.evaluate(InvokeMethod.java:20)
	at org.junit.internal.runners.statements.FailOnTimeout$1.run(FailOnTimeout.java:28)


FAILED:  org.apache.hadoop.yarn.server.TestContainerManagerSecurity.testContainerManagerWithSecurityDisabled

Error Message:
Connection initiation with unauthorized access is expected to fail.

Stack Trace:
java.lang.AssertionError: Connection initiation with unauthorized access is expected to fail.
	at org.junit.Assert.fail(Assert.java:91)
	at org.apache.hadoop.yarn.server.TestContainerManagerSecurity.callWithIllegalUserName(TestContainerManagerSecurity.java:597)
	at org.apache.hadoop.yarn.server.TestContainerManagerSecurity$3.run(TestContainerManagerSecurity.java:324)
	at org.apache.hadoop.yarn.server.TestContainerManagerSecurity$3.run(TestContainerManagerSecurity.java:312)
	at java.security.AccessController.doPrivileged(Native Method)
	at javax.security.auth.Subject.doAs(Subject.java:337)
	at org.apache.hadoop.security.UserGroupInformation.doAs(UserGroupInformation.java:1469)
	at org.apache.hadoop.yarn.server.TestContainerManagerSecurity.testUnauthorizedUser(TestContainerManagerSecurity.java:311)
	at org.apache.hadoop.yarn.server.TestContainerManagerSecurity.testContainerManager(TestContainerManagerSecurity.java:125)
	at org.apache.hadoop.yarn.server.TestContainerManagerSecurity.testContainerManagerWithSecurityDisabled(TestContainerManagerSecurity.java:106)
	at sun.reflect.NativeMethodAccessorImpl.invoke0(Native Method)
	at sun.reflect.NativeMethodAccessorImpl.invoke(NativeMethodAccessorImpl.java:39)
	at sun.reflect.DelegatingMethodAccessorImpl.invoke(DelegatingMethodAccessorImpl.java:25)
	at java.lang.reflect.Method.invoke(Method.java:597)
	at org.junit.runners.model.FrameworkMethod$1.runReflectiveCall(FrameworkMethod.java:44)
	at org.junit.internal.runners.model.ReflectiveCallable.run(ReflectiveCallable.java:15)
	at org.junit.runners.model.FrameworkMethod.invokeExplosively(FrameworkMethod.java:41)
	at org.junit.internal.runners.statements.InvokeMethod.evaluate(InvokeMethod.java:20)
	at org.junit.internal.runners.statements.FailOnTimeout$1.run(FailOnTimeout.java:28)



Mime
  • Unnamed multipart/mixed (inline, None, 0 bytes)
View raw message