hadoop-yarn-dev mailing list archives

Site index · List index
Message view « Date » · « Thread »
Top « Date » · « Thread »
From Apache Jenkins Server <jenk...@builds.apache.org>
Subject Failed: YARN-117 PreCommit Build #648
Date Tue, 02 Apr 2013 19:28:38 GMT
Jira: https://issues.apache.org/jira/browse/YARN-117
Build: https://builds.apache.org/job/PreCommit-YARN-Build/648/

###################################################################################
########################## LAST 60 LINES OF THE CONSOLE ###########################
[...truncated 7714 lines...]
                  org.apache.hadoop.mapreduce.v2.TestRMNMInfo
                  org.apache.hadoop.mapreduce.v2.TestMiniMRProxyUser
                  org.apache.hadoop.mapreduce.v2.TestMROldApiJobs
                  org.apache.hadoop.mapreduce.TestMapReduceLazyOutput
                  org.apache.hadoop.mapreduce.v2.TestSpeculativeExecution
                  org.apache.hadoop.mapred.TestJobCleanup
                  org.apache.hadoop.mapred.TestReduceFetch
                  org.apache.hadoop.mapred.TestReduceFetchFromPartialMem
                  org.apache.hadoop.mapred.TestMerge
                  org.apache.hadoop.mapreduce.v2.TestMRJobs
                  org.apache.hadoop.mapreduce.TestChild
                  org.apache.hadoop.mapred.TestJobName
                  org.apache.hadoop.mapred.TestLazyOutput
                  org.apache.hadoop.mapreduce.security.TestBinaryTokenFile
                  org.apache.hadoop.mapreduce.v2.TestUberAM
                  org.apache.hadoop.mapred.TestMiniMRClientCluster
                  org.apache.hadoop.mapred.TestSpecialCharactersInOutputPath
                  org.apache.hadoop.mapreduce.v2.TestMRJobsWithHistoryService
                  org.apache.hadoop.mapred.TestClusterMapReduceTestCase
                  org.apache.hadoop.mapreduce.lib.output.TestJobOutputCommitter
                  org.apache.hadoop.ipc.TestSocketFactory
                  org.apache.hadoop.mapred.TestJobSysDirWithDFS
                  org.apache.hadoop.yarn.applications.unmanagedamlauncher.TestUnmanagedAMLauncher
                  org.apache.hadoop.yarn.server.resourcemanager.resourcetracker.TestNMExpiry

    {color:green}+1 contrib tests{color}.  The patch passed contrib unit tests.

Test results: https://builds.apache.org/job/PreCommit-YARN-Build/648//testReport/
Findbugs warnings: https://builds.apache.org/job/PreCommit-YARN-Build/648//artifact/trunk/patchprocess/newPatchFindbugsWarningshadoop-yarn-common.html
Findbugs warnings: https://builds.apache.org/job/PreCommit-YARN-Build/648//artifact/trunk/patchprocess/newPatchFindbugsWarningshadoop-mapreduce-client-app.html
Console output: https://builds.apache.org/job/PreCommit-YARN-Build/648//console

This message is automatically generated.


======================================================================
======================================================================
    Adding comment to Jira.
======================================================================
======================================================================


Comment added.
02f275ae9e0e01fde897bf24c94ea3cd0ebbf212 logged out


======================================================================
======================================================================
    Finished build.
======================================================================
======================================================================


Build step 'Execute shell' marked build as failure
Archiving artifacts
[description-setter] Could not determine description.
Recording test results
Email was triggered for: Failure
Sending email for trigger: Failure



###################################################################################
############################## FAILED TESTS (if any) ##############################
53 tests failed.
FAILED:  org.apache.hadoop.ipc.TestSocketFactory.testSocketFactory

Error Message:
null

Stack Trace:
java.lang.reflect.UndeclaredThrowableException
	at org.apache.hadoop.yarn.exceptions.impl.pb.YarnRemoteExceptionPBImpl.unwrapAndThrowException(YarnRemoteExceptionPBImpl.java:135)
	at org.apache.hadoop.yarn.api.impl.pb.client.ClientRMProtocolPBClientImpl.getAllApplications(ClientRMProtocolPBClientImpl.java:188)
	at org.apache.hadoop.yarn.client.YarnClientImpl.getApplicationList(YarnClientImpl.java:165)
	at org.apache.hadoop.mapred.ResourceMgrDelegate.getAllJobs(ResourceMgrDelegate.java:71)
	at org.apache.hadoop.mapred.YARNRunner.getAllJobs(YARNRunner.java:173)
	at org.apache.hadoop.mapreduce.Cluster.getAllJobStatuses(Cluster.java:281)
	at org.apache.hadoop.mapred.JobClient$5.run(JobClient.java:832)
	at org.apache.hadoop.mapred.JobClient$5.run(JobClient.java:829)
	at java.security.AccessController.doPrivileged(Native Method)
	at javax.security.auth.Subject.doAs(Subject.java:396)
	at org.apache.hadoop.security.UserGroupInformation.doAs(UserGroupInformation.java:1489)
	at org.apache.hadoop.mapred.JobClient.getAllJobs(JobClient.java:827)
	at org.apache.hadoop.mapred.JobClient.jobsToComplete(JobClient.java:811)
	at org.apache.hadoop.ipc.TestSocketFactory.testSocketFactory(TestSocketFactory.java:96)
	at sun.reflect.NativeMethodAccessorImpl.invoke0(Native Method)
	at sun.reflect.NativeMethodAccessorImpl.invoke(NativeMethodAccessorImpl.java:39)
	at sun.reflect.DelegatingMethodAccessorImpl.invoke(DelegatingMethodAccessorImpl.java:25)
	at java.lang.reflect.Method.invoke(Method.java:597)
	at org.junit.runners.model.FrameworkMethod$1.runReflectiveCall(FrameworkMethod.java:44)
	at org.junit.internal.runners.model.ReflectiveCallable.run(ReflectiveCallable.java:15)
	at org.junit.runners.model.FrameworkMethod.invokeExplosively(FrameworkMethod.java:41)
	at org.junit.internal.runners.statements.InvokeMethod.evaluate(InvokeMethod.java:20)
	at org.junit.runners.BlockJUnit4ClassRunner.runNotIgnored(BlockJUnit4ClassRunner.java:79)
	at org.junit.runners.BlockJUnit4ClassRunner.runChild(BlockJUnit4ClassRunner.java:71)
	at org.junit.runners.BlockJUnit4ClassRunner.runChild(BlockJUnit4ClassRunner.java:49)
	at org.junit.runners.ParentRunner$3.run(ParentRunner.java:193)
	at org.junit.runners.ParentRunner$1.schedule(ParentRunner.java:52)
	at org.junit.runners.ParentRunner.runChildren(ParentRunner.java:191)
	at org.junit.runners.ParentRunner.access$000(ParentRunner.java:42)
	at org.junit.runners.ParentRunner$2.evaluate(ParentRunner.java:184)
	at org.junit.runners.ParentRunner.run(ParentRunner.java:236)
	at org.apache.maven.surefire.junit4.JUnit4Provider.execute(JUnit4Provider.java:252)
	at org.apache.maven.surefire.junit4.JUnit4Provider.executeTestSet(JUnit4Provider.java:141)
	at org.apache.maven.surefire.junit4.JUnit4Provider.invoke(JUnit4Provider.java:112)
	at sun.reflect.NativeMethodAccessorImpl.invoke0(Native Method)
	at sun.reflect.NativeMethodAccessorImpl.invoke(NativeMethodAccessorImpl.java:39)
	at sun.reflect.DelegatingMethodAccessorImpl.invoke(DelegatingMethodAccessorImpl.java:25)
	at java.lang.reflect.Method.invoke(Method.java:597)
	at org.apache.maven.surefire.util.ReflectionUtils.invokeMethodWithArray(ReflectionUtils.java:189)
	at org.apache.maven.surefire.booter.ProviderFactory$ProviderProxy.invoke(ProviderFactory.java:165)
	at org.apache.maven.surefire.booter.ProviderFactory.invokeProvider(ProviderFactory.java:85)
	at org.apache.maven.surefire.booter.ForkedBooter.runSuitesInProcess(ForkedBooter.java:115)
	at org.apache.maven.surefire.booter.ForkedBooter.main(ForkedBooter.java:75)
Caused by: com.google.protobuf.ServiceException: java.net.ConnectException: Call From asf007.sp2.ygridcore.net/67.195.138.25 to 0.0.0.0:8042 failed on connection exception: java.net.ConnectException: Connection refused; For more details see:  http://wiki.apache.org/hadoop/ConnectionRefused
	at org.apache.hadoop.ipc.ProtobufRpcEngine$Invoker.invoke(ProtobufRpcEngine.java:214)
	at $Proxy75.getAllApplications(Unknown Source)
	at org.apache.hadoop.yarn.api.impl.pb.client.ClientRMProtocolPBClientImpl.getAllApplications(ClientRMProtocolPBClientImpl.java:185)
	... 41 more
Caused by: java.net.ConnectException: Call From asf007.sp2.ygridcore.net/67.195.138.25 to 0.0.0.0:8042 failed on connection exception: java.net.ConnectException: Connection refused; For more details see:  http://wiki.apache.org/hadoop/ConnectionRefused
	at sun.reflect.NativeConstructorAccessorImpl.newInstance0(Native Method)
	at sun.reflect.NativeConstructorAccessorImpl.newInstance(NativeConstructorAccessorImpl.java:39)
	at sun.reflect.DelegatingConstructorAccessorImpl.newInstance(DelegatingConstructorAccessorImpl.java:27)
	at java.lang.reflect.Constructor.newInstance(Constructor.java:513)
	at org.apache.hadoop.net.NetUtils.wrapWithMessage(NetUtils.java:780)
	at org.apache.hadoop.net.NetUtils.wrapException(NetUtils.java:727)
	at org.apache.hadoop.ipc.Client.call(Client.java:1305)
	at org.apache.hadoop.ipc.Client.call(Client.java:1253)
	at org.apache.hadoop.ipc.ProtobufRpcEngine$Invoker.invoke(ProtobufRpcEngine.java:204)
	... 43 more
Caused by: java.net.ConnectException: Connection refused
	at java.net.PlainSocketImpl.socketConnect(Native Method)
	at java.net.PlainSocketImpl.doConnect(PlainSocketImpl.java:351)
	at java.net.PlainSocketImpl.connectToAddress(PlainSocketImpl.java:211)
	at java.net.PlainSocketImpl.connect(PlainSocketImpl.java:200)
	at java.net.SocksSocketImpl.connect(SocksSocketImpl.java:366)
	at java.net.Socket.connect(Socket.java:529)
	at org.apache.hadoop.ipc.DummySocketFactory$1.connect(TestSocketFactory.java:201)
	at org.apache.hadoop.net.NetUtils.connect(NetUtils.java:524)
	at org.apache.hadoop.net.NetUtils.connect(NetUtils.java:490)
	at org.apache.hadoop.ipc.Client$Connection.setupConnection(Client.java:511)
	at org.apache.hadoop.ipc.Client$Connection.setupIOstreams(Client.java:606)
	at org.apache.hadoop.ipc.Client$Connection.access$2100(Client.java:254)
	at org.apache.hadoop.ipc.Client.getConnection(Client.java:1354)
	at org.apache.hadoop.ipc.Client.call(Client.java:1272)
	... 45 more


FAILED:  org.apache.hadoop.mapreduce.v2.app.TestStagingCleanup.testDeletionofStagingOnKill

Error Message:
null

Stack Trace:
java.lang.NullPointerException
	at org.apache.hadoop.mapred.TaskAttemptListenerImpl.stopRpcServer(TaskAttemptListenerImpl.java:153)
	at org.apache.hadoop.mapred.TaskAttemptListenerImpl.innerStop(TaskAttemptListenerImpl.java:148)
	at org.apache.hadoop.yarn.service.AbstractService.stop(AbstractService.java:178)
	at org.apache.hadoop.yarn.service.ServiceOperations.stop(ServiceOperations.java:139)
	at org.apache.hadoop.yarn.service.ServiceOperations.stopQuietly(ServiceOperations.java:168)
	at org.apache.hadoop.yarn.service.CompositeService.stop(CompositeService.java:85)
	at org.apache.hadoop.yarn.service.CompositeService.innerStop(CompositeService.java:71)
	at org.apache.hadoop.yarn.service.AbstractService.stop(AbstractService.java:178)
	at org.apache.hadoop.mapreduce.v2.app.MRAppMaster$MRAppMasterShutdownHook.run(MRAppMaster.java:1279)
	at org.apache.hadoop.mapreduce.v2.app.TestStagingCleanup.testDeletionofStagingOnKill(TestStagingCleanup.java:119)
	at sun.reflect.NativeMethodAccessorImpl.invoke0(Native Method)
	at sun.reflect.NativeMethodAccessorImpl.invoke(NativeMethodAccessorImpl.java:39)
	at sun.reflect.DelegatingMethodAccessorImpl.invoke(DelegatingMethodAccessorImpl.java:25)
	at java.lang.reflect.Method.invoke(Method.java:597)
	at junit.framework.TestCase.runTest(TestCase.java:168)
	at junit.framework.TestCase.runBare(TestCase.java:134)
	at junit.framework.TestResult$1.protect(TestResult.java:110)
	at junit.framework.TestResult.runProtected(TestResult.java:128)
	at junit.framework.TestResult.run(TestResult.java:113)
	at junit.framework.TestCase.run(TestCase.java:124)
	at junit.framework.TestSuite.runTest(TestSuite.java:243)
	at junit.framework.TestSuite.run(TestSuite.java:238)
	at org.junit.internal.runners.JUnit38ClassRunner.run(JUnit38ClassRunner.java:83)
	at org.apache.maven.surefire.junit4.JUnit4Provider.execute(JUnit4Provider.java:252)
	at org.apache.maven.surefire.junit4.JUnit4Provider.executeTestSet(JUnit4Provider.java:141)
	at org.apache.maven.surefire.junit4.JUnit4Provider.invoke(JUnit4Provider.java:112)
	at sun.reflect.NativeMethodAccessorImpl.invoke0(Native Method)
	at sun.reflect.NativeMethodAccessorImpl.invoke(NativeMethodAccessorImpl.java:39)
	at sun.reflect.DelegatingMethodAccessorImpl.invoke(DelegatingMethodAccessorImpl.java:25)
	at java.lang.reflect.Method.invoke(Method.java:597)
	at org.apache.maven.surefire.util.ReflectionUtils.invokeMethodWithArray(ReflectionUtils.java:189)
	at org.apache.maven.surefire.booter.ProviderFactory$ProviderProxy.invoke(ProviderFactory.java:165)
	at org.apache.maven.surefire.booter.ProviderFactory.invokeProvider(ProviderFactory.java:85)
	at org.apache.maven.surefire.booter.ForkedBooter.runSuitesInProcess(ForkedBooter.java:115)
	at org.apache.maven.surefire.booter.ForkedBooter.main(ForkedBooter.java:75)


FAILED:  org.apache.hadoop.mapreduce.v2.app.TestStagingCleanup.testDeletionofStagingOnKillLastTry

Error Message:
null

Stack Trace:
java.lang.NullPointerException
	at org.apache.hadoop.mapred.TaskAttemptListenerImpl.stopRpcServer(TaskAttemptListenerImpl.java:153)
	at org.apache.hadoop.mapred.TaskAttemptListenerImpl.innerStop(TaskAttemptListenerImpl.java:148)
	at org.apache.hadoop.yarn.service.AbstractService.stop(AbstractService.java:178)
	at org.apache.hadoop.yarn.service.ServiceOperations.stop(ServiceOperations.java:139)
	at org.apache.hadoop.yarn.service.ServiceOperations.stopQuietly(ServiceOperations.java:168)
	at org.apache.hadoop.yarn.service.CompositeService.stop(CompositeService.java:85)
	at org.apache.hadoop.yarn.service.CompositeService.innerStop(CompositeService.java:71)
	at org.apache.hadoop.yarn.service.AbstractService.stop(AbstractService.java:178)
	at org.apache.hadoop.mapreduce.v2.app.MRAppMaster$MRAppMasterShutdownHook.run(MRAppMaster.java:1279)
	at org.apache.hadoop.mapreduce.v2.app.TestStagingCleanup.testDeletionofStagingOnKillLastTry(TestStagingCleanup.java:148)
	at sun.reflect.NativeMethodAccessorImpl.invoke0(Native Method)
	at sun.reflect.NativeMethodAccessorImpl.invoke(NativeMethodAccessorImpl.java:39)
	at sun.reflect.DelegatingMethodAccessorImpl.invoke(DelegatingMethodAccessorImpl.java:25)
	at java.lang.reflect.Method.invoke(Method.java:597)
	at junit.framework.TestCase.runTest(TestCase.java:168)
	at junit.framework.TestCase.runBare(TestCase.java:134)
	at junit.framework.TestResult$1.protect(TestResult.java:110)
	at junit.framework.TestResult.runProtected(TestResult.java:128)
	at junit.framework.TestResult.run(TestResult.java:113)
	at junit.framework.TestCase.run(TestCase.java:124)
	at junit.framework.TestSuite.runTest(TestSuite.java:243)
	at junit.framework.TestSuite.run(TestSuite.java:238)
	at org.junit.internal.runners.JUnit38ClassRunner.run(JUnit38ClassRunner.java:83)
	at org.apache.maven.surefire.junit4.JUnit4Provider.execute(JUnit4Provider.java:252)
	at org.apache.maven.surefire.junit4.JUnit4Provider.executeTestSet(JUnit4Provider.java:141)
	at org.apache.maven.surefire.junit4.JUnit4Provider.invoke(JUnit4Provider.java:112)
	at sun.reflect.NativeMethodAccessorImpl.invoke0(Native Method)
	at sun.reflect.NativeMethodAccessorImpl.invoke(NativeMethodAccessorImpl.java:39)
	at sun.reflect.DelegatingMethodAccessorImpl.invoke(DelegatingMethodAccessorImpl.java:25)
	at java.lang.reflect.Method.invoke(Method.java:597)
	at org.apache.maven.surefire.util.ReflectionUtils.invokeMethodWithArray(ReflectionUtils.java:189)
	at org.apache.maven.surefire.booter.ProviderFactory$ProviderProxy.invoke(ProviderFactory.java:165)
	at org.apache.maven.surefire.booter.ProviderFactory.invokeProvider(ProviderFactory.java:85)
	at org.apache.maven.surefire.booter.ForkedBooter.runSuitesInProcess(ForkedBooter.java:115)
	at org.apache.maven.surefire.booter.ForkedBooter.main(ForkedBooter.java:75)


FAILED:  org.apache.hadoop.mapred.TestBlockLimits.testWithLimits

Error Message:
java.io.IOException: NodeManager 1 failed to start

Stack Trace:
org.apache.hadoop.yarn.YarnException: java.io.IOException: NodeManager 1 failed to start
	at org.apache.hadoop.yarn.server.MiniYARNCluster$NodeManagerWrapper.innerStart(MiniYARNCluster.java:325)
	at org.apache.hadoop.yarn.service.AbstractService.start(AbstractService.java:158)
	at org.apache.hadoop.yarn.service.CompositeService.innerStart(CompositeService.java:65)
	at org.apache.hadoop.yarn.service.AbstractService.start(AbstractService.java:158)
	at org.apache.hadoop.mapred.MiniMRClientClusterFactory.create(MiniMRClientClusterFactory.java:80)
	at org.apache.hadoop.mapred.MiniMRClientClusterFactory.create(MiniMRClientClusterFactory.java:41)
	at org.apache.hadoop.mapred.TestBlockLimits.testWithLimits(TestBlockLimits.java:51)
	at sun.reflect.NativeMethodAccessorImpl.invoke0(Native Method)
	at sun.reflect.NativeMethodAccessorImpl.invoke(NativeMethodAccessorImpl.java:39)
	at sun.reflect.DelegatingMethodAccessorImpl.invoke(DelegatingMethodAccessorImpl.java:25)
	at java.lang.reflect.Method.invoke(Method.java:597)
	at junit.framework.TestCase.runTest(TestCase.java:168)
	at junit.framework.TestCase.runBare(TestCase.java:134)
	at junit.framework.TestResult$1.protect(TestResult.java:110)
	at junit.framework.TestResult.runProtected(TestResult.java:128)
	at junit.framework.TestResult.run(TestResult.java:113)
	at junit.framework.TestCase.run(TestCase.java:124)
	at junit.framework.TestSuite.runTest(TestSuite.java:243)
	at junit.framework.TestSuite.run(TestSuite.java:238)
	at org.junit.internal.runners.JUnit38ClassRunner.run(JUnit38ClassRunner.java:83)
	at org.apache.maven.surefire.junit4.JUnit4Provider.execute(JUnit4Provider.java:252)
	at org.apache.maven.surefire.junit4.JUnit4Provider.executeTestSet(JUnit4Provider.java:141)
	at org.apache.maven.surefire.junit4.JUnit4Provider.invoke(JUnit4Provider.java:112)
	at sun.reflect.NativeMethodAccessorImpl.invoke0(Native Method)
	at sun.reflect.NativeMethodAccessorImpl.invoke(NativeMethodAccessorImpl.java:39)
	at sun.reflect.DelegatingMethodAccessorImpl.invoke(DelegatingMethodAccessorImpl.java:25)
	at java.lang.reflect.Method.invoke(Method.java:597)
	at org.apache.maven.surefire.util.ReflectionUtils.invokeMethodWithArray(ReflectionUtils.java:189)
	at org.apache.maven.surefire.booter.ProviderFactory$ProviderProxy.invoke(ProviderFactory.java:165)
	at org.apache.maven.surefire.booter.ProviderFactory.invokeProvider(ProviderFactory.java:85)
	at org.apache.maven.surefire.booter.ForkedBooter.runSuitesInProcess(ForkedBooter.java:115)
	at org.apache.maven.surefire.booter.ForkedBooter.main(ForkedBooter.java:75)
Caused by: java.io.IOException: NodeManager 1 failed to start
	at org.apache.hadoop.yarn.server.MiniYARNCluster$NodeManagerWrapper.innerStart(MiniYARNCluster.java:321)
	... 31 more


FAILED:  org.apache.hadoop.mapred.TestClusterMRNotification.testMR

Error Message:
null

Stack Trace:
java.lang.reflect.UndeclaredThrowableException
	at org.apache.hadoop.yarn.exceptions.impl.pb.YarnRemoteExceptionPBImpl.unwrapAndThrowException(YarnRemoteExceptionPBImpl.java:135)
	at org.apache.hadoop.yarn.api.impl.pb.client.ClientRMProtocolPBClientImpl.getNewApplication(ClientRMProtocolPBClientImpl.java:162)
	at org.apache.hadoop.yarn.client.YarnClientImpl.getNewApplication(YarnClientImpl.java:121)
	at org.apache.hadoop.mapred.ResourceMgrDelegate.getNewJobID(ResourceMgrDelegate.java:102)
	at org.apache.hadoop.mapred.YARNRunner.getNewJobID(YARNRunner.java:215)
	at org.apache.hadoop.mapreduce.JobSubmitter.submitJobInternal(JobSubmitter.java:352)
	at org.apache.hadoop.mapreduce.Job$11.run(Job.java:1218)
	at org.apache.hadoop.mapreduce.Job$11.run(Job.java:1215)
	at java.security.AccessController.doPrivileged(Native Method)
	at javax.security.auth.Subject.doAs(Subject.java:396)
	at org.apache.hadoop.security.UserGroupInformation.doAs(UserGroupInformation.java:1489)
	at org.apache.hadoop.mapreduce.Job.submit(Job.java:1215)
	at org.apache.hadoop.mapred.JobClient$1.run(JobClient.java:581)
	at org.apache.hadoop.mapred.JobClient$1.run(JobClient.java:576)
	at java.security.AccessController.doPrivileged(Native Method)
	at javax.security.auth.Subject.doAs(Subject.java:396)
	at org.apache.hadoop.security.UserGroupInformation.doAs(UserGroupInformation.java:1489)
	at org.apache.hadoop.mapred.JobClient.submitJob(JobClient.java:576)
	at org.apache.hadoop.mapred.JobClient.runJob(JobClient.java:854)
	at org.apache.hadoop.mapred.NotificationTestCase.launchWordCount(NotificationTestCase.java:241)
	at org.apache.hadoop.mapred.NotificationTestCase.testMR(NotificationTestCase.java:156)
	at sun.reflect.NativeMethodAccessorImpl.invoke0(Native Method)
	at sun.reflect.NativeMethodAccessorImpl.invoke(NativeMethodAccessorImpl.java:39)
	at sun.reflect.DelegatingMethodAccessorImpl.invoke(DelegatingMethodAccessorImpl.java:25)
	at java.lang.reflect.Method.invoke(Method.java:597)
	at junit.framework.TestCase.runTest(TestCase.java:168)
	at junit.framework.TestCase.runBare(TestCase.java:134)
	at junit.framework.TestResult$1.protect(TestResult.java:110)
	at junit.framework.TestResult.runProtected(TestResult.java:128)
	at junit.framework.TestResult.run(TestResult.java:113)
	at junit.framework.TestCase.run(TestCase.java:124)
	at junit.framework.TestSuite.runTest(TestSuite.java:243)
	at junit.framework.TestSuite.run(TestSuite.java:238)
	at org.junit.internal.runners.JUnit38ClassRunner.run(JUnit38ClassRunner.java:83)
	at org.apache.maven.surefire.junit4.JUnit4Provider.execute(JUnit4Provider.java:252)
	at org.apache.maven.surefire.junit4.JUnit4Provider.executeTestSet(JUnit4Provider.java:141)
	at org.apache.maven.surefire.junit4.JUnit4Provider.invoke(JUnit4Provider.java:112)
	at sun.reflect.NativeMethodAccessorImpl.invoke0(Native Method)
	at sun.reflect.NativeMethodAccessorImpl.invoke(NativeMethodAccessorImpl.java:39)
	at sun.reflect.DelegatingMethodAccessorImpl.invoke(DelegatingMethodAccessorImpl.java:25)
	at java.lang.reflect.Method.invoke(Method.java:597)
	at org.apache.maven.surefire.util.ReflectionUtils.invokeMethodWithArray(ReflectionUtils.java:189)
	at org.apache.maven.surefire.booter.ProviderFactory$ProviderProxy.invoke(ProviderFactory.java:165)
	at org.apache.maven.surefire.booter.ProviderFactory.invokeProvider(ProviderFactory.java:85)
	at org.apache.maven.surefire.booter.ForkedBooter.runSuitesInProcess(ForkedBooter.java:115)
	at org.apache.maven.surefire.booter.ForkedBooter.main(ForkedBooter.java:75)
Caused by: com.google.protobuf.ServiceException: java.net.ConnectException: Call From asf007.sp2.ygridcore.net/67.195.138.25 to 0.0.0.0:8032 failed on connection exception: java.net.ConnectException: Connection refused; For more details see:  http://wiki.apache.org/hadoop/ConnectionRefused
	at org.apache.hadoop.ipc.ProtobufRpcEngine$Invoker.invoke(ProtobufRpcEngine.java:214)
	at $Proxy70.getNewApplication(Unknown Source)
	at org.apache.hadoop.yarn.api.impl.pb.client.ClientRMProtocolPBClientImpl.getNewApplication(ClientRMProtocolPBClientImpl.java:159)
	... 44 more
Caused by: java.net.ConnectException: Call From asf007.sp2.ygridcore.net/67.195.138.25 to 0.0.0.0:8032 failed on connection exception: java.net.ConnectException: Connection refused; For more details see:  http://wiki.apache.org/hadoop/ConnectionRefused
	at sun.reflect.NativeConstructorAccessorImpl.newInstance0(Native Method)
	at sun.reflect.NativeConstructorAccessorImpl.newInstance(NativeConstructorAccessorImpl.java:39)
	at sun.reflect.DelegatingConstructorAccessorImpl.newInstance(DelegatingConstructorAccessorImpl.java:27)
	at java.lang.reflect.Constructor.newInstance(Constructor.java:513)
	at org.apache.hadoop.net.NetUtils.wrapWithMessage(NetUtils.java:780)
	at org.apache.hadoop.net.NetUtils.wrapException(NetUtils.java:727)
	at org.apache.hadoop.ipc.Client.call(Client.java:1305)
	at org.apache.hadoop.ipc.Client.call(Client.java:1253)
	at org.apache.hadoop.ipc.ProtobufRpcEngine$Invoker.invoke(ProtobufRpcEngine.java:204)
	... 46 more
Caused by: java.net.ConnectException: Connection refused
	at sun.nio.ch.SocketChannelImpl.checkConnect(Native Method)
	at sun.nio.ch.SocketChannelImpl.finishConnect(SocketChannelImpl.java:567)
	at org.apache.hadoop.net.SocketIOWithTimeout.connect(SocketIOWithTimeout.java:206)
	at org.apache.hadoop.net.NetUtils.connect(NetUtils.java:526)
	at org.apache.hadoop.net.NetUtils.connect(NetUtils.java:490)
	at org.apache.hadoop.ipc.Client$Connection.setupConnection(Client.java:511)
	at org.apache.hadoop.ipc.Client$Connection.setupIOstreams(Client.java:606)
	at org.apache.hadoop.ipc.Client$Connection.access$2100(Client.java:254)
	at org.apache.hadoop.ipc.Client.getConnection(Client.java:1354)
	at org.apache.hadoop.ipc.Client.call(Client.java:1272)
	... 48 more


FAILED:  org.apache.hadoop.mapred.TestClusterMapReduceTestCase.testMapReduce

Error Message:
java.io.IOException: NodeManager 1 failed to start

Stack Trace:
org.apache.hadoop.yarn.YarnException: java.io.IOException: NodeManager 1 failed to start
	at org.apache.hadoop.yarn.server.MiniYARNCluster$NodeManagerWrapper.innerStart(MiniYARNCluster.java:325)
	at org.apache.hadoop.yarn.service.AbstractService.start(AbstractService.java:158)
	at org.apache.hadoop.yarn.service.CompositeService.innerStart(CompositeService.java:65)
	at org.apache.hadoop.yarn.service.AbstractService.start(AbstractService.java:158)
	at org.apache.hadoop.mapred.MiniMRClientClusterFactory.create(MiniMRClientClusterFactory.java:80)
	at org.apache.hadoop.mapred.MiniMRCluster.<init>(MiniMRCluster.java:183)
	at org.apache.hadoop.mapred.MiniMRCluster.<init>(MiniMRCluster.java:171)
	at org.apache.hadoop.mapred.MiniMRCluster.<init>(MiniMRCluster.java:163)
	at org.apache.hadoop.mapred.ClusterMapReduceTestCase$ConfigurableMiniMRCluster.<init>(ClusterMapReduceTestCase.java:101)
	at org.apache.hadoop.mapred.ClusterMapReduceTestCase.startCluster(ClusterMapReduceTestCase.java:86)
	at org.apache.hadoop.mapred.ClusterMapReduceTestCase.setUp(ClusterMapReduceTestCase.java:56)
	at junit.framework.TestCase.runBare(TestCase.java:132)
	at junit.framework.TestResult$1.protect(TestResult.java:110)
	at junit.framework.TestResult.runProtected(TestResult.java:128)
	at junit.framework.TestResult.run(TestResult.java:113)
	at junit.framework.TestCase.run(TestCase.java:124)
	at junit.framework.TestSuite.runTest(TestSuite.java:243)
	at junit.framework.TestSuite.run(TestSuite.java:238)
	at org.junit.internal.runners.JUnit38ClassRunner.run(JUnit38ClassRunner.java:83)
	at org.apache.maven.surefire.junit4.JUnit4Provider.execute(JUnit4Provider.java:252)
	at org.apache.maven.surefire.junit4.JUnit4Provider.executeTestSet(JUnit4Provider.java:141)
	at org.apache.maven.surefire.junit4.JUnit4Provider.invoke(JUnit4Provider.java:112)
	at sun.reflect.NativeMethodAccessorImpl.invoke0(Native Method)
	at sun.reflect.NativeMethodAccessorImpl.invoke(NativeMethodAccessorImpl.java:39)
	at sun.reflect.DelegatingMethodAccessorImpl.invoke(DelegatingMethodAccessorImpl.java:25)
	at java.lang.reflect.Method.invoke(Method.java:597)
	at org.apache.maven.surefire.util.ReflectionUtils.invokeMethodWithArray(ReflectionUtils.java:189)
	at org.apache.maven.surefire.booter.ProviderFactory$ProviderProxy.invoke(ProviderFactory.java:165)
	at org.apache.maven.surefire.booter.ProviderFactory.invokeProvider(ProviderFactory.java:85)
	at org.apache.maven.surefire.booter.ForkedBooter.runSuitesInProcess(ForkedBooter.java:115)
	at org.apache.maven.surefire.booter.ForkedBooter.main(ForkedBooter.java:75)
Caused by: java.io.IOException: NodeManager 1 failed to start
	at org.apache.hadoop.yarn.server.MiniYARNCluster$NodeManagerWrapper.innerStart(MiniYARNCluster.java:321)
	... 30 more


FAILED:  org.apache.hadoop.mapred.TestClusterMapReduceTestCase.testMapReduceRestarting

Error Message:
java.io.IOException: NodeManager 1 failed to start

Stack Trace:
org.apache.hadoop.yarn.YarnException: java.io.IOException: NodeManager 1 failed to start
	at org.apache.hadoop.yarn.server.MiniYARNCluster$NodeManagerWrapper.innerStart(MiniYARNCluster.java:325)
	at org.apache.hadoop.yarn.service.AbstractService.start(AbstractService.java:158)
	at org.apache.hadoop.yarn.service.CompositeService.innerStart(CompositeService.java:65)
	at org.apache.hadoop.yarn.service.AbstractService.start(AbstractService.java:158)
	at org.apache.hadoop.mapred.MiniMRClientClusterFactory.create(MiniMRClientClusterFactory.java:80)
	at org.apache.hadoop.mapred.MiniMRCluster.<init>(MiniMRCluster.java:183)
	at org.apache.hadoop.mapred.MiniMRCluster.<init>(MiniMRCluster.java:171)
	at org.apache.hadoop.mapred.MiniMRCluster.<init>(MiniMRCluster.java:163)
	at org.apache.hadoop.mapred.ClusterMapReduceTestCase$ConfigurableMiniMRCluster.<init>(ClusterMapReduceTestCase.java:101)
	at org.apache.hadoop.mapred.ClusterMapReduceTestCase.startCluster(ClusterMapReduceTestCase.java:86)
	at org.apache.hadoop.mapred.ClusterMapReduceTestCase.setUp(ClusterMapReduceTestCase.java:56)
	at junit.framework.TestCase.runBare(TestCase.java:132)
	at junit.framework.TestResult$1.protect(TestResult.java:110)
	at junit.framework.TestResult.runProtected(TestResult.java:128)
	at junit.framework.TestResult.run(TestResult.java:113)
	at junit.framework.TestCase.run(TestCase.java:124)
	at junit.framework.TestSuite.runTest(TestSuite.java:243)
	at junit.framework.TestSuite.run(TestSuite.java:238)
	at org.junit.internal.runners.JUnit38ClassRunner.run(JUnit38ClassRunner.java:83)
	at org.apache.maven.surefire.junit4.JUnit4Provider.execute(JUnit4Provider.java:252)
	at org.apache.maven.surefire.junit4.JUnit4Provider.executeTestSet(JUnit4Provider.java:141)
	at org.apache.maven.surefire.junit4.JUnit4Provider.invoke(JUnit4Provider.java:112)
	at sun.reflect.NativeMethodAccessorImpl.invoke0(Native Method)
	at sun.reflect.NativeMethodAccessorImpl.invoke(NativeMethodAccessorImpl.java:39)
	at sun.reflect.DelegatingMethodAccessorImpl.invoke(DelegatingMethodAccessorImpl.java:25)
	at java.lang.reflect.Method.invoke(Method.java:597)
	at org.apache.maven.surefire.util.ReflectionUtils.invokeMethodWithArray(ReflectionUtils.java:189)
	at org.apache.maven.surefire.booter.ProviderFactory$ProviderProxy.invoke(ProviderFactory.java:165)
	at org.apache.maven.surefire.booter.ProviderFactory.invokeProvider(ProviderFactory.java:85)
	at org.apache.maven.surefire.booter.ForkedBooter.runSuitesInProcess(ForkedBooter.java:115)
	at org.apache.maven.surefire.booter.ForkedBooter.main(ForkedBooter.java:75)
Caused by: java.io.IOException: NodeManager 1 failed to start
	at org.apache.hadoop.yarn.server.MiniYARNCluster$NodeManagerWrapper.innerStart(MiniYARNCluster.java:321)
	... 30 more


FAILED:  org.apache.hadoop.mapred.TestClusterMapReduceTestCase.testDFSRestart

Error Message:
java.io.IOException: NodeManager 1 failed to start

Stack Trace:
org.apache.hadoop.yarn.YarnException: java.io.IOException: NodeManager 1 failed to start
	at org.apache.hadoop.yarn.server.MiniYARNCluster$NodeManagerWrapper.innerStart(MiniYARNCluster.java:325)
	at org.apache.hadoop.yarn.service.AbstractService.start(AbstractService.java:158)
	at org.apache.hadoop.yarn.service.CompositeService.innerStart(CompositeService.java:65)
	at org.apache.hadoop.yarn.service.AbstractService.start(AbstractService.java:158)
	at org.apache.hadoop.mapred.MiniMRClientClusterFactory.create(MiniMRClientClusterFactory.java:80)
	at org.apache.hadoop.mapred.MiniMRCluster.<init>(MiniMRCluster.java:183)
	at org.apache.hadoop.mapred.MiniMRCluster.<init>(MiniMRCluster.java:171)
	at org.apache.hadoop.mapred.MiniMRCluster.<init>(MiniMRCluster.java:163)
	at org.apache.hadoop.mapred.ClusterMapReduceTestCase$ConfigurableMiniMRCluster.<init>(ClusterMapReduceTestCase.java:101)
	at org.apache.hadoop.mapred.ClusterMapReduceTestCase.startCluster(ClusterMapReduceTestCase.java:86)
	at org.apache.hadoop.mapred.ClusterMapReduceTestCase.setUp(ClusterMapReduceTestCase.java:56)
	at junit.framework.TestCase.runBare(TestCase.java:132)
	at junit.framework.TestResult$1.protect(TestResult.java:110)
	at junit.framework.TestResult.runProtected(TestResult.java:128)
	at junit.framework.TestResult.run(TestResult.java:113)
	at junit.framework.TestCase.run(TestCase.java:124)
	at junit.framework.TestSuite.runTest(TestSuite.java:243)
	at junit.framework.TestSuite.run(TestSuite.java:238)
	at org.junit.internal.runners.JUnit38ClassRunner.run(JUnit38ClassRunner.java:83)
	at org.apache.maven.surefire.junit4.JUnit4Provider.execute(JUnit4Provider.java:252)
	at org.apache.maven.surefire.junit4.JUnit4Provider.executeTestSet(JUnit4Provider.java:141)
	at org.apache.maven.surefire.junit4.JUnit4Provider.invoke(JUnit4Provider.java:112)
	at sun.reflect.NativeMethodAccessorImpl.invoke0(Native Method)
	at sun.reflect.NativeMethodAccessorImpl.invoke(NativeMethodAccessorImpl.java:39)
	at sun.reflect.DelegatingMethodAccessorImpl.invoke(DelegatingMethodAccessorImpl.java:25)
	at java.lang.reflect.Method.invoke(Method.java:597)
	at org.apache.maven.surefire.util.ReflectionUtils.invokeMethodWithArray(ReflectionUtils.java:189)
	at org.apache.maven.surefire.booter.ProviderFactory$ProviderProxy.invoke(ProviderFactory.java:165)
	at org.apache.maven.surefire.booter.ProviderFactory.invokeProvider(ProviderFactory.java:85)
	at org.apache.maven.surefire.booter.ForkedBooter.runSuitesInProcess(ForkedBooter.java:115)
	at org.apache.maven.surefire.booter.ForkedBooter.main(ForkedBooter.java:75)
Caused by: java.io.IOException: NodeManager 1 failed to start
	at org.apache.hadoop.yarn.server.MiniYARNCluster$NodeManagerWrapper.innerStart(MiniYARNCluster.java:321)
	... 30 more


FAILED:  org.apache.hadoop.mapred.TestClusterMapReduceTestCase.testMRConfig

Error Message:
java.io.IOException: NodeManager 1 failed to start

Stack Trace:
org.apache.hadoop.yarn.YarnException: java.io.IOException: NodeManager 1 failed to start
	at org.apache.hadoop.yarn.server.MiniYARNCluster$NodeManagerWrapper.innerStart(MiniYARNCluster.java:325)
	at org.apache.hadoop.yarn.service.AbstractService.start(AbstractService.java:158)
	at org.apache.hadoop.yarn.service.CompositeService.innerStart(CompositeService.java:65)
	at org.apache.hadoop.yarn.service.AbstractService.start(AbstractService.java:158)
	at org.apache.hadoop.mapred.MiniMRClientClusterFactory.create(MiniMRClientClusterFactory.java:80)
	at org.apache.hadoop.mapred.MiniMRCluster.<init>(MiniMRCluster.java:183)
	at org.apache.hadoop.mapred.MiniMRCluster.<init>(MiniMRCluster.java:171)
	at org.apache.hadoop.mapred.MiniMRCluster.<init>(MiniMRCluster.java:163)
	at org.apache.hadoop.mapred.ClusterMapReduceTestCase$ConfigurableMiniMRCluster.<init>(ClusterMapReduceTestCase.java:101)
	at org.apache.hadoop.mapred.ClusterMapReduceTestCase.startCluster(ClusterMapReduceTestCase.java:86)
	at org.apache.hadoop.mapred.ClusterMapReduceTestCase.setUp(ClusterMapReduceTestCase.java:56)
	at junit.framework.TestCase.runBare(TestCase.java:132)
	at junit.framework.TestResult$1.protect(TestResult.java:110)
	at junit.framework.TestResult.runProtected(TestResult.java:128)
	at junit.framework.TestResult.run(TestResult.java:113)
	at junit.framework.TestCase.run(TestCase.java:124)
	at junit.framework.TestSuite.runTest(TestSuite.java:243)
	at junit.framework.TestSuite.run(TestSuite.java:238)
	at org.junit.internal.runners.JUnit38ClassRunner.run(JUnit38ClassRunner.java:83)
	at org.apache.maven.surefire.junit4.JUnit4Provider.execute(JUnit4Provider.java:252)
	at org.apache.maven.surefire.junit4.JUnit4Provider.executeTestSet(JUnit4Provider.java:141)
	at org.apache.maven.surefire.junit4.JUnit4Provider.invoke(JUnit4Provider.java:112)
	at sun.reflect.NativeMethodAccessorImpl.invoke0(Native Method)
	at sun.reflect.NativeMethodAccessorImpl.invoke(NativeMethodAccessorImpl.java:39)
	at sun.reflect.DelegatingMethodAccessorImpl.invoke(DelegatingMethodAccessorImpl.java:25)
	at java.lang.reflect.Method.invoke(Method.java:597)
	at org.apache.maven.surefire.util.ReflectionUtils.invokeMethodWithArray(ReflectionUtils.java:189)
	at org.apache.maven.surefire.booter.ProviderFactory$ProviderProxy.invoke(ProviderFactory.java:165)
	at org.apache.maven.surefire.booter.ProviderFactory.invokeProvider(ProviderFactory.java:85)
	at org.apache.maven.surefire.booter.ForkedBooter.runSuitesInProcess(ForkedBooter.java:115)
	at org.apache.maven.surefire.booter.ForkedBooter.main(ForkedBooter.java:75)
Caused by: java.io.IOException: NodeManager 1 failed to start
	at org.apache.hadoop.yarn.server.MiniYARNCluster$NodeManagerWrapper.innerStart(MiniYARNCluster.java:321)
	... 30 more


FAILED:  org.apache.hadoop.mapred.TestJobCleanup.testDefaultCleanupAndAbort

Error Message:
null

Stack Trace:
java.lang.reflect.UndeclaredThrowableException
	at org.apache.hadoop.yarn.exceptions.impl.pb.YarnRemoteExceptionPBImpl.unwrapAndThrowException(YarnRemoteExceptionPBImpl.java:135)
	at org.apache.hadoop.yarn.api.impl.pb.client.ClientRMProtocolPBClientImpl.getNewApplication(ClientRMProtocolPBClientImpl.java:162)
	at org.apache.hadoop.yarn.client.YarnClientImpl.getNewApplication(YarnClientImpl.java:121)
	at org.apache.hadoop.mapred.ResourceMgrDelegate.getNewJobID(ResourceMgrDelegate.java:102)
	at org.apache.hadoop.mapred.YARNRunner.getNewJobID(YARNRunner.java:215)
	at org.apache.hadoop.mapreduce.JobSubmitter.submitJobInternal(JobSubmitter.java:352)
	at org.apache.hadoop.mapreduce.Job$11.run(Job.java:1218)
	at org.apache.hadoop.mapreduce.Job$11.run(Job.java:1215)
	at java.security.AccessController.doPrivileged(Native Method)
	at javax.security.auth.Subject.doAs(Subject.java:396)
	at org.apache.hadoop.security.UserGroupInformation.doAs(UserGroupInformation.java:1489)
	at org.apache.hadoop.mapreduce.Job.submit(Job.java:1215)
	at org.apache.hadoop.mapred.JobClient$1.run(JobClient.java:581)
	at org.apache.hadoop.mapred.JobClient$1.run(JobClient.java:576)
	at java.security.AccessController.doPrivileged(Native Method)
	at javax.security.auth.Subject.doAs(Subject.java:396)
	at org.apache.hadoop.security.UserGroupInformation.doAs(UserGroupInformation.java:1489)
	at org.apache.hadoop.mapred.JobClient.submitJob(JobClient.java:576)
	at org.apache.hadoop.mapred.TestJobCleanup.testSuccessfulJob(TestJobCleanup.java:165)
	at org.apache.hadoop.mapred.TestJobCleanup.testDefaultCleanupAndAbort(TestJobCleanup.java:271)
	at sun.reflect.NativeMethodAccessorImpl.invoke0(Native Method)
	at sun.reflect.NativeMethodAccessorImpl.invoke(NativeMethodAccessorImpl.java:39)
	at sun.reflect.DelegatingMethodAccessorImpl.invoke(DelegatingMethodAccessorImpl.java:25)
	at java.lang.reflect.Method.invoke(Method.java:597)
	at org.junit.runners.model.FrameworkMethod$1.runReflectiveCall(FrameworkMethod.java:44)
	at org.junit.internal.runners.model.ReflectiveCallable.run(ReflectiveCallable.java:15)
	at org.junit.runners.model.FrameworkMethod.invokeExplosively(FrameworkMethod.java:41)
	at org.junit.internal.runners.statements.InvokeMethod.evaluate(InvokeMethod.java:20)
	at org.junit.runners.BlockJUnit4ClassRunner.runNotIgnored(BlockJUnit4ClassRunner.java:79)
	at org.junit.runners.BlockJUnit4ClassRunner.runChild(BlockJUnit4ClassRunner.java:71)
	at org.junit.runners.BlockJUnit4ClassRunner.runChild(BlockJUnit4ClassRunner.java:49)
	at org.junit.runners.ParentRunner$3.run(ParentRunner.java:193)
	at org.junit.runners.ParentRunner$1.schedule(ParentRunner.java:52)
	at org.junit.runners.ParentRunner.runChildren(ParentRunner.java:191)
	at org.junit.runners.ParentRunner.access$000(ParentRunner.java:42)
	at org.junit.runners.ParentRunner$2.evaluate(ParentRunner.java:184)
	at org.junit.internal.runners.statements.RunBefores.evaluate(RunBefores.java:28)
	at org.junit.internal.runners.statements.RunAfters.evaluate(RunAfters.java:31)
	at org.junit.runners.ParentRunner.run(ParentRunner.java:236)
	at org.apache.maven.surefire.junit4.JUnit4Provider.execute(JUnit4Provider.java:252)
	at org.apache.maven.surefire.junit4.JUnit4Provider.executeTestSet(JUnit4Provider.java:141)
	at org.apache.maven.surefire.junit4.JUnit4Provider.invoke(JUnit4Provider.java:112)
	at sun.reflect.NativeMethodAccessorImpl.invoke0(Native Method)
	at sun.reflect.NativeMethodAccessorImpl.invoke(NativeMethodAccessorImpl.java:39)
	at sun.reflect.DelegatingMethodAccessorImpl.invoke(DelegatingMethodAccessorImpl.java:25)
	at java.lang.reflect.Method.invoke(Method.java:597)
	at org.apache.maven.surefire.util.ReflectionUtils.invokeMethodWithArray(ReflectionUtils.java:189)
	at org.apache.maven.surefire.booter.ProviderFactory$ProviderProxy.invoke(ProviderFactory.java:165)
	at org.apache.maven.surefire.booter.ProviderFactory.invokeProvider(ProviderFactory.java:85)
	at org.apache.maven.surefire.booter.ForkedBooter.runSuitesInProcess(ForkedBooter.java:115)
	at org.apache.maven.surefire.booter.ForkedBooter.main(ForkedBooter.java:75)
Caused by: com.google.protobuf.ServiceException: java.net.ConnectException: Call From asf007.sp2.ygridcore.net/67.195.138.25 to 0.0.0.0:8032 failed on connection exception: java.net.ConnectException: Connection refused; For more details see:  http://wiki.apache.org/hadoop/ConnectionRefused
	at org.apache.hadoop.ipc.ProtobufRpcEngine$Invoker.invoke(ProtobufRpcEngine.java:214)
	at $Proxy73.getNewApplication(Unknown Source)
	at org.apache.hadoop.yarn.api.impl.pb.client.ClientRMProtocolPBClientImpl.getNewApplication(ClientRMProtocolPBClientImpl.java:159)
	... 49 more
Caused by: java.net.ConnectException: Call From asf007.sp2.ygridcore.net/67.195.138.25 to 0.0.0.0:8032 failed on connection exception: java.net.ConnectException: Connection refused; For more details see:  http://wiki.apache.org/hadoop/ConnectionRefused
	at sun.reflect.NativeConstructorAccessorImpl.newInstance0(Native Method)
	at sun.reflect.NativeConstructorAccessorImpl.newInstance(NativeConstructorAccessorImpl.java:39)
	at sun.reflect.DelegatingConstructorAccessorImpl.newInstance(DelegatingConstructorAccessorImpl.java:27)
	at java.lang.reflect.Constructor.newInstance(Constructor.java:513)
	at org.apache.hadoop.net.NetUtils.wrapWithMessage(NetUtils.java:780)
	at org.apache.hadoop.net.NetUtils.wrapException(NetUtils.java:727)
	at org.apache.hadoop.ipc.Client.call(Client.java:1305)
	at org.apache.hadoop.ipc.Client.call(Client.java:1253)
	at org.apache.hadoop.ipc.ProtobufRpcEngine$Invoker.invoke(ProtobufRpcEngine.java:204)
	... 51 more
Caused by: java.net.ConnectException: Connection refused
	at sun.nio.ch.SocketChannelImpl.checkConnect(Native Method)
	at sun.nio.ch.SocketChannelImpl.finishConnect(SocketChannelImpl.java:567)
	at org.apache.hadoop.net.SocketIOWithTimeout.connect(SocketIOWithTimeout.java:206)
	at org.apache.hadoop.net.NetUtils.connect(NetUtils.java:526)
	at org.apache.hadoop.net.NetUtils.connect(NetUtils.java:490)
	at org.apache.hadoop.ipc.Client$Connection.setupConnection(Client.java:511)
	at org.apache.hadoop.ipc.Client$Connection.setupIOstreams(Client.java:606)
	at org.apache.hadoop.ipc.Client$Connection.access$2100(Client.java:254)
	at org.apache.hadoop.ipc.Client.getConnection(Client.java:1354)
	at org.apache.hadoop.ipc.Client.call(Client.java:1272)
	... 53 more


FAILED:  org.apache.hadoop.mapred.TestJobCleanup.testCustomAbort

Error Message:
null

Stack Trace:
java.lang.reflect.UndeclaredThrowableException
	at org.apache.hadoop.yarn.exceptions.impl.pb.YarnRemoteExceptionPBImpl.unwrapAndThrowException(YarnRemoteExceptionPBImpl.java:135)
	at org.apache.hadoop.yarn.api.impl.pb.client.ClientRMProtocolPBClientImpl.getNewApplication(ClientRMProtocolPBClientImpl.java:162)
	at org.apache.hadoop.yarn.client.YarnClientImpl.getNewApplication(YarnClientImpl.java:121)
	at org.apache.hadoop.mapred.ResourceMgrDelegate.getNewJobID(ResourceMgrDelegate.java:102)
	at org.apache.hadoop.mapred.YARNRunner.getNewJobID(YARNRunner.java:215)
	at org.apache.hadoop.mapreduce.JobSubmitter.submitJobInternal(JobSubmitter.java:352)
	at org.apache.hadoop.mapreduce.Job$11.run(Job.java:1218)
	at org.apache.hadoop.mapreduce.Job$11.run(Job.java:1215)
	at java.security.AccessController.doPrivileged(Native Method)
	at javax.security.auth.Subject.doAs(Subject.java:396)
	at org.apache.hadoop.security.UserGroupInformation.doAs(UserGroupInformation.java:1489)
	at org.apache.hadoop.mapreduce.Job.submit(Job.java:1215)
	at org.apache.hadoop.mapred.JobClient$1.run(JobClient.java:581)
	at org.apache.hadoop.mapred.JobClient$1.run(JobClient.java:576)
	at java.security.AccessController.doPrivileged(Native Method)
	at javax.security.auth.Subject.doAs(Subject.java:396)
	at org.apache.hadoop.security.UserGroupInformation.doAs(UserGroupInformation.java:1489)
	at org.apache.hadoop.mapred.JobClient.submitJob(JobClient.java:576)
	at org.apache.hadoop.mapred.TestJobCleanup.testSuccessfulJob(TestJobCleanup.java:165)
	at org.apache.hadoop.mapred.TestJobCleanup.testCustomAbort(TestJobCleanup.java:291)
	at sun.reflect.NativeMethodAccessorImpl.invoke0(Native Method)
	at sun.reflect.NativeMethodAccessorImpl.invoke(NativeMethodAccessorImpl.java:39)
	at sun.reflect.DelegatingMethodAccessorImpl.invoke(DelegatingMethodAccessorImpl.java:25)
	at java.lang.reflect.Method.invoke(Method.java:597)
	at org.junit.runners.model.FrameworkMethod$1.runReflectiveCall(FrameworkMethod.java:44)
	at org.junit.internal.runners.model.ReflectiveCallable.run(ReflectiveCallable.java:15)
	at org.junit.runners.model.FrameworkMethod.invokeExplosively(FrameworkMethod.java:41)
	at org.junit.internal.runners.statements.InvokeMethod.evaluate(InvokeMethod.java:20)
	at org.junit.runners.BlockJUnit4ClassRunner.runNotIgnored(BlockJUnit4ClassRunner.java:79)
	at org.junit.runners.BlockJUnit4ClassRunner.runChild(BlockJUnit4ClassRunner.java:71)
	at org.junit.runners.BlockJUnit4ClassRunner.runChild(BlockJUnit4ClassRunner.java:49)
	at org.junit.runners.ParentRunner$3.run(ParentRunner.java:193)
	at org.junit.runners.ParentRunner$1.schedule(ParentRunner.java:52)
	at org.junit.runners.ParentRunner.runChildren(ParentRunner.java:191)
	at org.junit.runners.ParentRunner.access$000(ParentRunner.java:42)
	at org.junit.runners.ParentRunner$2.evaluate(ParentRunner.java:184)
	at org.junit.internal.runners.statements.RunBefores.evaluate(RunBefores.java:28)
	at org.junit.internal.runners.statements.RunAfters.evaluate(RunAfters.java:31)
	at org.junit.runners.ParentRunner.run(ParentRunner.java:236)
	at org.apache.maven.surefire.junit4.JUnit4Provider.execute(JUnit4Provider.java:252)
	at org.apache.maven.surefire.junit4.JUnit4Provider.executeTestSet(JUnit4Provider.java:141)
	at org.apache.maven.surefire.junit4.JUnit4Provider.invoke(JUnit4Provider.java:112)
	at sun.reflect.NativeMethodAccessorImpl.invoke0(Native Method)
	at sun.reflect.NativeMethodAccessorImpl.invoke(NativeMethodAccessorImpl.java:39)
	at sun.reflect.DelegatingMethodAccessorImpl.invoke(DelegatingMethodAccessorImpl.java:25)
	at java.lang.reflect.Method.invoke(Method.java:597)
	at org.apache.maven.surefire.util.ReflectionUtils.invokeMethodWithArray(ReflectionUtils.java:189)
	at org.apache.maven.surefire.booter.ProviderFactory$ProviderProxy.invoke(ProviderFactory.java:165)
	at org.apache.maven.surefire.booter.ProviderFactory.invokeProvider(ProviderFactory.java:85)
	at org.apache.maven.surefire.booter.ForkedBooter.runSuitesInProcess(ForkedBooter.java:115)
	at org.apache.maven.surefire.booter.ForkedBooter.main(ForkedBooter.java:75)
Caused by: com.google.protobuf.ServiceException: java.net.ConnectException: Call From asf007.sp2.ygridcore.net/67.195.138.25 to 0.0.0.0:8032 failed on connection exception: java.net.ConnectException: Connection refused; For more details see:  http://wiki.apache.org/hadoop/ConnectionRefused
	at org.apache.hadoop.ipc.ProtobufRpcEngine$Invoker.invoke(ProtobufRpcEngine.java:214)
	at $Proxy73.getNewApplication(Unknown Source)
	at org.apache.hadoop.yarn.api.impl.pb.client.ClientRMProtocolPBClientImpl.getNewApplication(ClientRMProtocolPBClientImpl.java:159)
	... 49 more
Caused by: java.net.ConnectException: Call From asf007.sp2.ygridcore.net/67.195.138.25 to 0.0.0.0:8032 failed on connection exception: java.net.ConnectException: Connection refused; For more details see:  http://wiki.apache.org/hadoop/ConnectionRefused
	at sun.reflect.NativeConstructorAccessorImpl.newInstance0(Native Method)
	at sun.reflect.NativeConstructorAccessorImpl.newInstance(NativeConstructorAccessorImpl.java:39)
	at sun.reflect.DelegatingConstructorAccessorImpl.newInstance(DelegatingConstructorAccessorImpl.java:27)
	at java.lang.reflect.Constructor.newInstance(Constructor.java:513)
	at org.apache.hadoop.net.NetUtils.wrapWithMessage(NetUtils.java:780)
	at org.apache.hadoop.net.NetUtils.wrapException(NetUtils.java:727)
	at org.apache.hadoop.ipc.Client.call(Client.java:1305)
	at org.apache.hadoop.ipc.Client.call(Client.java:1253)
	at org.apache.hadoop.ipc.ProtobufRpcEngine$Invoker.invoke(ProtobufRpcEngine.java:204)
	... 51 more
Caused by: java.net.ConnectException: Connection refused
	at sun.nio.ch.SocketChannelImpl.checkConnect(Native Method)
	at sun.nio.ch.SocketChannelImpl.finishConnect(SocketChannelImpl.java:567)
	at org.apache.hadoop.net.SocketIOWithTimeout.connect(SocketIOWithTimeout.java:206)
	at org.apache.hadoop.net.NetUtils.connect(NetUtils.java:526)
	at org.apache.hadoop.net.NetUtils.connect(NetUtils.java:490)
	at org.apache.hadoop.ipc.Client$Connection.setupConnection(Client.java:511)
	at org.apache.hadoop.ipc.Client$Connection.setupIOstreams(Client.java:606)
	at org.apache.hadoop.ipc.Client$Connection.access$2100(Client.java:254)
	at org.apache.hadoop.ipc.Client.getConnection(Client.java:1354)
	at org.apache.hadoop.ipc.Client.call(Client.java:1272)
	... 53 more


FAILED:  org.apache.hadoop.mapred.TestJobCleanup.testCustomCleanup

Error Message:
null

Stack Trace:
java.lang.reflect.UndeclaredThrowableException
	at org.apache.hadoop.yarn.exceptions.impl.pb.YarnRemoteExceptionPBImpl.unwrapAndThrowException(YarnRemoteExceptionPBImpl.java:135)
	at org.apache.hadoop.yarn.api.impl.pb.client.ClientRMProtocolPBClientImpl.getNewApplication(ClientRMProtocolPBClientImpl.java:162)
	at org.apache.hadoop.yarn.client.YarnClientImpl.getNewApplication(YarnClientImpl.java:121)
	at org.apache.hadoop.mapred.ResourceMgrDelegate.getNewJobID(ResourceMgrDelegate.java:102)
	at org.apache.hadoop.mapred.YARNRunner.getNewJobID(YARNRunner.java:215)
	at org.apache.hadoop.mapreduce.JobSubmitter.submitJobInternal(JobSubmitter.java:352)
	at org.apache.hadoop.mapreduce.Job$11.run(Job.java:1218)
	at org.apache.hadoop.mapreduce.Job$11.run(Job.java:1215)
	at java.security.AccessController.doPrivileged(Native Method)
	at javax.security.auth.Subject.doAs(Subject.java:396)
	at org.apache.hadoop.security.UserGroupInformation.doAs(UserGroupInformation.java:1489)
	at org.apache.hadoop.mapreduce.Job.submit(Job.java:1215)
	at org.apache.hadoop.mapred.JobClient$1.run(JobClient.java:581)
	at org.apache.hadoop.mapred.JobClient$1.run(JobClient.java:576)
	at java.security.AccessController.doPrivileged(Native Method)
	at javax.security.auth.Subject.doAs(Subject.java:396)
	at org.apache.hadoop.security.UserGroupInformation.doAs(UserGroupInformation.java:1489)
	at org.apache.hadoop.mapred.JobClient.submitJob(JobClient.java:576)
	at org.apache.hadoop.mapred.TestJobCleanup.testSuccessfulJob(TestJobCleanup.java:165)
	at org.apache.hadoop.mapred.TestJobCleanup.testCustomCleanup(TestJobCleanup.java:314)
	at sun.reflect.NativeMethodAccessorImpl.invoke0(Native Method)
	at sun.reflect.NativeMethodAccessorImpl.invoke(NativeMethodAccessorImpl.java:39)
	at sun.reflect.DelegatingMethodAccessorImpl.invoke(DelegatingMethodAccessorImpl.java:25)
	at java.lang.reflect.Method.invoke(Method.java:597)
	at org.junit.runners.model.FrameworkMethod$1.runReflectiveCall(FrameworkMethod.java:44)
	at org.junit.internal.runners.model.ReflectiveCallable.run(ReflectiveCallable.java:15)
	at org.junit.runners.model.FrameworkMethod.invokeExplosively(FrameworkMethod.java:41)
	at org.junit.internal.runners.statements.InvokeMethod.evaluate(InvokeMethod.java:20)
	at org.junit.runners.BlockJUnit4ClassRunner.runNotIgnored(BlockJUnit4ClassRunner.java:79)
	at org.junit.runners.BlockJUnit4ClassRunner.runChild(BlockJUnit4ClassRunner.java:71)
	at org.junit.runners.BlockJUnit4ClassRunner.runChild(BlockJUnit4ClassRunner.java:49)
	at org.junit.runners.ParentRunner$3.run(ParentRunner.java:193)
	at org.junit.runners.ParentRunner$1.schedule(ParentRunner.java:52)
	at org.junit.runners.ParentRunner.runChildren(ParentRunner.java:191)
	at org.junit.runners.ParentRunner.access$000(ParentRunner.java:42)
	at org.junit.runners.ParentRunner$2.evaluate(ParentRunner.java:184)
	at org.junit.internal.runners.statements.RunBefores.evaluate(RunBefores.java:28)
	at org.junit.internal.runners.statements.RunAfters.evaluate(RunAfters.java:31)
	at org.junit.runners.ParentRunner.run(ParentRunner.java:236)
	at org.apache.maven.surefire.junit4.JUnit4Provider.execute(JUnit4Provider.java:252)
	at org.apache.maven.surefire.junit4.JUnit4Provider.executeTestSet(JUnit4Provider.java:141)
	at org.apache.maven.surefire.junit4.JUnit4Provider.invoke(JUnit4Provider.java:112)
	at sun.reflect.NativeMethodAccessorImpl.invoke0(Native Method)
	at sun.reflect.NativeMethodAccessorImpl.invoke(NativeMethodAccessorImpl.java:39)
	at sun.reflect.DelegatingMethodAccessorImpl.invoke(DelegatingMethodAccessorImpl.java:25)
	at java.lang.reflect.Method.invoke(Method.java:597)
	at org.apache.maven.surefire.util.ReflectionUtils.invokeMethodWithArray(ReflectionUtils.java:189)
	at org.apache.maven.surefire.booter.ProviderFactory$ProviderProxy.invoke(ProviderFactory.java:165)
	at org.apache.maven.surefire.booter.ProviderFactory.invokeProvider(ProviderFactory.java:85)
	at org.apache.maven.surefire.booter.ForkedBooter.runSuitesInProcess(ForkedBooter.java:115)
	at org.apache.maven.surefire.booter.ForkedBooter.main(ForkedBooter.java:75)
Caused by: com.google.protobuf.ServiceException: java.net.ConnectException: Call From asf007.sp2.ygridcore.net/67.195.138.25 to 0.0.0.0:8032 failed on connection exception: java.net.ConnectException: Connection refused; For more details see:  http://wiki.apache.org/hadoop/ConnectionRefused
	at org.apache.hadoop.ipc.ProtobufRpcEngine$Invoker.invoke(ProtobufRpcEngine.java:214)
	at $Proxy73.getNewApplication(Unknown Source)
	at org.apache.hadoop.yarn.api.impl.pb.client.ClientRMProtocolPBClientImpl.getNewApplication(ClientRMProtocolPBClientImpl.java:159)
	... 49 more
Caused by: java.net.ConnectException: Call From asf007.sp2.ygridcore.net/67.195.138.25 to 0.0.0.0:8032 failed on connection exception: java.net.ConnectException: Connection refused; For more details see:  http://wiki.apache.org/hadoop/ConnectionRefused
	at sun.reflect.NativeConstructorAccessorImpl.newInstance0(Native Method)
	at sun.reflect.NativeConstructorAccessorImpl.newInstance(NativeConstructorAccessorImpl.java:39)
	at sun.reflect.DelegatingConstructorAccessorImpl.newInstance(DelegatingConstructorAccessorImpl.java:27)
	at java.lang.reflect.Constructor.newInstance(Constructor.java:513)
	at org.apache.hadoop.net.NetUtils.wrapWithMessage(NetUtils.java:780)
	at org.apache.hadoop.net.NetUtils.wrapException(NetUtils.java:727)
	at org.apache.hadoop.ipc.Client.call(Client.java:1305)
	at org.apache.hadoop.ipc.Client.call(Client.java:1253)
	at org.apache.hadoop.ipc.ProtobufRpcEngine$Invoker.invoke(ProtobufRpcEngine.java:204)
	... 51 more
Caused by: java.net.ConnectException: Connection refused
	at sun.nio.ch.SocketChannelImpl.checkConnect(Native Method)
	at sun.nio.ch.SocketChannelImpl.finishConnect(SocketChannelImpl.java:567)
	at org.apache.hadoop.net.SocketIOWithTimeout.connect(SocketIOWithTimeout.java:206)
	at org.apache.hadoop.net.NetUtils.connect(NetUtils.java:526)
	at org.apache.hadoop.net.NetUtils.connect(NetUtils.java:490)
	at org.apache.hadoop.ipc.Client$Connection.setupConnection(Client.java:511)
	at org.apache.hadoop.ipc.Client$Connection.setupIOstreams(Client.java:606)
	at org.apache.hadoop.ipc.Client$Connection.access$2100(Client.java:254)
	at org.apache.hadoop.ipc.Client.getConnection(Client.java:1354)
	at org.apache.hadoop.ipc.Client.call(Client.java:1272)
	... 53 more


FAILED:  org.apache.hadoop.mapred.TestJobCounters.testHeapUsageCounter

Error Message:
null

Stack Trace:
java.lang.reflect.UndeclaredThrowableException
	at org.apache.hadoop.yarn.exceptions.impl.pb.YarnRemoteExceptionPBImpl.unwrapAndThrowException(YarnRemoteExceptionPBImpl.java:135)
	at org.apache.hadoop.yarn.api.impl.pb.client.ClientRMProtocolPBClientImpl.getNewApplication(ClientRMProtocolPBClientImpl.java:162)
	at org.apache.hadoop.yarn.client.YarnClientImpl.getNewApplication(YarnClientImpl.java:121)
	at org.apache.hadoop.mapred.ResourceMgrDelegate.getNewJobID(ResourceMgrDelegate.java:102)
	at org.apache.hadoop.mapred.YARNRunner.getNewJobID(YARNRunner.java:215)
	at org.apache.hadoop.mapreduce.JobSubmitter.submitJobInternal(JobSubmitter.java:352)
	at org.apache.hadoop.mapreduce.Job$11.run(Job.java:1218)
	at org.apache.hadoop.mapreduce.Job$11.run(Job.java:1215)
	at java.security.AccessController.doPrivileged(Native Method)
	at javax.security.auth.Subject.doAs(Subject.java:396)
	at org.apache.hadoop.security.UserGroupInformation.doAs(UserGroupInformation.java:1489)
	at org.apache.hadoop.mapreduce.Job.submit(Job.java:1215)
	at org.apache.hadoop.mapred.JobClient$1.run(JobClient.java:581)
	at org.apache.hadoop.mapred.JobClient$1.run(JobClient.java:576)
	at java.security.AccessController.doPrivileged(Native Method)
	at javax.security.auth.Subject.doAs(Subject.java:396)
	at org.apache.hadoop.security.UserGroupInformation.doAs(UserGroupInformation.java:1489)
	at org.apache.hadoop.mapred.JobClient.submitJob(JobClient.java:576)
	at org.apache.hadoop.mapred.TestJobCounters.runHeapUsageTestJob(TestJobCounters.java:585)
	at org.apache.hadoop.mapred.TestJobCounters.testHeapUsageCounter(TestJobCounters.java:634)
	at sun.reflect.NativeMethodAccessorImpl.invoke0(Native Method)
	at sun.reflect.NativeMethodAccessorImpl.invoke(NativeMethodAccessorImpl.java:39)
	at sun.reflect.DelegatingMethodAccessorImpl.invoke(DelegatingMethodAccessorImpl.java:25)
	at java.lang.reflect.Method.invoke(Method.java:597)
	at org.junit.runners.model.FrameworkMethod$1.runReflectiveCall(FrameworkMethod.java:44)
	at org.junit.internal.runners.model.ReflectiveCallable.run(ReflectiveCallable.java:15)
	at org.junit.runners.model.FrameworkMethod.invokeExplosively(FrameworkMethod.java:41)
	at org.junit.internal.runners.statements.InvokeMethod.evaluate(InvokeMethod.java:20)
	at org.junit.runners.BlockJUnit4ClassRunner.runNotIgnored(BlockJUnit4ClassRunner.java:79)
	at org.junit.runners.BlockJUnit4ClassRunner.runChild(BlockJUnit4ClassRunner.java:71)
	at org.junit.runners.BlockJUnit4ClassRunner.runChild(BlockJUnit4ClassRunner.java:49)
	at org.junit.runners.ParentRunner$3.run(ParentRunner.java:193)
	at org.junit.runners.ParentRunner$1.schedule(ParentRunner.java:52)
	at org.junit.runners.ParentRunner.runChildren(ParentRunner.java:191)
	at org.junit.runners.ParentRunner.access$000(ParentRunner.java:42)
	at org.junit.runners.ParentRunner$2.evaluate(ParentRunner.java:184)
	at org.junit.internal.runners.statements.RunBefores.evaluate(RunBefores.java:28)
	at org.junit.internal.runners.statements.RunAfters.evaluate(RunAfters.java:31)
	at org.junit.runners.ParentRunner.run(ParentRunner.java:236)
	at org.apache.maven.surefire.junit4.JUnit4Provider.execute(JUnit4Provider.java:252)
	at org.apache.maven.surefire.junit4.JUnit4Provider.executeTestSet(JUnit4Provider.java:141)
	at org.apache.maven.surefire.junit4.JUnit4Provider.invoke(JUnit4Provider.java:112)
	at sun.reflect.NativeMethodAccessorImpl.invoke0(Native Method)
	at sun.reflect.NativeMethodAccessorImpl.invoke(NativeMethodAccessorImpl.java:39)
	at sun.reflect.DelegatingMethodAccessorImpl.invoke(DelegatingMethodAccessorImpl.java:25)
	at java.lang.reflect.Method.invoke(Method.java:597)
	at org.apache.maven.surefire.util.ReflectionUtils.invokeMethodWithArray(ReflectionUtils.java:189)
	at org.apache.maven.surefire.booter.ProviderFactory$ProviderProxy.invoke(ProviderFactory.java:165)
	at org.apache.maven.surefire.booter.ProviderFactory.invokeProvider(ProviderFactory.java:85)
	at org.apache.maven.surefire.booter.ForkedBooter.runSuitesInProcess(ForkedBooter.java:115)
	at org.apache.maven.surefire.booter.ForkedBooter.main(ForkedBooter.java:75)
Caused by: com.google.protobuf.ServiceException: java.net.ConnectException: Call From asf007.sp2.ygridcore.net/67.195.138.25 to 0.0.0.0:8032 failed on connection exception: java.net.ConnectException: Connection refused; For more details see:  http://wiki.apache.org/hadoop/ConnectionRefused
	at org.apache.hadoop.ipc.ProtobufRpcEngine$Invoker.invoke(ProtobufRpcEngine.java:214)
	at $Proxy73.getNewApplication(Unknown Source)
	at org.apache.hadoop.yarn.api.impl.pb.client.ClientRMProtocolPBClientImpl.getNewApplication(ClientRMProtocolPBClientImpl.java:159)
	... 49 more
Caused by: java.net.ConnectException: Call From asf007.sp2.ygridcore.net/67.195.138.25 to 0.0.0.0:8032 failed on connection exception: java.net.ConnectException: Connection refused; For more details see:  http://wiki.apache.org/hadoop/ConnectionRefused
	at sun.reflect.NativeConstructorAccessorImpl.newInstance0(Native Method)
	at sun.reflect.NativeConstructorAccessorImpl.newInstance(NativeConstructorAccessorImpl.java:39)
	at sun.reflect.DelegatingConstructorAccessorImpl.newInstance(DelegatingConstructorAccessorImpl.java:27)
	at java.lang.reflect.Constructor.newInstance(Constructor.java:513)
	at org.apache.hadoop.net.NetUtils.wrapWithMessage(NetUtils.java:780)
	at org.apache.hadoop.net.NetUtils.wrapException(NetUtils.java:727)
	at org.apache.hadoop.ipc.Client.call(Client.java:1305)
	at org.apache.hadoop.ipc.Client.call(Client.java:1253)
	at org.apache.hadoop.ipc.ProtobufRpcEngine$Invoker.invoke(ProtobufRpcEngine.java:204)
	... 51 more
Caused by: java.net.ConnectException: Connection refused
	at sun.nio.ch.SocketChannelImpl.checkConnect(Native Method)
	at sun.nio.ch.SocketChannelImpl.finishConnect(SocketChannelImpl.java:567)
	at org.apache.hadoop.net.SocketIOWithTimeout.connect(SocketIOWithTimeout.java:206)
	at org.apache.hadoop.net.NetUtils.connect(NetUtils.java:526)
	at org.apache.hadoop.net.NetUtils.connect(NetUtils.java:490)
	at org.apache.hadoop.ipc.Client$Connection.setupConnection(Client.java:511)
	at org.apache.hadoop.ipc.Client$Connection.setupIOstreams(Client.java:606)
	at org.apache.hadoop.ipc.Client$Connection.access$2100(Client.java:254)
	at org.apache.hadoop.ipc.Client.getConnection(Client.java:1354)
	at org.apache.hadoop.ipc.Client.call(Client.java:1272)
	... 53 more


FAILED:  org.apache.hadoop.mapred.TestJobName.testComplexName

Error Message:
java.io.IOException: NodeManager 1 failed to start

Stack Trace:
org.apache.hadoop.yarn.YarnException: java.io.IOException: NodeManager 1 failed to start
	at org.apache.hadoop.yarn.server.MiniYARNCluster$NodeManagerWrapper.innerStart(MiniYARNCluster.java:325)
	at org.apache.hadoop.yarn.service.AbstractService.start(AbstractService.java:158)
	at org.apache.hadoop.yarn.service.CompositeService.innerStart(CompositeService.java:65)
	at org.apache.hadoop.yarn.service.AbstractService.start(AbstractService.java:158)
	at org.apache.hadoop.mapred.MiniMRClientClusterFactory.create(MiniMRClientClusterFactory.java:80)
	at org.apache.hadoop.mapred.MiniMRCluster.<init>(MiniMRCluster.java:183)
	at org.apache.hadoop.mapred.MiniMRCluster.<init>(MiniMRCluster.java:171)
	at org.apache.hadoop.mapred.MiniMRCluster.<init>(MiniMRCluster.java:163)
	at org.apache.hadoop.mapred.ClusterMapReduceTestCase$ConfigurableMiniMRCluster.<init>(ClusterMapReduceTestCase.java:101)
	at org.apache.hadoop.mapred.ClusterMapReduceTestCase.startCluster(ClusterMapReduceTestCase.java:86)
	at org.apache.hadoop.mapred.ClusterMapReduceTestCase.setUp(ClusterMapReduceTestCase.java:56)
	at junit.framework.TestCase.runBare(TestCase.java:132)
	at junit.framework.TestResult$1.protect(TestResult.java:110)
	at junit.framework.TestResult.runProtected(TestResult.java:128)
	at junit.framework.TestResult.run(TestResult.java:113)
	at junit.framework.TestCase.run(TestCase.java:124)
	at junit.framework.TestSuite.runTest(TestSuite.java:243)
	at junit.framework.TestSuite.run(TestSuite.java:238)
	at org.junit.internal.runners.JUnit38ClassRunner.run(JUnit38ClassRunner.java:83)
	at org.apache.maven.surefire.junit4.JUnit4Provider.execute(JUnit4Provider.java:252)
	at org.apache.maven.surefire.junit4.JUnit4Provider.executeTestSet(JUnit4Provider.java:141)
	at org.apache.maven.surefire.junit4.JUnit4Provider.invoke(JUnit4Provider.java:112)
	at sun.reflect.NativeMethodAccessorImpl.invoke0(Native Method)
	at sun.reflect.NativeMethodAccessorImpl.invoke(NativeMethodAccessorImpl.java:39)
	at sun.reflect.DelegatingMethodAccessorImpl.invoke(DelegatingMethodAccessorImpl.java:25)
	at java.lang.reflect.Method.invoke(Method.java:597)
	at org.apache.maven.surefire.util.ReflectionUtils.invokeMethodWithArray(ReflectionUtils.java:189)
	at org.apache.maven.surefire.booter.ProviderFactory$ProviderProxy.invoke(ProviderFactory.java:165)
	at org.apache.maven.surefire.booter.ProviderFactory.invokeProvider(ProviderFactory.java:85)
	at org.apache.maven.surefire.booter.ForkedBooter.runSuitesInProcess(ForkedBooter.java:115)
	at org.apache.maven.surefire.booter.ForkedBooter.main(ForkedBooter.java:75)
Caused by: java.io.IOException: NodeManager 1 failed to start
	at org.apache.hadoop.yarn.server.MiniYARNCluster$NodeManagerWrapper.innerStart(MiniYARNCluster.java:321)
	... 30 more


FAILED:  org.apache.hadoop.mapred.TestJobName.testComplexNameWithRegex

Error Message:
java.io.IOException: NodeManager 1 failed to start

Stack Trace:
org.apache.hadoop.yarn.YarnException: java.io.IOException: NodeManager 1 failed to start
	at org.apache.hadoop.yarn.server.MiniYARNCluster$NodeManagerWrapper.innerStart(MiniYARNCluster.java:325)
	at org.apache.hadoop.yarn.service.AbstractService.start(AbstractService.java:158)
	at org.apache.hadoop.yarn.service.CompositeService.innerStart(CompositeService.java:65)
	at org.apache.hadoop.yarn.service.AbstractService.start(AbstractService.java:158)
	at org.apache.hadoop.mapred.MiniMRClientClusterFactory.create(MiniMRClientClusterFactory.java:80)
	at org.apache.hadoop.mapred.MiniMRCluster.<init>(MiniMRCluster.java:183)
	at org.apache.hadoop.mapred.MiniMRCluster.<init>(MiniMRCluster.java:171)
	at org.apache.hadoop.mapred.MiniMRCluster.<init>(MiniMRCluster.java:163)
	at org.apache.hadoop.mapred.ClusterMapReduceTestCase$ConfigurableMiniMRCluster.<init>(ClusterMapReduceTestCase.java:101)
	at org.apache.hadoop.mapred.ClusterMapReduceTestCase.startCluster(ClusterMapReduceTestCase.java:86)
	at org.apache.hadoop.mapred.ClusterMapReduceTestCase.setUp(ClusterMapReduceTestCase.java:56)
	at junit.framework.TestCase.runBare(TestCase.java:132)
	at junit.framework.TestResult$1.protect(TestResult.java:110)
	at junit.framework.TestResult.runProtected(TestResult.java:128)
	at junit.framework.TestResult.run(TestResult.java:113)
	at junit.framework.TestCase.run(TestCase.java:124)
	at junit.framework.TestSuite.runTest(TestSuite.java:243)
	at junit.framework.TestSuite.run(TestSuite.java:238)
	at org.junit.internal.runners.JUnit38ClassRunner.run(JUnit38ClassRunner.java:83)
	at org.apache.maven.surefire.junit4.JUnit4Provider.execute(JUnit4Provider.java:252)
	at org.apache.maven.surefire.junit4.JUnit4Provider.executeTestSet(JUnit4Provider.java:141)
	at org.apache.maven.surefire.junit4.JUnit4Provider.invoke(JUnit4Provider.java:112)
	at sun.reflect.NativeMethodAccessorImpl.invoke0(Native Method)
	at sun.reflect.NativeMethodAccessorImpl.invoke(NativeMethodAccessorImpl.java:39)
	at sun.reflect.DelegatingMethodAccessorImpl.invoke(DelegatingMethodAccessorImpl.java:25)
	at java.lang.reflect.Method.invoke(Method.java:597)
	at org.apache.maven.surefire.util.ReflectionUtils.invokeMethodWithArray(ReflectionUtils.java:189)
	at org.apache.maven.surefire.booter.ProviderFactory$ProviderProxy.invoke(ProviderFactory.java:165)
	at org.apache.maven.surefire.booter.ProviderFactory.invokeProvider(ProviderFactory.java:85)
	at org.apache.maven.surefire.booter.ForkedBooter.runSuitesInProcess(ForkedBooter.java:115)
	at org.apache.maven.surefire.booter.ForkedBooter.main(ForkedBooter.java:75)
Caused by: java.io.IOException: NodeManager 1 failed to start
	at org.apache.hadoop.yarn.server.MiniYARNCluster$NodeManagerWrapper.innerStart(MiniYARNCluster.java:321)
	... 30 more


FAILED:  org.apache.hadoop.mapred.TestJobSysDirWithDFS.testWithDFS

Error Message:
java.io.IOException: NodeManager 1 failed to start

Stack Trace:
org.apache.hadoop.yarn.YarnException: java.io.IOException: NodeManager 1 failed to start
	at org.apache.hadoop.yarn.server.MiniYARNCluster$NodeManagerWrapper.innerStart(MiniYARNCluster.java:325)
	at org.apache.hadoop.yarn.service.AbstractService.start(AbstractService.java:158)
	at org.apache.hadoop.yarn.service.CompositeService.innerStart(CompositeService.java:65)
	at org.apache.hadoop.yarn.service.AbstractService.start(AbstractService.java:158)
	at org.apache.hadoop.mapred.MiniMRClientClusterFactory.create(MiniMRClientClusterFactory.java:80)
	at org.apache.hadoop.mapred.MiniMRCluster.<init>(MiniMRCluster.java:183)
	at org.apache.hadoop.mapred.MiniMRCluster.<init>(MiniMRCluster.java:171)
	at org.apache.hadoop.mapred.MiniMRCluster.<init>(MiniMRCluster.java:163)
	at org.apache.hadoop.mapred.MiniMRCluster.<init>(MiniMRCluster.java:124)
	at org.apache.hadoop.mapred.TestJobSysDirWithDFS.testWithDFS(TestJobSysDirWithDFS.java:130)
	at sun.reflect.NativeMethodAccessorImpl.invoke0(Native Method)
	at sun.reflect.NativeMethodAccessorImpl.invoke(NativeMethodAccessorImpl.java:39)
	at sun.reflect.DelegatingMethodAccessorImpl.invoke(DelegatingMethodAccessorImpl.java:25)
	at java.lang.reflect.Method.invoke(Method.java:597)
	at junit.framework.TestCase.runTest(TestCase.java:168)
	at junit.framework.TestCase.runBare(TestCase.java:134)
	at junit.framework.TestResult$1.protect(TestResult.java:110)
	at junit.framework.TestResult.runProtected(TestResult.java:128)
	at junit.framework.TestResult.run(TestResult.java:113)
	at junit.framework.TestCase.run(TestCase.java:124)
	at junit.framework.TestSuite.runTest(TestSuite.java:243)
	at junit.framework.TestSuite.run(TestSuite.java:238)
	at org.junit.internal.runners.JUnit38ClassRunner.run(JUnit38ClassRunner.java:83)
	at org.apache.maven.surefire.junit4.JUnit4Provider.execute(JUnit4Provider.java:252)
	at org.apache.maven.surefire.junit4.JUnit4Provider.executeTestSet(JUnit4Provider.java:141)
	at org.apache.maven.surefire.junit4.JUnit4Provider.invoke(JUnit4Provider.java:112)
	at sun.reflect.NativeMethodAccessorImpl.invoke0(Native Method)
	at sun.reflect.NativeMethodAccessorImpl.invoke(NativeMethodAccessorImpl.java:39)
	at sun.reflect.DelegatingMethodAccessorImpl.invoke(DelegatingMethodAccessorImpl.java:25)
	at java.lang.reflect.Method.invoke(Method.java:597)
	at org.apache.maven.surefire.util.ReflectionUtils.invokeMethodWithArray(ReflectionUtils.java:189)
	at org.apache.maven.surefire.booter.ProviderFactory$ProviderProxy.invoke(ProviderFactory.java:165)
	at org.apache.maven.surefire.booter.ProviderFactory.invokeProvider(ProviderFactory.java:85)
	at org.apache.maven.surefire.booter.ForkedBooter.runSuitesInProcess(ForkedBooter.java:115)
	at org.apache.maven.surefire.booter.ForkedBooter.main(ForkedBooter.java:75)
Caused by: java.io.IOException: NodeManager 1 failed to start
	at org.apache.hadoop.yarn.server.MiniYARNCluster$NodeManagerWrapper.innerStart(MiniYARNCluster.java:321)
	... 34 more


FAILED:  org.apache.hadoop.mapred.TestLazyOutput.testLazyOutput

Error Message:
java.io.IOException: NodeManager 1 failed to start

Stack Trace:
org.apache.hadoop.yarn.YarnException: java.io.IOException: NodeManager 1 failed to start
	at org.apache.hadoop.yarn.server.MiniYARNCluster$NodeManagerWrapper.innerStart(MiniYARNCluster.java:325)
	at org.apache.hadoop.yarn.service.AbstractService.start(AbstractService.java:158)
	at org.apache.hadoop.yarn.service.CompositeService.innerStart(CompositeService.java:65)
	at org.apache.hadoop.yarn.service.AbstractService.start(AbstractService.java:158)
	at org.apache.hadoop.mapred.MiniMRClientClusterFactory.create(MiniMRClientClusterFactory.java:80)
	at org.apache.hadoop.mapred.MiniMRCluster.<init>(MiniMRCluster.java:183)
	at org.apache.hadoop.mapred.MiniMRCluster.<init>(MiniMRCluster.java:171)
	at org.apache.hadoop.mapred.MiniMRCluster.<init>(MiniMRCluster.java:163)
	at org.apache.hadoop.mapred.MiniMRCluster.<init>(MiniMRCluster.java:155)
	at org.apache.hadoop.mapred.MiniMRCluster.<init>(MiniMRCluster.java:148)
	at org.apache.hadoop.mapred.MiniMRCluster.<init>(MiniMRCluster.java:141)
	at org.apache.hadoop.mapred.MiniMRCluster.<init>(MiniMRCluster.java:134)
	at org.apache.hadoop.mapred.MiniMRCluster.<init>(MiniMRCluster.java:129)
	at org.apache.hadoop.mapred.TestLazyOutput.testLazyOutput(TestLazyOutput.java:146)
	at sun.reflect.NativeMethodAccessorImpl.invoke0(Native Method)
	at sun.reflect.NativeMethodAccessorImpl.invoke(NativeMethodAccessorImpl.java:39)
	at sun.reflect.DelegatingMethodAccessorImpl.invoke(DelegatingMethodAccessorImpl.java:25)
	at java.lang.reflect.Method.invoke(Method.java:597)
	at junit.framework.TestCase.runTest(TestCase.java:168)
	at junit.framework.TestCase.runBare(TestCase.java:134)
	at junit.framework.TestResult$1.protect(TestResult.java:110)
	at junit.framework.TestResult.runProtected(TestResult.java:128)
	at junit.framework.TestResult.run(TestResult.java:113)
	at junit.framework.TestCase.run(TestCase.java:124)
	at junit.framework.TestSuite.runTest(TestSuite.java:243)
	at junit.framework.TestSuite.run(TestSuite.java:238)
	at org.junit.internal.runners.JUnit38ClassRunner.run(JUnit38ClassRunner.java:83)
	at org.apache.maven.surefire.junit4.JUnit4Provider.execute(JUnit4Provider.java:252)
	at org.apache.maven.surefire.junit4.JUnit4Provider.executeTestSet(JUnit4Provider.java:141)
	at org.apache.maven.surefire.junit4.JUnit4Provider.invoke(JUnit4Provider.java:112)
	at sun.reflect.NativeMethodAccessorImpl.invoke0(Native Method)
	at sun.reflect.NativeMethodAccessorImpl.invoke(NativeMethodAccessorImpl.java:39)
	at sun.reflect.DelegatingMethodAccessorImpl.invoke(DelegatingMethodAccessorImpl.java:25)
	at java.lang.reflect.Method.invoke(Method.java:597)
	at org.apache.maven.surefire.util.ReflectionUtils.invokeMethodWithArray(ReflectionUtils.java:189)
	at org.apache.maven.surefire.booter.ProviderFactory$ProviderProxy.invoke(ProviderFactory.java:165)
	at org.apache.maven.surefire.booter.ProviderFactory.invokeProvider(ProviderFactory.java:85)
	at org.apache.maven.surefire.booter.ForkedBooter.runSuitesInProcess(ForkedBooter.java:115)
	at org.apache.maven.surefire.booter.ForkedBooter.main(ForkedBooter.java:75)
Caused by: java.io.IOException: NodeManager 1 failed to start
	at org.apache.hadoop.yarn.server.MiniYARNCluster$NodeManagerWrapper.innerStart(MiniYARNCluster.java:321)
	... 38 more


FAILED:  org.apache.hadoop.mapred.TestMerge.testMerge

Error Message:
java.io.IOException: NodeManager 1 failed to start

Stack Trace:
org.apache.hadoop.yarn.YarnException: java.io.IOException: NodeManager 1 failed to start
	at org.apache.hadoop.yarn.server.MiniYARNCluster$NodeManagerWrapper.innerStart(MiniYARNCluster.java:325)
	at org.apache.hadoop.yarn.service.AbstractService.start(AbstractService.java:158)
	at org.apache.hadoop.yarn.service.CompositeService.innerStart(CompositeService.java:65)
	at org.apache.hadoop.yarn.service.AbstractService.start(AbstractService.java:158)
	at org.apache.hadoop.mapred.MiniMRClientClusterFactory.create(MiniMRClientClusterFactory.java:80)
	at org.apache.hadoop.mapred.MiniMRClientClusterFactory.create(MiniMRClientClusterFactory.java:41)
	at org.apache.hadoop.mapred.TestMerge.testMerge(TestMerge.java:81)
	at sun.reflect.NativeMethodAccessorImpl.invoke0(Native Method)
	at sun.reflect.NativeMethodAccessorImpl.invoke(NativeMethodAccessorImpl.java:39)
	at sun.reflect.DelegatingMethodAccessorImpl.invoke(DelegatingMethodAccessorImpl.java:25)
	at java.lang.reflect.Method.invoke(Method.java:597)
	at junit.framework.TestCase.runTest(TestCase.java:168)
	at junit.framework.TestCase.runBare(TestCase.java:134)
	at junit.framework.TestResult$1.protect(TestResult.java:110)
	at junit.framework.TestResult.runProtected(TestResult.java:128)
	at junit.framework.TestResult.run(TestResult.java:113)
	at junit.framework.TestCase.run(TestCase.java:124)
	at junit.framework.TestSuite.runTest(TestSuite.java:243)
	at junit.framework.TestSuite.run(TestSuite.java:238)
	at org.junit.internal.runners.JUnit38ClassRunner.run(JUnit38ClassRunner.java:83)
	at org.apache.maven.surefire.junit4.JUnit4Provider.execute(JUnit4Provider.java:252)
	at org.apache.maven.surefire.junit4.JUnit4Provider.executeTestSet(JUnit4Provider.java:141)
	at org.apache.maven.surefire.junit4.JUnit4Provider.invoke(JUnit4Provider.java:112)
	at sun.reflect.NativeMethodAccessorImpl.invoke0(Native Method)
	at sun.reflect.NativeMethodAccessorImpl.invoke(NativeMethodAccessorImpl.java:39)
	at sun.reflect.DelegatingMethodAccessorImpl.invoke(DelegatingMethodAccessorImpl.java:25)
	at java.lang.reflect.Method.invoke(Method.java:597)
	at org.apache.maven.surefire.util.ReflectionUtils.invokeMethodWithArray(ReflectionUtils.java:189)
	at org.apache.maven.surefire.booter.ProviderFactory$ProviderProxy.invoke(ProviderFactory.java:165)
	at org.apache.maven.surefire.booter.ProviderFactory.invokeProvider(ProviderFactory.java:85)
	at org.apache.maven.surefire.booter.ForkedBooter.runSuitesInProcess(ForkedBooter.java:115)
	at org.apache.maven.surefire.booter.ForkedBooter.main(ForkedBooter.java:75)
Caused by: java.io.IOException: NodeManager 1 failed to start
	at org.apache.hadoop.yarn.server.MiniYARNCluster$NodeManagerWrapper.innerStart(MiniYARNCluster.java:321)
	... 31 more


FAILED:  org.apache.hadoop.mapred.TestMiniMRChildTask.testTaskTempDir

Error Message:
Exception in testing temp dir

Stack Trace:
java.lang.AssertionError: Exception in testing temp dir
	at org.junit.Assert.fail(Assert.java:91)
	at org.apache.hadoop.mapred.TestMiniMRChildTask.testTaskTempDir(TestMiniMRChildTask.java:366)
	at sun.reflect.NativeMethodAccessorImpl.invoke0(Native Method)
	at sun.reflect.NativeMethodAccessorImpl.invoke(NativeMethodAccessorImpl.java:39)
	at sun.reflect.DelegatingMethodAccessorImpl.invoke(DelegatingMethodAccessorImpl.java:25)
	at java.lang.reflect.Method.invoke(Method.java:597)
	at org.junit.runners.model.FrameworkMethod$1.runReflectiveCall(FrameworkMethod.java:44)
	at org.junit.internal.runners.model.ReflectiveCallable.run(ReflectiveCallable.java:15)
	at org.junit.runners.model.FrameworkMethod.invokeExplosively(FrameworkMethod.java:41)
	at org.junit.internal.runners.statements.InvokeMethod.evaluate(InvokeMethod.java:20)
	at org.junit.runners.BlockJUnit4ClassRunner.runNotIgnored(BlockJUnit4ClassRunner.java:79)
	at org.junit.runners.BlockJUnit4ClassRunner.runChild(BlockJUnit4ClassRunner.java:71)
	at org.junit.runners.BlockJUnit4ClassRunner.runChild(BlockJUnit4ClassRunner.java:49)
	at org.junit.runners.ParentRunner$3.run(ParentRunner.java:193)
	at org.junit.runners.ParentRunner$1.schedule(ParentRunner.java:52)
	at org.junit.runners.ParentRunner.runChildren(ParentRunner.java:191)
	at org.junit.runners.ParentRunner.access$000(ParentRunner.java:42)
	at org.junit.runners.ParentRunner$2.evaluate(ParentRunner.java:184)
	at org.junit.internal.runners.statements.RunBefores.evaluate(RunBefores.java:28)
	at org.junit.internal.runners.statements.RunAfters.evaluate(RunAfters.java:31)
	at org.junit.runners.ParentRunner.run(ParentRunner.java:236)
	at org.apache.maven.surefire.junit4.JUnit4Provider.execute(JUnit4Provider.java:252)
	at org.apache.maven.surefire.junit4.JUnit4Provider.executeTestSet(JUnit4Provider.java:141)
	at org.apache.maven.surefire.junit4.JUnit4Provider.invoke(JUnit4Provider.java:112)
	at sun.reflect.NativeMethodAccessorImpl.invoke0(Native Method)
	at sun.reflect.NativeMethodAccessorImpl.invoke(NativeMethodAccessorImpl.java:39)
	at sun.reflect.DelegatingMethodAccessorImpl.invoke(DelegatingMethodAccessorImpl.java:25)
	at java.lang.reflect.Method.invoke(Method.java:597)
	at org.apache.maven.surefire.util.ReflectionUtils.invokeMethodWithArray(ReflectionUtils.java:189)
	at org.apache.maven.surefire.booter.ProviderFactory$ProviderProxy.invoke(ProviderFactory.java:165)
	at org.apache.maven.surefire.booter.ProviderFactory.invokeProvider(ProviderFactory.java:85)
	at org.apache.maven.surefire.booter.ForkedBooter.runSuitesInProcess(ForkedBooter.java:115)
	at org.apache.maven.surefire.booter.ForkedBooter.main(ForkedBooter.java:75)


FAILED:  org.apache.hadoop.mapred.TestMiniMRChildTask.testTaskEnv

Error Message:
Exception in testing child env

Stack Trace:
java.lang.AssertionError: Exception in testing child env
	at org.junit.Assert.fail(Assert.java:91)
	at org.apache.hadoop.mapred.TestMiniMRChildTask.testTaskEnv(TestMiniMRChildTask.java:389)
	at sun.reflect.NativeMethodAccessorImpl.invoke0(Native Method)
	at sun.reflect.NativeMethodAccessorImpl.invoke(NativeMethodAccessorImpl.java:39)
	at sun.reflect.DelegatingMethodAccessorImpl.invoke(DelegatingMethodAccessorImpl.java:25)
	at java.lang.reflect.Method.invoke(Method.java:597)
	at org.junit.runners.model.FrameworkMethod$1.runReflectiveCall(FrameworkMethod.java:44)
	at org.junit.internal.runners.model.ReflectiveCallable.run(ReflectiveCallable.java:15)
	at org.junit.runners.model.FrameworkMethod.invokeExplosively(FrameworkMethod.java:41)
	at org.junit.internal.runners.statements.InvokeMethod.evaluate(InvokeMethod.java:20)
	at org.junit.runners.BlockJUnit4ClassRunner.runNotIgnored(BlockJUnit4ClassRunner.java:79)
	at org.junit.runners.BlockJUnit4ClassRunner.runChild(BlockJUnit4ClassRunner.java:71)
	at org.junit.runners.BlockJUnit4ClassRunner.runChild(BlockJUnit4ClassRunner.java:49)
	at org.junit.runners.ParentRunner$3.run(ParentRunner.java:193)
	at org.junit.runners.ParentRunner$1.schedule(ParentRunner.java:52)
	at org.junit.runners.ParentRunner.runChildren(ParentRunner.java:191)
	at org.junit.runners.ParentRunner.access$000(ParentRunner.java:42)
	at org.junit.runners.ParentRunner$2.evaluate(ParentRunner.java:184)
	at org.junit.internal.runners.statements.RunBefores.evaluate(RunBefores.java:28)
	at org.junit.internal.runners.statements.RunAfters.evaluate(RunAfters.java:31)
	at org.junit.runners.ParentRunner.run(ParentRunner.java:236)
	at org.apache.maven.surefire.junit4.JUnit4Provider.execute(JUnit4Provider.java:252)
	at org.apache.maven.surefire.junit4.JUnit4Provider.executeTestSet(JUnit4Provider.java:141)
	at org.apache.maven.surefire.junit4.JUnit4Provider.invoke(JUnit4Provider.java:112)
	at sun.reflect.NativeMethodAccessorImpl.invoke0(Native Method)
	at sun.reflect.NativeMethodAccessorImpl.invoke(NativeMethodAccessorImpl.java:39)
	at sun.reflect.DelegatingMethodAccessorImpl.invoke(DelegatingMethodAccessorImpl.java:25)
	at java.lang.reflect.Method.invoke(Method.java:597)
	at org.apache.maven.surefire.util.ReflectionUtils.invokeMethodWithArray(ReflectionUtils.java:189)
	at org.apache.maven.surefire.booter.ProviderFactory$ProviderProxy.invoke(ProviderFactory.java:165)
	at org.apache.maven.surefire.booter.ProviderFactory.invokeProvider(ProviderFactory.java:85)
	at org.apache.maven.surefire.booter.ForkedBooter.runSuitesInProcess(ForkedBooter.java:115)
	at org.apache.maven.surefire.booter.ForkedBooter.main(ForkedBooter.java:75)


FAILED:  org.apache.hadoop.mapred.TestMiniMRChildTask.testTaskOldEnv

Error Message:
Exception in testing child env

Stack Trace:
java.lang.AssertionError: Exception in testing child env
	at org.junit.Assert.fail(Assert.java:91)
	at org.apache.hadoop.mapred.TestMiniMRChildTask.testTaskOldEnv(TestMiniMRChildTask.java:412)
	at sun.reflect.NativeMethodAccessorImpl.invoke0(Native Method)
	at sun.reflect.NativeMethodAccessorImpl.invoke(NativeMethodAccessorImpl.java:39)
	at sun.reflect.DelegatingMethodAccessorImpl.invoke(DelegatingMethodAccessorImpl.java:25)
	at java.lang.reflect.Method.invoke(Method.java:597)
	at org.junit.runners.model.FrameworkMethod$1.runReflectiveCall(FrameworkMethod.java:44)
	at org.junit.internal.runners.model.ReflectiveCallable.run(ReflectiveCallable.java:15)
	at org.junit.runners.model.FrameworkMethod.invokeExplosively(FrameworkMethod.java:41)
	at org.junit.internal.runners.statements.InvokeMethod.evaluate(InvokeMethod.java:20)
	at org.junit.runners.BlockJUnit4ClassRunner.runNotIgnored(BlockJUnit4ClassRunner.java:79)
	at org.junit.runners.BlockJUnit4ClassRunner.runChild(BlockJUnit4ClassRunner.java:71)
	at org.junit.runners.BlockJUnit4ClassRunner.runChild(BlockJUnit4ClassRunner.java:49)
	at org.junit.runners.ParentRunner$3.run(ParentRunner.java:193)
	at org.junit.runners.ParentRunner$1.schedule(ParentRunner.java:52)
	at org.junit.runners.ParentRunner.runChildren(ParentRunner.java:191)
	at org.junit.runners.ParentRunner.access$000(ParentRunner.java:42)
	at org.junit.runners.ParentRunner$2.evaluate(ParentRunner.java:184)
	at org.junit.internal.runners.statements.RunBefores.evaluate(RunBefores.java:28)
	at org.junit.internal.runners.statements.RunAfters.evaluate(RunAfters.java:31)
	at org.junit.runners.ParentRunner.run(ParentRunner.java:236)
	at org.apache.maven.surefire.junit4.JUnit4Provider.execute(JUnit4Provider.java:252)
	at org.apache.maven.surefire.junit4.JUnit4Provider.executeTestSet(JUnit4Provider.java:141)
	at org.apache.maven.surefire.junit4.JUnit4Provider.invoke(JUnit4Provider.java:112)
	at sun.reflect.NativeMethodAccessorImpl.invoke0(Native Method)
	at sun.reflect.NativeMethodAccessorImpl.invoke(NativeMethodAccessorImpl.java:39)
	at sun.reflect.DelegatingMethodAccessorImpl.invoke(DelegatingMethodAccessorImpl.java:25)
	at java.lang.reflect.Method.invoke(Method.java:597)
	at org.apache.maven.surefire.util.ReflectionUtils.invokeMethodWithArray(ReflectionUtils.java:189)
	at org.apache.maven.surefire.booter.ProviderFactory$ProviderProxy.invoke(ProviderFactory.java:165)
	at org.apache.maven.surefire.booter.ProviderFactory.invokeProvider(ProviderFactory.java:85)
	at org.apache.maven.surefire.booter.ForkedBooter.runSuitesInProcess(ForkedBooter.java:115)
	at org.apache.maven.surefire.booter.ForkedBooter.main(ForkedBooter.java:75)


FAILED:  org.apache.hadoop.mapred.TestMiniMRClasspath.testClassPath

Error Message:
java.io.IOException: NodeManager 1 failed to start

Stack Trace:
org.apache.hadoop.yarn.YarnException: java.io.IOException: NodeManager 1 failed to start
	at org.apache.hadoop.yarn.server.MiniYARNCluster$NodeManagerWrapper.innerStart(MiniYARNCluster.java:325)
	at org.apache.hadoop.yarn.service.AbstractService.start(AbstractService.java:158)
	at org.apache.hadoop.yarn.service.CompositeService.innerStart(CompositeService.java:65)
	at org.apache.hadoop.yarn.service.AbstractService.start(AbstractService.java:158)
	at org.apache.hadoop.mapred.MiniMRClientClusterFactory.create(MiniMRClientClusterFactory.java:80)
	at org.apache.hadoop.mapred.MiniMRCluster.<init>(MiniMRCluster.java:183)
	at org.apache.hadoop.mapred.MiniMRCluster.<init>(MiniMRCluster.java:171)
	at org.apache.hadoop.mapred.MiniMRCluster.<init>(MiniMRCluster.java:163)
	at org.apache.hadoop.mapred.MiniMRCluster.<init>(MiniMRCluster.java:155)
	at org.apache.hadoop.mapred.MiniMRCluster.<init>(MiniMRCluster.java:148)
	at org.apache.hadoop.mapred.MiniMRCluster.<init>(MiniMRCluster.java:141)
	at org.apache.hadoop.mapred.MiniMRCluster.<init>(MiniMRCluster.java:134)
	at org.apache.hadoop.mapred.MiniMRCluster.<init>(MiniMRCluster.java:129)
	at org.apache.hadoop.mapred.TestMiniMRClasspath.testClassPath(TestMiniMRClasspath.java:175)
	at sun.reflect.NativeMethodAccessorImpl.invoke0(Native Method)
	at sun.reflect.NativeMethodAccessorImpl.invoke(NativeMethodAccessorImpl.java:39)
	at sun.reflect.DelegatingMethodAccessorImpl.invoke(DelegatingMethodAccessorImpl.java:25)
	at java.lang.reflect.Method.invoke(Method.java:597)
	at org.junit.runners.model.FrameworkMethod$1.runReflectiveCall(FrameworkMethod.java:44)
	at org.junit.internal.runners.model.ReflectiveCallable.run(ReflectiveCallable.java:15)
	at org.junit.runners.model.FrameworkMethod.invokeExplosively(FrameworkMethod.java:41)
	at org.junit.internal.runners.statements.InvokeMethod.evaluate(InvokeMethod.java:20)
	at org.junit.runners.BlockJUnit4ClassRunner.runNotIgnored(BlockJUnit4ClassRunner.java:79)
	at org.junit.runners.BlockJUnit4ClassRunner.runChild(BlockJUnit4ClassRunner.java:71)
	at org.junit.runners.BlockJUnit4ClassRunner.runChild(BlockJUnit4ClassRunner.java:49)
	at org.junit.runners.ParentRunner$3.run(ParentRunner.java:193)
	at org.junit.runners.ParentRunner$1.schedule(ParentRunner.java:52)
	at org.junit.runners.ParentRunner.runChildren(ParentRunner.java:191)
	at org.junit.runners.ParentRunner.access$000(ParentRunner.java:42)
	at org.junit.runners.ParentRunner$2.evaluate(ParentRunner.java:184)
	at org.junit.runners.ParentRunner.run(ParentRunner.java:236)
	at org.apache.maven.surefire.junit4.JUnit4Provider.execute(JUnit4Provider.java:252)
	at org.apache.maven.surefire.junit4.JUnit4Provider.executeTestSet(JUnit4Provider.java:141)
	at org.apache.maven.surefire.junit4.JUnit4Provider.invoke(JUnit4Provider.java:112)
	at sun.reflect.NativeMethodAccessorImpl.invoke0(Native Method)
	at sun.reflect.NativeMethodAccessorImpl.invoke(NativeMethodAccessorImpl.java:39)
	at sun.reflect.DelegatingMethodAccessorImpl.invoke(DelegatingMethodAccessorImpl.java:25)
	at java.lang.reflect.Method.invoke(Method.java:597)
	at org.apache.maven.surefire.util.ReflectionUtils.invokeMethodWithArray(ReflectionUtils.java:189)
	at org.apache.maven.surefire.booter.ProviderFactory$ProviderProxy.invoke(ProviderFactory.java:165)
	at org.apache.maven.surefire.booter.ProviderFactory.invokeProvider(ProviderFactory.java:85)
	at org.apache.maven.surefire.booter.ForkedBooter.runSuitesInProcess(ForkedBooter.java:115)
	at org.apache.maven.surefire.booter.ForkedBooter.main(ForkedBooter.java:75)
Caused by: java.io.IOException: NodeManager 1 failed to start
	at org.apache.hadoop.yarn.server.MiniYARNCluster$NodeManagerWrapper.innerStart(MiniYARNCluster.java:321)
	... 42 more


FAILED:  org.apache.hadoop.mapred.TestMiniMRClasspath.testExternalWritable

Error Message:
java.io.IOException: NodeManager 1 failed to start

Stack Trace:
org.apache.hadoop.yarn.YarnException: java.io.IOException: NodeManager 1 failed to start
	at org.apache.hadoop.yarn.server.MiniYARNCluster$NodeManagerWrapper.innerStart(MiniYARNCluster.java:325)
	at org.apache.hadoop.yarn.service.AbstractService.start(AbstractService.java:158)
	at org.apache.hadoop.yarn.service.CompositeService.innerStart(CompositeService.java:65)
	at org.apache.hadoop.yarn.service.AbstractService.start(AbstractService.java:158)
	at org.apache.hadoop.mapred.MiniMRClientClusterFactory.create(MiniMRClientClusterFactory.java:80)
	at org.apache.hadoop.mapred.MiniMRCluster.<init>(MiniMRCluster.java:183)
	at org.apache.hadoop.mapred.MiniMRCluster.<init>(MiniMRCluster.java:171)
	at org.apache.hadoop.mapred.MiniMRCluster.<init>(MiniMRCluster.java:163)
	at org.apache.hadoop.mapred.MiniMRCluster.<init>(MiniMRCluster.java:155)
	at org.apache.hadoop.mapred.MiniMRCluster.<init>(MiniMRCluster.java:148)
	at org.apache.hadoop.mapred.MiniMRCluster.<init>(MiniMRCluster.java:141)
	at org.apache.hadoop.mapred.MiniMRCluster.<init>(MiniMRCluster.java:134)
	at org.apache.hadoop.mapred.MiniMRCluster.<init>(MiniMRCluster.java:129)
	at org.apache.hadoop.mapred.TestMiniMRClasspath.testExternalWritable(TestMiniMRClasspath.java:207)
	at sun.reflect.NativeMethodAccessorImpl.invoke0(Native Method)
	at sun.reflect.NativeMethodAccessorImpl.invoke(NativeMethodAccessorImpl.java:39)
	at sun.reflect.DelegatingMethodAccessorImpl.invoke(DelegatingMethodAccessorImpl.java:25)
	at java.lang.reflect.Method.invoke(Method.java:597)
	at org.junit.runners.model.FrameworkMethod$1.runReflectiveCall(FrameworkMethod.java:44)
	at org.junit.internal.runners.model.ReflectiveCallable.run(ReflectiveCallable.java:15)
	at org.junit.runners.model.FrameworkMethod.invokeExplosively(FrameworkMethod.java:41)
	at org.junit.internal.runners.statements.InvokeMethod.evaluate(InvokeMethod.java:20)
	at org.junit.runners.BlockJUnit4ClassRunner.runNotIgnored(BlockJUnit4ClassRunner.java:79)
	at org.junit.runners.BlockJUnit4ClassRunner.runChild(BlockJUnit4ClassRunner.java:71)
	at org.junit.runners.BlockJUnit4ClassRunner.runChild(BlockJUnit4ClassRunner.java:49)
	at org.junit.runners.ParentRunner$3.run(ParentRunner.java:193)
	at org.junit.runners.ParentRunner$1.schedule(ParentRunner.java:52)
	at org.junit.runners.ParentRunner.runChildren(ParentRunner.java:191)
	at org.junit.runners.ParentRunner.access$000(ParentRunner.java:42)
	at org.junit.runners.ParentRunner$2.evaluate(ParentRunner.java:184)
	at org.junit.runners.ParentRunner.run(ParentRunner.java:236)
	at org.apache.maven.surefire.junit4.JUnit4Provider.execute(JUnit4Provider.java:252)
	at org.apache.maven.surefire.junit4.JUnit4Provider.executeTestSet(JUnit4Provider.java:141)
	at org.apache.maven.surefire.junit4.JUnit4Provider.invoke(JUnit4Provider.java:112)
	at sun.reflect.NativeMethodAccessorImpl.invoke0(Native Method)
	at sun.reflect.NativeMethodAccessorImpl.invoke(NativeMethodAccessorImpl.java:39)
	at sun.reflect.DelegatingMethodAccessorImpl.invoke(DelegatingMethodAccessorImpl.java:25)
	at java.lang.reflect.Method.invoke(Method.java:597)
	at org.apache.maven.surefire.util.ReflectionUtils.invokeMethodWithArray(ReflectionUtils.java:189)
	at org.apache.maven.surefire.booter.ProviderFactory$ProviderProxy.invoke(ProviderFactory.java:165)
	at org.apache.maven.surefire.booter.ProviderFactory.invokeProvider(ProviderFactory.java:85)
	at org.apache.maven.surefire.booter.ForkedBooter.runSuitesInProcess(ForkedBooter.java:115)
	at org.apache.maven.surefire.booter.ForkedBooter.main(ForkedBooter.java:75)
Caused by: java.io.IOException: NodeManager 1 failed to start
	at org.apache.hadoop.yarn.server.MiniYARNCluster$NodeManagerWrapper.innerStart(MiniYARNCluster.java:321)
	... 42 more


FAILED:  org.apache.hadoop.mapred.TestMiniMRClientCluster.testJob

Error Message:
null

Stack Trace:
java.lang.AssertionError: 
	at org.junit.Assert.fail(Assert.java:91)
	at org.junit.Assert.assertTrue(Assert.java:43)
	at org.junit.Assert.assertTrue(Assert.java:54)
	at org.apache.hadoop.mapred.TestMiniMRClientCluster.testJob(TestMiniMRClientCluster.java:162)
	at sun.reflect.NativeMethodAccessorImpl.invoke0(Native Method)
	at sun.reflect.NativeMethodAccessorImpl.invoke(NativeMethodAccessorImpl.java:39)
	at sun.reflect.DelegatingMethodAccessorImpl.invoke(DelegatingMethodAccessorImpl.java:25)
	at java.lang.reflect.Method.invoke(Method.java:597)
	at org.junit.runners.model.FrameworkMethod$1.runReflectiveCall(FrameworkMethod.java:44)
	at org.junit.internal.runners.model.ReflectiveCallable.run(ReflectiveCallable.java:15)
	at org.junit.runners.model.FrameworkMethod.invokeExplosively(FrameworkMethod.java:41)
	at org.junit.internal.runners.statements.InvokeMethod.evaluate(InvokeMethod.java:20)
	at org.junit.runners.BlockJUnit4ClassRunner.runNotIgnored(BlockJUnit4ClassRunner.java:79)
	at org.junit.runners.BlockJUnit4ClassRunner.runChild(BlockJUnit4ClassRunner.java:71)
	at org.junit.runners.BlockJUnit4ClassRunner.runChild(BlockJUnit4ClassRunner.java:49)
	at org.junit.runners.ParentRunner$3.run(ParentRunner.java:193)
	at org.junit.runners.ParentRunner$1.schedule(ParentRunner.java:52)
	at org.junit.runners.ParentRunner.runChildren(ParentRunner.java:191)
	at org.junit.runners.ParentRunner.access$000(ParentRunner.java:42)
	at org.junit.runners.ParentRunner$2.evaluate(ParentRunner.java:184)
	at org.junit.internal.runners.statements.RunBefores.evaluate(RunBefores.java:28)
	at org.junit.internal.runners.statements.RunAfters.evaluate(RunAfters.java:31)
	at org.junit.runners.ParentRunner.run(ParentRunner.java:236)
	at org.apache.maven.surefire.junit4.JUnit4Provider.execute(JUnit4Provider.java:252)
	at org.apache.maven.surefire.junit4.JUnit4Provider.executeTestSet(JUnit4Provider.java:141)
	at org.apache.maven.surefire.junit4.JUnit4Provider.invoke(JUnit4Provider.java:112)
	at sun.reflect.NativeMethodAccessorImpl.invoke0(Native Method)
	at sun.reflect.NativeMethodAccessorImpl.invoke(NativeMethodAccessorImpl.java:39)
	at sun.reflect.DelegatingMethodAccessorImpl.invoke(DelegatingMethodAccessorImpl.java:25)
	at java.lang.reflect.Method.invoke(Method.java:597)
	at org.apache.maven.surefire.util.ReflectionUtils.invokeMethodWithArray(ReflectionUtils.java:189)
	at org.apache.maven.surefire.booter.ProviderFactory$ProviderProxy.invoke(ProviderFactory.java:165)
	at org.apache.maven.surefire.booter.ProviderFactory.invokeProvider(ProviderFactory.java:85)
	at org.apache.maven.surefire.booter.ForkedBooter.runSuitesInProcess(ForkedBooter.java:115)
	at org.apache.maven.surefire.booter.ForkedBooter.main(ForkedBooter.java:75)


FAILED:  org.apache.hadoop.mapred.TestMiniMRWithDFSWithDistinctUsers.testDistinctUsers

Error Message:
java.io.IOException: NodeManager 1 failed to start

Stack Trace:
org.apache.hadoop.yarn.YarnException: java.io.IOException: NodeManager 1 failed to start
	at org.apache.hadoop.yarn.server.MiniYARNCluster$NodeManagerWrapper.innerStart(MiniYARNCluster.java:325)
	at org.apache.hadoop.yarn.service.AbstractService.start(AbstractService.java:158)
	at org.apache.hadoop.yarn.service.CompositeService.innerStart(CompositeService.java:65)
	at org.apache.hadoop.yarn.service.AbstractService.start(AbstractService.java:158)
	at org.apache.hadoop.mapred.MiniMRClientClusterFactory.create(MiniMRClientClusterFactory.java:80)
	at org.apache.hadoop.mapred.MiniMRCluster.<init>(MiniMRCluster.java:183)
	at org.apache.hadoop.mapred.MiniMRCluster.<init>(MiniMRCluster.java:171)
	at org.apache.hadoop.mapred.MiniMRCluster.<init>(MiniMRCluster.java:163)
	at org.apache.hadoop.mapred.TestMiniMRWithDFSWithDistinctUsers.setUp(TestMiniMRWithDFSWithDistinctUsers.java:97)
	at sun.reflect.NativeMethodAccessorImpl.invoke0(Native Method)
	at sun.reflect.NativeMethodAccessorImpl.invoke(NativeMethodAccessorImpl.java:39)
	at sun.reflect.DelegatingMethodAccessorImpl.invoke(DelegatingMethodAccessorImpl.java:25)
	at java.lang.reflect.Method.invoke(Method.java:597)
	at org.junit.runners.model.FrameworkMethod$1.runReflectiveCall(FrameworkMethod.java:44)
	at org.junit.internal.runners.model.ReflectiveCallable.run(ReflectiveCallable.java:15)
	at org.junit.runners.model.FrameworkMethod.invokeExplosively(FrameworkMethod.java:41)
	at org.junit.internal.runners.statements.RunBefores.evaluate(RunBefores.java:27)
	at org.junit.internal.runners.statements.RunAfters.evaluate(RunAfters.java:31)
	at org.junit.runners.BlockJUnit4ClassRunner.runNotIgnored(BlockJUnit4ClassRunner.java:79)
	at org.junit.runners.BlockJUnit4ClassRunner.runChild(BlockJUnit4ClassRunner.java:71)
	at org.junit.runners.BlockJUnit4ClassRunner.runChild(BlockJUnit4ClassRunner.java:49)
	at org.junit.runners.ParentRunner$3.run(ParentRunner.java:193)
	at org.junit.runners.ParentRunner$1.schedule(ParentRunner.java:52)
	at org.junit.runners.ParentRunner.runChildren(ParentRunner.java:191)
	at org.junit.runners.ParentRunner.access$000(ParentRunner.java:42)
	at org.junit.runners.ParentRunner$2.evaluate(ParentRunner.java:184)
	at org.junit.runners.ParentRunner.run(ParentRunner.java:236)
	at org.apache.maven.surefire.junit4.JUnit4Provider.execute(JUnit4Provider.java:252)
	at org.apache.maven.surefire.junit4.JUnit4Provider.executeTestSet(JUnit4Provider.java:141)
	at org.apache.maven.surefire.junit4.JUnit4Provider.invoke(JUnit4Provider.java:112)
	at sun.reflect.NativeMethodAccessorImpl.invoke0(Native Method)
	at sun.reflect.NativeMethodAccessorImpl.invoke(NativeMethodAccessorImpl.java:39)
	at sun.reflect.DelegatingMethodAccessorImpl.invoke(DelegatingMethodAccessorImpl.java:25)
	at java.lang.reflect.Method.invoke(Method.java:597)
	at org.apache.maven.surefire.util.ReflectionUtils.invokeMethodWithArray(ReflectionUtils.java:189)
	at org.apache.maven.surefire.booter.ProviderFactory$ProviderProxy.invoke(ProviderFactory.java:165)
	at org.apache.maven.surefire.booter.ProviderFactory.invokeProvider(ProviderFactory.java:85)
	at org.apache.maven.surefire.booter.ForkedBooter.runSuitesInProcess(ForkedBooter.java:115)
	at org.apache.maven.surefire.booter.ForkedBooter.main(ForkedBooter.java:75)
Caused by: java.io.IOException: NodeManager 1 failed to start
	at org.apache.hadoop.yarn.server.MiniYARNCluster$NodeManagerWrapper.innerStart(MiniYARNCluster.java:321)
	... 38 more


FAILED:  org.apache.hadoop.mapred.TestMiniMRWithDFSWithDistinctUsers.testMultipleSpills

Error Message:
java.io.IOException: NodeManager 1 failed to start

Stack Trace:
org.apache.hadoop.yarn.YarnException: java.io.IOException: NodeManager 1 failed to start
	at org.apache.hadoop.yarn.server.MiniYARNCluster$NodeManagerWrapper.innerStart(MiniYARNCluster.java:325)
	at org.apache.hadoop.yarn.service.AbstractService.start(AbstractService.java:158)
	at org.apache.hadoop.yarn.service.CompositeService.innerStart(CompositeService.java:65)
	at org.apache.hadoop.yarn.service.AbstractService.start(AbstractService.java:158)
	at org.apache.hadoop.mapred.MiniMRClientClusterFactory.create(MiniMRClientClusterFactory.java:80)
	at org.apache.hadoop.mapred.MiniMRCluster.<init>(MiniMRCluster.java:183)
	at org.apache.hadoop.mapred.MiniMRCluster.<init>(MiniMRCluster.java:171)
	at org.apache.hadoop.mapred.MiniMRCluster.<init>(MiniMRCluster.java:163)
	at org.apache.hadoop.mapred.TestMiniMRWithDFSWithDistinctUsers.setUp(TestMiniMRWithDFSWithDistinctUsers.java:97)
	at sun.reflect.NativeMethodAccessorImpl.invoke0(Native Method)
	at sun.reflect.NativeMethodAccessorImpl.invoke(NativeMethodAccessorImpl.java:39)
	at sun.reflect.DelegatingMethodAccessorImpl.invoke(DelegatingMethodAccessorImpl.java:25)
	at java.lang.reflect.Method.invoke(Method.java:597)
	at org.junit.runners.model.FrameworkMethod$1.runReflectiveCall(FrameworkMethod.java:44)
	at org.junit.internal.runners.model.ReflectiveCallable.run(ReflectiveCallable.java:15)
	at org.junit.runners.model.FrameworkMethod.invokeExplosively(FrameworkMethod.java:41)
	at org.junit.internal.runners.statements.RunBefores.evaluate(RunBefores.java:27)
	at org.junit.internal.runners.statements.RunAfters.evaluate(RunAfters.java:31)
	at org.junit.runners.BlockJUnit4ClassRunner.runNotIgnored(BlockJUnit4ClassRunner.java:79)
	at org.junit.runners.BlockJUnit4ClassRunner.runChild(BlockJUnit4ClassRunner.java:71)
	at org.junit.runners.BlockJUnit4ClassRunner.runChild(BlockJUnit4ClassRunner.java:49)
	at org.junit.runners.ParentRunner$3.run(ParentRunner.java:193)
	at org.junit.runners.ParentRunner$1.schedule(ParentRunner.java:52)
	at org.junit.runners.ParentRunner.runChildren(ParentRunner.java:191)
	at org.junit.runners.ParentRunner.access$000(ParentRunner.java:42)
	at org.junit.runners.ParentRunner$2.evaluate(ParentRunner.java:184)
	at org.junit.runners.ParentRunner.run(ParentRunner.java:236)
	at org.apache.maven.surefire.junit4.JUnit4Provider.execute(JUnit4Provider.java:252)
	at org.apache.maven.surefire.junit4.JUnit4Provider.executeTestSet(JUnit4Provider.java:141)
	at org.apache.maven.surefire.junit4.JUnit4Provider.invoke(JUnit4Provider.java:112)
	at sun.reflect.NativeMethodAccessorImpl.invoke0(Native Method)
	at sun.reflect.NativeMethodAccessorImpl.invoke(NativeMethodAccessorImpl.java:39)
	at sun.reflect.DelegatingMethodAccessorImpl.invoke(DelegatingMethodAccessorImpl.java:25)
	at java.lang.reflect.Method.invoke(Method.java:597)
	at org.apache.maven.surefire.util.ReflectionUtils.invokeMethodWithArray(ReflectionUtils.java:189)
	at org.apache.maven.surefire.booter.ProviderFactory$ProviderProxy.invoke(ProviderFactory.java:165)
	at org.apache.maven.surefire.booter.ProviderFactory.invokeProvider(ProviderFactory.java:85)
	at org.apache.maven.surefire.booter.ForkedBooter.runSuitesInProcess(ForkedBooter.java:115)
	at org.apache.maven.surefire.booter.ForkedBooter.main(ForkedBooter.java:75)
Caused by: java.io.IOException: NodeManager 1 failed to start
	at org.apache.hadoop.yarn.server.MiniYARNCluster$NodeManagerWrapper.innerStart(MiniYARNCluster.java:321)
	... 38 more


FAILED:  org.apache.hadoop.mapred.TestNetworkedJob.testGetJobStatus

Error Message:
java.io.IOException: NodeManager 1 failed to start

Stack Trace:
org.apache.hadoop.yarn.YarnException: java.io.IOException: NodeManager 1 failed to start
	at org.apache.hadoop.yarn.server.MiniYARNCluster$NodeManagerWrapper.innerStart(MiniYARNCluster.java:325)
	at org.apache.hadoop.yarn.service.AbstractService.start(AbstractService.java:158)
	at org.apache.hadoop.yarn.service.CompositeService.innerStart(CompositeService.java:65)
	at org.apache.hadoop.yarn.service.AbstractService.start(AbstractService.java:158)
	at org.apache.hadoop.mapred.MiniMRClientClusterFactory.create(MiniMRClientClusterFactory.java:80)
	at org.apache.hadoop.mapred.MiniMRClientClusterFactory.create(MiniMRClientClusterFactory.java:41)
	at org.apache.hadoop.mapred.TestNetworkedJob.testGetJobStatus(TestNetworkedJob.java:79)
	at sun.reflect.NativeMethodAccessorImpl.invoke0(Native Method)
	at sun.reflect.NativeMethodAccessorImpl.invoke(NativeMethodAccessorImpl.java:39)
	at sun.reflect.DelegatingMethodAccessorImpl.invoke(DelegatingMethodAccessorImpl.java:25)
	at java.lang.reflect.Method.invoke(Method.java:597)
	at org.junit.runners.model.FrameworkMethod$1.runReflectiveCall(FrameworkMethod.java:44)
	at org.junit.internal.runners.model.ReflectiveCallable.run(ReflectiveCallable.java:15)
	at org.junit.runners.model.FrameworkMethod.invokeExplosively(FrameworkMethod.java:41)
	at org.junit.internal.runners.statements.InvokeMethod.evaluate(InvokeMethod.java:20)
	at org.junit.internal.runners.statements.FailOnTimeout$1.run(FailOnTimeout.java:28)
Caused by: java.io.IOException: NodeManager 1 failed to start
	at org.apache.hadoop.yarn.server.MiniYARNCluster$NodeManagerWrapper.innerStart(MiniYARNCluster.java:321)
	... 15 more


FAILED:  org.apache.hadoop.mapred.TestNetworkedJob.testNetworkedJob

Error Message:
java.io.IOException: NodeManager 1 failed to start

Stack Trace:
org.apache.hadoop.yarn.YarnException: java.io.IOException: NodeManager 1 failed to start
	at org.apache.hadoop.yarn.server.MiniYARNCluster$NodeManagerWrapper.innerStart(MiniYARNCluster.java:325)
	at org.apache.hadoop.yarn.service.AbstractService.start(AbstractService.java:158)
	at org.apache.hadoop.yarn.service.CompositeService.innerStart(CompositeService.java:65)
	at org.apache.hadoop.yarn.service.AbstractService.start(AbstractService.java:158)
	at org.apache.hadoop.mapred.MiniMRClientClusterFactory.create(MiniMRClientClusterFactory.java:80)
	at org.apache.hadoop.mapred.MiniMRClientClusterFactory.create(MiniMRClientClusterFactory.java:41)
	at org.apache.hadoop.mapred.TestNetworkedJob.testNetworkedJob(TestNetworkedJob.java:133)
	at sun.reflect.NativeMethodAccessorImpl.invoke0(Native Method)
	at sun.reflect.NativeMethodAccessorImpl.invoke(NativeMethodAccessorImpl.java:39)
	at sun.reflect.DelegatingMethodAccessorImpl.invoke(DelegatingMethodAccessorImpl.java:25)
	at java.lang.reflect.Method.invoke(Method.java:597)
	at org.junit.runners.model.FrameworkMethod$1.runReflectiveCall(FrameworkMethod.java:44)
	at org.junit.internal.runners.model.ReflectiveCallable.run(ReflectiveCallable.java:15)
	at org.junit.runners.model.FrameworkMethod.invokeExplosively(FrameworkMethod.java:41)
	at org.junit.internal.runners.statements.InvokeMethod.evaluate(InvokeMethod.java:20)
	at org.junit.internal.runners.statements.FailOnTimeout$1.run(FailOnTimeout.java:28)
Caused by: java.io.IOException: NodeManager 1 failed to start
	at org.apache.hadoop.yarn.server.MiniYARNCluster$NodeManagerWrapper.innerStart(MiniYARNCluster.java:321)
	... 15 more


FAILED:  org.apache.hadoop.mapred.TestNetworkedJob.testJobQueueClient

Error Message:
java.io.IOException: NodeManager 1 failed to start

Stack Trace:
org.apache.hadoop.yarn.YarnException: java.io.IOException: NodeManager 1 failed to start
	at org.apache.hadoop.yarn.server.MiniYARNCluster$NodeManagerWrapper.innerStart(MiniYARNCluster.java:325)
	at org.apache.hadoop.yarn.service.AbstractService.start(AbstractService.java:158)
	at org.apache.hadoop.yarn.service.CompositeService.innerStart(CompositeService.java:65)
	at org.apache.hadoop.yarn.service.AbstractService.start(AbstractService.java:158)
	at org.apache.hadoop.mapred.MiniMRClientClusterFactory.create(MiniMRClientClusterFactory.java:80)
	at org.apache.hadoop.mapred.MiniMRClientClusterFactory.create(MiniMRClientClusterFactory.java:41)
	at org.apache.hadoop.mapred.TestNetworkedJob.testJobQueueClient(TestNetworkedJob.java:318)
	at sun.reflect.NativeMethodAccessorImpl.invoke0(Native Method)
	at sun.reflect.NativeMethodAccessorImpl.invoke(NativeMethodAccessorImpl.java:39)
	at sun.reflect.DelegatingMethodAccessorImpl.invoke(DelegatingMethodAccessorImpl.java:25)
	at java.lang.reflect.Method.invoke(Method.java:597)
	at org.junit.runners.model.FrameworkMethod$1.runReflectiveCall(FrameworkMethod.java:44)
	at org.junit.internal.runners.model.ReflectiveCallable.run(ReflectiveCallable.java:15)
	at org.junit.runners.model.FrameworkMethod.invokeExplosively(FrameworkMethod.java:41)
	at org.junit.internal.runners.statements.InvokeMethod.evaluate(InvokeMethod.java:20)
	at org.junit.internal.runners.statements.FailOnTimeout$1.run(FailOnTimeout.java:28)
Caused by: java.io.IOException: NodeManager 1 failed to start
	at org.apache.hadoop.yarn.server.MiniYARNCluster$NodeManagerWrapper.innerStart(MiniYARNCluster.java:321)
	... 15 more


FAILED:  org.apache.hadoop.mapred.TestReduceFetchFromPartialMem$1.org.apache.hadoop.mapred.TestReduceFetchFromPartialMem

Error Message:
java.io.IOException: NodeManager 1 failed to start

Stack Trace:
org.apache.hadoop.yarn.YarnException: java.io.IOException: NodeManager 1 failed to start
	at org.apache.hadoop.yarn.server.MiniYARNCluster$NodeManagerWrapper.innerStart(MiniYARNCluster.java:325)
	at org.apache.hadoop.yarn.service.AbstractService.start(AbstractService.java:158)
	at org.apache.hadoop.yarn.service.CompositeService.innerStart(CompositeService.java:65)
	at org.apache.hadoop.yarn.service.AbstractService.start(AbstractService.java:158)
	at org.apache.hadoop.mapred.MiniMRClientClusterFactory.create(MiniMRClientClusterFactory.java:80)
	at org.apache.hadoop.mapred.MiniMRCluster.<init>(MiniMRCluster.java:183)
	at org.apache.hadoop.mapred.MiniMRCluster.<init>(MiniMRCluster.java:171)
	at org.apache.hadoop.mapred.MiniMRCluster.<init>(MiniMRCluster.java:163)
	at org.apache.hadoop.mapred.MiniMRCluster.<init>(MiniMRCluster.java:155)
	at org.apache.hadoop.mapred.MiniMRCluster.<init>(MiniMRCluster.java:148)
	at org.apache.hadoop.mapred.MiniMRCluster.<init>(MiniMRCluster.java:141)
	at org.apache.hadoop.mapred.MiniMRCluster.<init>(MiniMRCluster.java:134)
	at org.apache.hadoop.mapred.MiniMRCluster.<init>(MiniMRCluster.java:129)
	at org.apache.hadoop.mapred.TestReduceFetchFromPartialMem$1.setUp(TestReduceFetchFromPartialMem.java:61)
	at junit.extensions.TestSetup$1.protect(TestSetup.java:22)
	at junit.framework.TestResult.runProtected(TestResult.java:128)
	at junit.extensions.TestSetup.run(TestSetup.java:27)
	at org.junit.internal.runners.JUnit38ClassRunner.run(JUnit38ClassRunner.java:83)
	at org.apache.maven.surefire.junit4.JUnit4Provider.execute(JUnit4Provider.java:252)
	at org.apache.maven.surefire.junit4.JUnit4Provider.executeTestSet(JUnit4Provider.java:141)
	at org.apache.maven.surefire.junit4.JUnit4Provider.invoke(JUnit4Provider.java:112)
	at sun.reflect.NativeMethodAccessorImpl.invoke0(Native Method)
	at sun.reflect.NativeMethodAccessorImpl.invoke(NativeMethodAccessorImpl.java:39)
	at sun.reflect.DelegatingMethodAccessorImpl.invoke(DelegatingMethodAccessorImpl.java:25)
	at java.lang.reflect.Method.invoke(Method.java:597)
	at org.apache.maven.surefire.util.ReflectionUtils.invokeMethodWithArray(ReflectionUtils.java:189)
	at org.apache.maven.surefire.booter.ProviderFactory$ProviderProxy.invoke(ProviderFactory.java:165)
	at org.apache.maven.surefire.booter.ProviderFactory.invokeProvider(ProviderFactory.java:85)
	at org.apache.maven.surefire.booter.ForkedBooter.runSuitesInProcess(ForkedBooter.java:115)
	at org.apache.maven.surefire.booter.ForkedBooter.main(ForkedBooter.java:75)
Caused by: java.io.IOException: NodeManager 1 failed to start
	at org.apache.hadoop.yarn.server.MiniYARNCluster$NodeManagerWrapper.innerStart(MiniYARNCluster.java:321)
	... 29 more


FAILED:  org.apache.hadoop.mapred.TestReduceFetchFromPartialMem$1.org.apache.hadoop.mapred.TestReduceFetchFromPartialMem

Error Message:
java.io.IOException: NodeManager 1 failed to start

Stack Trace:
org.apache.hadoop.yarn.YarnException: java.io.IOException: NodeManager 1 failed to start
	at org.apache.hadoop.yarn.server.MiniYARNCluster$NodeManagerWrapper.innerStart(MiniYARNCluster.java:325)
	at org.apache.hadoop.yarn.service.AbstractService.start(AbstractService.java:158)
	at org.apache.hadoop.yarn.service.CompositeService.innerStart(CompositeService.java:65)
	at org.apache.hadoop.yarn.service.AbstractService.start(AbstractService.java:158)
	at org.apache.hadoop.mapred.MiniMRClientClusterFactory.create(MiniMRClientClusterFactory.java:80)
	at org.apache.hadoop.mapred.MiniMRCluster.<init>(MiniMRCluster.java:183)
	at org.apache.hadoop.mapred.MiniMRCluster.<init>(MiniMRCluster.java:171)
	at org.apache.hadoop.mapred.MiniMRCluster.<init>(MiniMRCluster.java:163)
	at org.apache.hadoop.mapred.MiniMRCluster.<init>(MiniMRCluster.java:155)
	at org.apache.hadoop.mapred.MiniMRCluster.<init>(MiniMRCluster.java:148)
	at org.apache.hadoop.mapred.MiniMRCluster.<init>(MiniMRCluster.java:141)
	at org.apache.hadoop.mapred.MiniMRCluster.<init>(MiniMRCluster.java:134)
	at org.apache.hadoop.mapred.MiniMRCluster.<init>(MiniMRCluster.java:129)
	at org.apache.hadoop.mapred.TestReduceFetchFromPartialMem$1.setUp(TestReduceFetchFromPartialMem.java:61)
	at junit.extensions.TestSetup$1.protect(TestSetup.java:22)
	at junit.framework.TestResult.runProtected(TestResult.java:128)
	at junit.extensions.TestSetup.run(TestSetup.java:27)
	at org.junit.internal.runners.JUnit38ClassRunner.run(JUnit38ClassRunner.java:83)
	at org.apache.maven.surefire.junit4.JUnit4Provider.execute(JUnit4Provider.java:252)
	at org.apache.maven.surefire.junit4.JUnit4Provider.executeTestSet(JUnit4Provider.java:141)
	at org.apache.maven.surefire.junit4.JUnit4Provider.invoke(JUnit4Provider.java:112)
	at sun.reflect.NativeMethodAccessorImpl.invoke0(Native Method)
	at sun.reflect.NativeMethodAccessorImpl.invoke(NativeMethodAccessorImpl.java:39)
	at sun.reflect.DelegatingMethodAccessorImpl.invoke(DelegatingMethodAccessorImpl.java:25)
	at java.lang.reflect.Method.invoke(Method.java:597)
	at org.apache.maven.surefire.util.ReflectionUtils.invokeMethodWithArray(ReflectionUtils.java:189)
	at org.apache.maven.surefire.booter.ProviderFactory$ProviderProxy.invoke(ProviderFactory.java:165)
	at org.apache.maven.surefire.booter.ProviderFactory.invokeProvider(ProviderFactory.java:85)
	at org.apache.maven.surefire.booter.ForkedBooter.runSuitesInProcess(ForkedBooter.java:115)
	at org.apache.maven.surefire.booter.ForkedBooter.main(ForkedBooter.java:75)
Caused by: java.io.IOException: NodeManager 1 failed to start
	at org.apache.hadoop.yarn.server.MiniYARNCluster$NodeManagerWrapper.innerStart(MiniYARNCluster.java:321)
	... 29 more


FAILED:  org.apache.hadoop.mapred.TestSpecialCharactersInOutputPath.testJobWithDFS

Error Message:
java.io.IOException: NodeManager 1 failed to start

Stack Trace:
org.apache.hadoop.yarn.YarnException: java.io.IOException: NodeManager 1 failed to start
	at org.apache.hadoop.yarn.server.MiniYARNCluster$NodeManagerWrapper.innerStart(MiniYARNCluster.java:325)
	at org.apache.hadoop.yarn.service.AbstractService.start(AbstractService.java:158)
	at org.apache.hadoop.yarn.service.CompositeService.innerStart(CompositeService.java:65)
	at org.apache.hadoop.yarn.service.AbstractService.start(AbstractService.java:158)
	at org.apache.hadoop.mapred.MiniMRClientClusterFactory.create(MiniMRClientClusterFactory.java:80)
	at org.apache.hadoop.mapred.MiniMRCluster.<init>(MiniMRCluster.java:183)
	at org.apache.hadoop.mapred.MiniMRCluster.<init>(MiniMRCluster.java:171)
	at org.apache.hadoop.mapred.MiniMRCluster.<init>(MiniMRCluster.java:163)
	at org.apache.hadoop.mapred.MiniMRCluster.<init>(MiniMRCluster.java:155)
	at org.apache.hadoop.mapred.MiniMRCluster.<init>(MiniMRCluster.java:148)
	at org.apache.hadoop.mapred.MiniMRCluster.<init>(MiniMRCluster.java:141)
	at org.apache.hadoop.mapred.MiniMRCluster.<init>(MiniMRCluster.java:134)
	at org.apache.hadoop.mapred.MiniMRCluster.<init>(MiniMRCluster.java:129)
	at org.apache.hadoop.mapred.TestSpecialCharactersInOutputPath.testJobWithDFS(TestSpecialCharactersInOutputPath.java:112)
	at sun.reflect.NativeMethodAccessorImpl.invoke0(Native Method)
	at sun.reflect.NativeMethodAccessorImpl.invoke(NativeMethodAccessorImpl.java:39)
	at sun.reflect.DelegatingMethodAccessorImpl.invoke(DelegatingMethodAccessorImpl.java:25)
	at java.lang.reflect.Method.invoke(Method.java:597)
	at junit.framework.TestCase.runTest(TestCase.java:168)
	at junit.framework.TestCase.runBare(TestCase.java:134)
	at junit.framework.TestResult$1.protect(TestResult.java:110)
	at junit.framework.TestResult.runProtected(TestResult.java:128)
	at junit.framework.TestResult.run(TestResult.java:113)
	at junit.framework.TestCase.run(TestCase.java:124)
	at junit.framework.TestSuite.runTest(TestSuite.java:243)
	at junit.framework.TestSuite.run(TestSuite.java:238)
	at org.junit.internal.runners.JUnit38ClassRunner.run(JUnit38ClassRunner.java:83)
	at org.apache.maven.surefire.junit4.JUnit4Provider.execute(JUnit4Provider.java:252)
	at org.apache.maven.surefire.junit4.JUnit4Provider.executeTestSet(JUnit4Provider.java:141)
	at org.apache.maven.surefire.junit4.JUnit4Provider.invoke(JUnit4Provider.java:112)
	at sun.reflect.NativeMethodAccessorImpl.invoke0(Native Method)
	at sun.reflect.NativeMethodAccessorImpl.invoke(NativeMethodAccessorImpl.java:39)
	at sun.reflect.DelegatingMethodAccessorImpl.invoke(DelegatingMethodAccessorImpl.java:25)
	at java.lang.reflect.Method.invoke(Method.java:597)
	at org.apache.maven.surefire.util.ReflectionUtils.invokeMethodWithArray(ReflectionUtils.java:189)
	at org.apache.maven.surefire.booter.ProviderFactory$ProviderProxy.invoke(ProviderFactory.java:165)
	at org.apache.maven.surefire.booter.ProviderFactory.invokeProvider(ProviderFactory.java:85)
	at org.apache.maven.surefire.booter.ForkedBooter.runSuitesInProcess(ForkedBooter.java:115)
	at org.apache.maven.surefire.booter.ForkedBooter.main(ForkedBooter.java:75)
Caused by: java.io.IOException: NodeManager 1 failed to start
	at org.apache.hadoop.yarn.server.MiniYARNCluster$NodeManagerWrapper.innerStart(MiniYARNCluster.java:321)
	... 38 more


FAILED:  org.apache.hadoop.mapreduce.TestChild.testChild

Error Message:
java.io.IOException: NodeManager 1 failed to start

Stack Trace:
org.apache.hadoop.yarn.YarnException: java.io.IOException: NodeManager 1 failed to start
	at org.apache.hadoop.yarn.server.MiniYARNCluster$NodeManagerWrapper.innerStart(MiniYARNCluster.java:325)
	at org.apache.hadoop.yarn.service.AbstractService.start(AbstractService.java:158)
	at org.apache.hadoop.yarn.service.CompositeService.innerStart(CompositeService.java:65)
	at org.apache.hadoop.yarn.service.AbstractService.start(AbstractService.java:158)
	at org.apache.hadoop.mapred.MiniMRClientClusterFactory.create(MiniMRClientClusterFactory.java:80)
	at org.apache.hadoop.mapred.MiniMRCluster.<init>(MiniMRCluster.java:183)
	at org.apache.hadoop.mapred.MiniMRCluster.<init>(MiniMRCluster.java:171)
	at org.apache.hadoop.mapred.MiniMRCluster.<init>(MiniMRCluster.java:163)
	at org.apache.hadoop.mapred.MiniMRCluster.<init>(MiniMRCluster.java:155)
	at org.apache.hadoop.mapred.MiniMRCluster.<init>(MiniMRCluster.java:148)
	at org.apache.hadoop.mapred.MiniMRCluster.<init>(MiniMRCluster.java:141)
	at org.apache.hadoop.mapred.MiniMRCluster.<init>(MiniMRCluster.java:134)
	at org.apache.hadoop.mapred.MiniMRCluster.<init>(MiniMRCluster.java:129)
	at org.apache.hadoop.mapred.HadoopTestCase.setUp(HadoopTestCase.java:156)
	at junit.framework.TestCase.runBare(TestCase.java:132)
	at junit.framework.TestResult$1.protect(TestResult.java:110)
	at junit.framework.TestResult.runProtected(TestResult.java:128)
	at junit.framework.TestResult.run(TestResult.java:113)
	at junit.framework.TestCase.run(TestCase.java:124)
	at junit.framework.TestSuite.runTest(TestSuite.java:243)
	at junit.framework.TestSuite.run(TestSuite.java:238)
	at org.junit.internal.runners.JUnit38ClassRunner.run(JUnit38ClassRunner.java:83)
	at org.apache.maven.surefire.junit4.JUnit4Provider.execute(JUnit4Provider.java:252)
	at org.apache.maven.surefire.junit4.JUnit4Provider.executeTestSet(JUnit4Provider.java:141)
	at org.apache.maven.surefire.junit4.JUnit4Provider.invoke(JUnit4Provider.java:112)
	at sun.reflect.NativeMethodAccessorImpl.invoke0(Native Method)
	at sun.reflect.NativeMethodAccessorImpl.invoke(NativeMethodAccessorImpl.java:39)
	at sun.reflect.DelegatingMethodAccessorImpl.invoke(DelegatingMethodAccessorImpl.java:25)
	at java.lang.reflect.Method.invoke(Method.java:597)
	at org.apache.maven.surefire.util.ReflectionUtils.invokeMethodWithArray(ReflectionUtils.java:189)
	at org.apache.maven.surefire.booter.ProviderFactory$ProviderProxy.invoke(ProviderFactory.java:165)
	at org.apache.maven.surefire.booter.ProviderFactory.invokeProvider(ProviderFactory.java:85)
	at org.apache.maven.surefire.booter.ForkedBooter.runSuitesInProcess(ForkedBooter.java:115)
	at org.apache.maven.surefire.booter.ForkedBooter.main(ForkedBooter.java:75)
Caused by: java.io.IOException: NodeManager 1 failed to start
	at org.apache.hadoop.yarn.server.MiniYARNCluster$NodeManagerWrapper.innerStart(MiniYARNCluster.java:321)
	... 33 more


FAILED:  org.apache.hadoop.mapreduce.TestMapReduceLazyOutput.testLazyOutput

Error Message:
java.io.IOException: NodeManager 1 failed to start

Stack Trace:
org.apache.hadoop.yarn.YarnException: java.io.IOException: NodeManager 1 failed to start
	at org.apache.hadoop.yarn.server.MiniYARNCluster$NodeManagerWrapper.innerStart(MiniYARNCluster.java:325)
	at org.apache.hadoop.yarn.service.AbstractService.start(AbstractService.java:158)
	at org.apache.hadoop.yarn.service.CompositeService.innerStart(CompositeService.java:65)
	at org.apache.hadoop.yarn.service.AbstractService.start(AbstractService.java:158)
	at org.apache.hadoop.mapred.MiniMRClientClusterFactory.create(MiniMRClientClusterFactory.java:80)
	at org.apache.hadoop.mapred.MiniMRCluster.<init>(MiniMRCluster.java:183)
	at org.apache.hadoop.mapred.MiniMRCluster.<init>(MiniMRCluster.java:171)
	at org.apache.hadoop.mapred.MiniMRCluster.<init>(MiniMRCluster.java:163)
	at org.apache.hadoop.mapred.MiniMRCluster.<init>(MiniMRCluster.java:155)
	at org.apache.hadoop.mapred.MiniMRCluster.<init>(MiniMRCluster.java:148)
	at org.apache.hadoop.mapred.MiniMRCluster.<init>(MiniMRCluster.java:141)
	at org.apache.hadoop.mapred.MiniMRCluster.<init>(MiniMRCluster.java:134)
	at org.apache.hadoop.mapred.MiniMRCluster.<init>(MiniMRCluster.java:129)
	at org.apache.hadoop.mapreduce.TestMapReduceLazyOutput.testLazyOutput(TestMapReduceLazyOutput.java:136)
	at sun.reflect.NativeMethodAccessorImpl.invoke0(Native Method)
	at sun.reflect.NativeMethodAccessorImpl.invoke(NativeMethodAccessorImpl.java:39)
	at sun.reflect.DelegatingMethodAccessorImpl.invoke(DelegatingMethodAccessorImpl.java:25)
	at java.lang.reflect.Method.invoke(Method.java:597)
	at junit.framework.TestCase.runTest(TestCase.java:168)
	at junit.framework.TestCase.runBare(TestCase.java:134)
	at junit.framework.TestResult$1.protect(TestResult.java:110)
	at junit.framework.TestResult.runProtected(TestResult.java:128)
	at junit.framework.TestResult.run(TestResult.java:113)
	at junit.framework.TestCase.run(TestCase.java:124)
	at junit.framework.TestSuite.runTest(TestSuite.java:243)
	at junit.framework.TestSuite.run(TestSuite.java:238)
	at org.junit.internal.runners.JUnit38ClassRunner.run(JUnit38ClassRunner.java:83)
	at org.apache.maven.surefire.junit4.JUnit4Provider.execute(JUnit4Provider.java:252)
	at org.apache.maven.surefire.junit4.JUnit4Provider.executeTestSet(JUnit4Provider.java:141)
	at org.apache.maven.surefire.junit4.JUnit4Provider.invoke(JUnit4Provider.java:112)
	at sun.reflect.NativeMethodAccessorImpl.invoke0(Native Method)
	at sun.reflect.NativeMethodAccessorImpl.invoke(NativeMethodAccessorImpl.java:39)
	at sun.reflect.DelegatingMethodAccessorImpl.invoke(DelegatingMethodAccessorImpl.java:25)
	at java.lang.reflect.Method.invoke(Method.java:597)
	at org.apache.maven.surefire.util.ReflectionUtils.invokeMethodWithArray(ReflectionUtils.java:189)
	at org.apache.maven.surefire.booter.ProviderFactory$ProviderProxy.invoke(ProviderFactory.java:165)
	at org.apache.maven.surefire.booter.ProviderFactory.invokeProvider(ProviderFactory.java:85)
	at org.apache.maven.surefire.booter.ForkedBooter.runSuitesInProcess(ForkedBooter.java:115)
	at org.apache.maven.surefire.booter.ForkedBooter.main(ForkedBooter.java:75)
Caused by: java.io.IOException: NodeManager 1 failed to start
	at org.apache.hadoop.yarn.server.MiniYARNCluster$NodeManagerWrapper.innerStart(MiniYARNCluster.java:321)
	... 38 more


FAILED:  org.apache.hadoop.mapreduce.lib.output.TestJobOutputCommitter.testDefaultCleanupAndAbort

Error Message:
null

Stack Trace:
java.lang.reflect.UndeclaredThrowableException
	at org.apache.hadoop.yarn.exceptions.impl.pb.YarnRemoteExceptionPBImpl.unwrapAndThrowException(YarnRemoteExceptionPBImpl.java:135)
	at org.apache.hadoop.yarn.api.impl.pb.client.ClientRMProtocolPBClientImpl.getNewApplication(ClientRMProtocolPBClientImpl.java:162)
	at org.apache.hadoop.yarn.client.YarnClientImpl.getNewApplication(YarnClientImpl.java:121)
	at org.apache.hadoop.mapred.ResourceMgrDelegate.getNewJobID(ResourceMgrDelegate.java:102)
	at org.apache.hadoop.mapred.YARNRunner.getNewJobID(YARNRunner.java:215)
	at org.apache.hadoop.mapreduce.JobSubmitter.submitJobInternal(JobSubmitter.java:352)
	at org.apache.hadoop.mapreduce.Job$11.run(Job.java:1218)
	at org.apache.hadoop.mapreduce.Job$11.run(Job.java:1215)
	at java.security.AccessController.doPrivileged(Native Method)
	at javax.security.auth.Subject.doAs(Subject.java:396)
	at org.apache.hadoop.security.UserGroupInformation.doAs(UserGroupInformation.java:1489)
	at org.apache.hadoop.mapreduce.Job.submit(Job.java:1215)
	at org.apache.hadoop.mapreduce.Job.waitForCompletion(Job.java:1236)
	at org.apache.hadoop.mapreduce.lib.output.TestJobOutputCommitter.testSuccessfulJob(TestJobOutputCommitter.java:149)
	at org.apache.hadoop.mapreduce.lib.output.TestJobOutputCommitter.testDefaultCleanupAndAbort(TestJobOutputCommitter.java:224)
	at sun.reflect.NativeMethodAccessorImpl.invoke0(Native Method)
	at sun.reflect.NativeMethodAccessorImpl.invoke(NativeMethodAccessorImpl.java:39)
	at sun.reflect.DelegatingMethodAccessorImpl.invoke(DelegatingMethodAccessorImpl.java:25)
	at java.lang.reflect.Method.invoke(Method.java:597)
	at junit.framework.TestCase.runTest(TestCase.java:168)
	at junit.framework.TestCase.runBare(TestCase.java:134)
	at junit.framework.TestResult$1.protect(TestResult.java:110)
	at junit.framework.TestResult.runProtected(TestResult.java:128)
	at junit.framework.TestResult.run(TestResult.java:113)
	at junit.framework.TestCase.run(TestCase.java:124)
	at junit.framework.TestSuite.runTest(TestSuite.java:243)
	at junit.framework.TestSuite.run(TestSuite.java:238)
	at org.junit.internal.runners.JUnit38ClassRunner.run(JUnit38ClassRunner.java:83)
	at org.apache.maven.surefire.junit4.JUnit4Provider.execute(JUnit4Provider.java:252)
	at org.apache.maven.surefire.junit4.JUnit4Provider.executeTestSet(JUnit4Provider.java:141)
	at org.apache.maven.surefire.junit4.JUnit4Provider.invoke(JUnit4Provider.java:112)
	at sun.reflect.NativeMethodAccessorImpl.invoke0(Native Method)
	at sun.reflect.NativeMethodAccessorImpl.invoke(NativeMethodAccessorImpl.java:39)
	at sun.reflect.DelegatingMethodAccessorImpl.invoke(DelegatingMethodAccessorImpl.java:25)
	at java.lang.reflect.Method.invoke(Method.java:597)
	at org.apache.maven.surefire.util.ReflectionUtils.invokeMethodWithArray(ReflectionUtils.java:189)
	at org.apache.maven.surefire.booter.ProviderFactory$ProviderProxy.invoke(ProviderFactory.java:165)
	at org.apache.maven.surefire.booter.ProviderFactory.invokeProvider(ProviderFactory.java:85)
	at org.apache.maven.surefire.booter.ForkedBooter.runSuitesInProcess(ForkedBooter.java:115)
	at org.apache.maven.surefire.booter.ForkedBooter.main(ForkedBooter.java:75)
Caused by: com.google.protobuf.ServiceException: java.net.ConnectException: Call From asf007.sp2.ygridcore.net/67.195.138.25 to 0.0.0.0:8032 failed on connection exception: java.net.ConnectException: Connection refused; For more details see:  http://wiki.apache.org/hadoop/ConnectionRefused
	at org.apache.hadoop.ipc.ProtobufRpcEngine$Invoker.invoke(ProtobufRpcEngine.java:214)
	at $Proxy70.getNewApplication(Unknown Source)
	at org.apache.hadoop.yarn.api.impl.pb.client.ClientRMProtocolPBClientImpl.getNewApplication(ClientRMProtocolPBClientImpl.java:159)
	... 38 more
Caused by: java.net.ConnectException: Call From asf007.sp2.ygridcore.net/67.195.138.25 to 0.0.0.0:8032 failed on connection exception: java.net.ConnectException: Connection refused; For more details see:  http://wiki.apache.org/hadoop/ConnectionRefused
	at sun.reflect.NativeConstructorAccessorImpl.newInstance0(Native Method)
	at sun.reflect.NativeConstructorAccessorImpl.newInstance(NativeConstructorAccessorImpl.java:39)
	at sun.reflect.DelegatingConstructorAccessorImpl.newInstance(DelegatingConstructorAccessorImpl.java:27)
	at java.lang.reflect.Constructor.newInstance(Constructor.java:513)
	at org.apache.hadoop.net.NetUtils.wrapWithMessage(NetUtils.java:780)
	at org.apache.hadoop.net.NetUtils.wrapException(NetUtils.java:727)
	at org.apache.hadoop.ipc.Client.call(Client.java:1305)
	at org.apache.hadoop.ipc.Client.call(Client.java:1253)
	at org.apache.hadoop.ipc.ProtobufRpcEngine$Invoker.invoke(ProtobufRpcEngine.java:204)
	... 40 more
Caused by: java.net.ConnectException: Connection refused
	at sun.nio.ch.SocketChannelImpl.checkConnect(Native Method)
	at sun.nio.ch.SocketChannelImpl.finishConnect(SocketChannelImpl.java:567)
	at org.apache.hadoop.net.SocketIOWithTimeout.connect(SocketIOWithTimeout.java:206)
	at org.apache.hadoop.net.NetUtils.connect(NetUtils.java:526)
	at org.apache.hadoop.net.NetUtils.connect(NetUtils.java:490)
	at org.apache.hadoop.ipc.Client$Connection.setupConnection(Client.java:511)
	at org.apache.hadoop.ipc.Client$Connection.setupIOstreams(Client.java:606)
	at org.apache.hadoop.ipc.Client$Connection.access$2100(Client.java:254)
	at org.apache.hadoop.ipc.Client.getConnection(Client.java:1354)
	at org.apache.hadoop.ipc.Client.call(Client.java:1272)
	... 42 more


FAILED:  org.apache.hadoop.mapreduce.lib.output.TestJobOutputCommitter.testCustomAbort

Error Message:
null

Stack Trace:
java.lang.reflect.UndeclaredThrowableException
	at org.apache.hadoop.yarn.exceptions.impl.pb.YarnRemoteExceptionPBImpl.unwrapAndThrowException(YarnRemoteExceptionPBImpl.java:135)
	at org.apache.hadoop.yarn.api.impl.pb.client.ClientRMProtocolPBClientImpl.getNewApplication(ClientRMProtocolPBClientImpl.java:162)
	at org.apache.hadoop.yarn.client.YarnClientImpl.getNewApplication(YarnClientImpl.java:121)
	at org.apache.hadoop.mapred.ResourceMgrDelegate.getNewJobID(ResourceMgrDelegate.java:102)
	at org.apache.hadoop.mapred.YARNRunner.getNewJobID(YARNRunner.java:215)
	at org.apache.hadoop.mapreduce.JobSubmitter.submitJobInternal(JobSubmitter.java:352)
	at org.apache.hadoop.mapreduce.Job$11.run(Job.java:1218)
	at org.apache.hadoop.mapreduce.Job$11.run(Job.java:1215)
	at java.security.AccessController.doPrivileged(Native Method)
	at javax.security.auth.Subject.doAs(Subject.java:396)
	at org.apache.hadoop.security.UserGroupInformation.doAs(UserGroupInformation.java:1489)
	at org.apache.hadoop.mapreduce.Job.submit(Job.java:1215)
	at org.apache.hadoop.mapreduce.Job.waitForCompletion(Job.java:1236)
	at org.apache.hadoop.mapreduce.lib.output.TestJobOutputCommitter.testSuccessfulJob(TestJobOutputCommitter.java:149)
	at org.apache.hadoop.mapreduce.lib.output.TestJobOutputCommitter.testCustomAbort(TestJobOutputCommitter.java:243)
	at sun.reflect.NativeMethodAccessorImpl.invoke0(Native Method)
	at sun.reflect.NativeMethodAccessorImpl.invoke(NativeMethodAccessorImpl.java:39)
	at sun.reflect.DelegatingMethodAccessorImpl.invoke(DelegatingMethodAccessorImpl.java:25)
	at java.lang.reflect.Method.invoke(Method.java:597)
	at junit.framework.TestCase.runTest(TestCase.java:168)
	at junit.framework.TestCase.runBare(TestCase.java:134)
	at junit.framework.TestResult$1.protect(TestResult.java:110)
	at junit.framework.TestResult.runProtected(TestResult.java:128)
	at junit.framework.TestResult.run(TestResult.java:113)
	at junit.framework.TestCase.run(TestCase.java:124)
	at junit.framework.TestSuite.runTest(TestSuite.java:243)
	at junit.framework.TestSuite.run(TestSuite.java:238)
	at org.junit.internal.runners.JUnit38ClassRunner.run(JUnit38ClassRunner.java:83)
	at org.apache.maven.surefire.junit4.JUnit4Provider.execute(JUnit4Provider.java:252)
	at org.apache.maven.surefire.junit4.JUnit4Provider.executeTestSet(JUnit4Provider.java:141)
	at org.apache.maven.surefire.junit4.JUnit4Provider.invoke(JUnit4Provider.java:112)
	at sun.reflect.NativeMethodAccessorImpl.invoke0(Native Method)
	at sun.reflect.NativeMethodAccessorImpl.invoke(NativeMethodAccessorImpl.java:39)
	at sun.reflect.DelegatingMethodAccessorImpl.invoke(DelegatingMethodAccessorImpl.java:25)
	at java.lang.reflect.Method.invoke(Method.java:597)
	at org.apache.maven.surefire.util.ReflectionUtils.invokeMethodWithArray(ReflectionUtils.java:189)
	at org.apache.maven.surefire.booter.ProviderFactory$ProviderProxy.invoke(ProviderFactory.java:165)
	at org.apache.maven.surefire.booter.ProviderFactory.invokeProvider(ProviderFactory.java:85)
	at org.apache.maven.surefire.booter.ForkedBooter.runSuitesInProcess(ForkedBooter.java:115)
	at org.apache.maven.surefire.booter.ForkedBooter.main(ForkedBooter.java:75)
Caused by: com.google.protobuf.ServiceException: java.net.ConnectException: Call From asf007.sp2.ygridcore.net/67.195.138.25 to 0.0.0.0:8032 failed on connection exception: java.net.ConnectException: Connection refused; For more details see:  http://wiki.apache.org/hadoop/ConnectionRefused
	at org.apache.hadoop.ipc.ProtobufRpcEngine$Invoker.invoke(ProtobufRpcEngine.java:214)
	at $Proxy70.getNewApplication(Unknown Source)
	at org.apache.hadoop.yarn.api.impl.pb.client.ClientRMProtocolPBClientImpl.getNewApplication(ClientRMProtocolPBClientImpl.java:159)
	... 38 more
Caused by: java.net.ConnectException: Call From asf007.sp2.ygridcore.net/67.195.138.25 to 0.0.0.0:8032 failed on connection exception: java.net.ConnectException: Connection refused; For more details see:  http://wiki.apache.org/hadoop/ConnectionRefused
	at sun.reflect.NativeConstructorAccessorImpl.newInstance0(Native Method)
	at sun.reflect.NativeConstructorAccessorImpl.newInstance(NativeConstructorAccessorImpl.java:39)
	at sun.reflect.DelegatingConstructorAccessorImpl.newInstance(DelegatingConstructorAccessorImpl.java:27)
	at java.lang.reflect.Constructor.newInstance(Constructor.java:513)
	at org.apache.hadoop.net.NetUtils.wrapWithMessage(NetUtils.java:780)
	at org.apache.hadoop.net.NetUtils.wrapException(NetUtils.java:727)
	at org.apache.hadoop.ipc.Client.call(Client.java:1305)
	at org.apache.hadoop.ipc.Client.call(Client.java:1253)
	at org.apache.hadoop.ipc.ProtobufRpcEngine$Invoker.invoke(ProtobufRpcEngine.java:204)
	... 40 more
Caused by: java.net.ConnectException: Connection refused
	at sun.nio.ch.SocketChannelImpl.checkConnect(Native Method)
	at sun.nio.ch.SocketChannelImpl.finishConnect(SocketChannelImpl.java:567)
	at org.apache.hadoop.net.SocketIOWithTimeout.connect(SocketIOWithTimeout.java:206)
	at org.apache.hadoop.net.NetUtils.connect(NetUtils.java:526)
	at org.apache.hadoop.net.NetUtils.connect(NetUtils.java:490)
	at org.apache.hadoop.ipc.Client$Connection.setupConnection(Client.java:511)
	at org.apache.hadoop.ipc.Client$Connection.setupIOstreams(Client.java:606)
	at org.apache.hadoop.ipc.Client$Connection.access$2100(Client.java:254)
	at org.apache.hadoop.ipc.Client.getConnection(Client.java:1354)
	at org.apache.hadoop.ipc.Client.call(Client.java:1272)
	... 42 more


FAILED:  org.apache.hadoop.mapreduce.lib.output.TestJobOutputCommitter.testCustomCleanup

Error Message:
null

Stack Trace:
java.lang.reflect.UndeclaredThrowableException
	at org.apache.hadoop.yarn.exceptions.impl.pb.YarnRemoteExceptionPBImpl.unwrapAndThrowException(YarnRemoteExceptionPBImpl.java:135)
	at org.apache.hadoop.yarn.api.impl.pb.client.ClientRMProtocolPBClientImpl.getNewApplication(ClientRMProtocolPBClientImpl.java:162)
	at org.apache.hadoop.yarn.client.YarnClientImpl.getNewApplication(YarnClientImpl.java:121)
	at org.apache.hadoop.mapred.ResourceMgrDelegate.getNewJobID(ResourceMgrDelegate.java:102)
	at org.apache.hadoop.mapred.YARNRunner.getNewJobID(YARNRunner.java:215)
	at org.apache.hadoop.mapreduce.JobSubmitter.submitJobInternal(JobSubmitter.java:352)
	at org.apache.hadoop.mapreduce.Job$11.run(Job.java:1218)
	at org.apache.hadoop.mapreduce.Job$11.run(Job.java:1215)
	at java.security.AccessController.doPrivileged(Native Method)
	at javax.security.auth.Subject.doAs(Subject.java:396)
	at org.apache.hadoop.security.UserGroupInformation.doAs(UserGroupInformation.java:1489)
	at org.apache.hadoop.mapreduce.Job.submit(Job.java:1215)
	at org.apache.hadoop.mapreduce.Job.waitForCompletion(Job.java:1236)
	at org.apache.hadoop.mapreduce.lib.output.TestJobOutputCommitter.testSuccessfulJob(TestJobOutputCommitter.java:149)
	at org.apache.hadoop.mapreduce.lib.output.TestJobOutputCommitter.testCustomCleanup(TestJobOutputCommitter.java:269)
	at sun.reflect.NativeMethodAccessorImpl.invoke0(Native Method)
	at sun.reflect.NativeMethodAccessorImpl.invoke(NativeMethodAccessorImpl.java:39)
	at sun.reflect.DelegatingMethodAccessorImpl.invoke(DelegatingMethodAccessorImpl.java:25)
	at java.lang.reflect.Method.invoke(Method.java:597)
	at junit.framework.TestCase.runTest(TestCase.java:168)
	at junit.framework.TestCase.runBare(TestCase.java:134)
	at junit.framework.TestResult$1.protect(TestResult.java:110)
	at junit.framework.TestResult.runProtected(TestResult.java:128)
	at junit.framework.TestResult.run(TestResult.java:113)
	at junit.framework.TestCase.run(TestCase.java:124)
	at junit.framework.TestSuite.runTest(TestSuite.java:243)
	at junit.framework.TestSuite.run(TestSuite.java:238)
	at org.junit.internal.runners.JUnit38ClassRunner.run(JUnit38ClassRunner.java:83)
	at org.apache.maven.surefire.junit4.JUnit4Provider.execute(JUnit4Provider.java:252)
	at org.apache.maven.surefire.junit4.JUnit4Provider.executeTestSet(JUnit4Provider.java:141)
	at org.apache.maven.surefire.junit4.JUnit4Provider.invoke(JUnit4Provider.java:112)
	at sun.reflect.NativeMethodAccessorImpl.invoke0(Native Method)
	at sun.reflect.NativeMethodAccessorImpl.invoke(NativeMethodAccessorImpl.java:39)
	at sun.reflect.DelegatingMethodAccessorImpl.invoke(DelegatingMethodAccessorImpl.java:25)
	at java.lang.reflect.Method.invoke(Method.java:597)
	at org.apache.maven.surefire.util.ReflectionUtils.invokeMethodWithArray(ReflectionUtils.java:189)
	at org.apache.maven.surefire.booter.ProviderFactory$ProviderProxy.invoke(ProviderFactory.java:165)
	at org.apache.maven.surefire.booter.ProviderFactory.invokeProvider(ProviderFactory.java:85)
	at org.apache.maven.surefire.booter.ForkedBooter.runSuitesInProcess(ForkedBooter.java:115)
	at org.apache.maven.surefire.booter.ForkedBooter.main(ForkedBooter.java:75)
Caused by: com.google.protobuf.ServiceException: java.net.ConnectException: Call From asf007.sp2.ygridcore.net/67.195.138.25 to 0.0.0.0:8032 failed on connection exception: java.net.ConnectException: Connection refused; For more details see:  http://wiki.apache.org/hadoop/ConnectionRefused
	at org.apache.hadoop.ipc.ProtobufRpcEngine$Invoker.invoke(ProtobufRpcEngine.java:214)
	at $Proxy70.getNewApplication(Unknown Source)
	at org.apache.hadoop.yarn.api.impl.pb.client.ClientRMProtocolPBClientImpl.getNewApplication(ClientRMProtocolPBClientImpl.java:159)
	... 38 more
Caused by: java.net.ConnectException: Call From asf007.sp2.ygridcore.net/67.195.138.25 to 0.0.0.0:8032 failed on connection exception: java.net.ConnectException: Connection refused; For more details see:  http://wiki.apache.org/hadoop/ConnectionRefused
	at sun.reflect.NativeConstructorAccessorImpl.newInstance0(Native Method)
	at sun.reflect.NativeConstructorAccessorImpl.newInstance(NativeConstructorAccessorImpl.java:39)
	at sun.reflect.DelegatingConstructorAccessorImpl.newInstance(DelegatingConstructorAccessorImpl.java:27)
	at java.lang.reflect.Constructor.newInstance(Constructor.java:513)
	at org.apache.hadoop.net.NetUtils.wrapWithMessage(NetUtils.java:780)
	at org.apache.hadoop.net.NetUtils.wrapException(NetUtils.java:727)
	at org.apache.hadoop.ipc.Client.call(Client.java:1305)
	at org.apache.hadoop.ipc.Client.call(Client.java:1253)
	at org.apache.hadoop.ipc.ProtobufRpcEngine$Invoker.invoke(ProtobufRpcEngine.java:204)
	... 40 more
Caused by: java.net.ConnectException: Connection refused
	at sun.nio.ch.SocketChannelImpl.checkConnect(Native Method)
	at sun.nio.ch.SocketChannelImpl.finishConnect(SocketChannelImpl.java:567)
	at org.apache.hadoop.net.SocketIOWithTimeout.connect(SocketIOWithTimeout.java:206)
	at org.apache.hadoop.net.NetUtils.connect(NetUtils.java:526)
	at org.apache.hadoop.net.NetUtils.connect(NetUtils.java:490)
	at org.apache.hadoop.ipc.Client$Connection.setupConnection(Client.java:511)
	at org.apache.hadoop.ipc.Client$Connection.setupIOstreams(Client.java:606)
	at org.apache.hadoop.ipc.Client$Connection.access$2100(Client.java:254)
	at org.apache.hadoop.ipc.Client.getConnection(Client.java:1354)
	at org.apache.hadoop.ipc.Client.call(Client.java:1272)
	... 42 more


FAILED:  org.apache.hadoop.mapreduce.security.TestBinaryTokenFile.testBinaryTokenFile

Error Message:
Job failed

Stack Trace:
java.lang.AssertionError: Job failed
	at org.junit.Assert.fail(Assert.java:91)
	at org.apache.hadoop.mapreduce.security.TestBinaryTokenFile.testBinaryTokenFile(TestBinaryTokenFile.java:251)
	at sun.reflect.NativeMethodAccessorImpl.invoke0(Native Method)
	at sun.reflect.NativeMethodAccessorImpl.invoke(NativeMethodAccessorImpl.java:39)
	at sun.reflect.DelegatingMethodAccessorImpl.invoke(DelegatingMethodAccessorImpl.java:25)
	at java.lang.reflect.Method.invoke(Method.java:597)
	at org.junit.runners.model.FrameworkMethod$1.runReflectiveCall(FrameworkMethod.java:44)
	at org.junit.internal.runners.model.ReflectiveCallable.run(ReflectiveCallable.java:15)
	at org.junit.runners.model.FrameworkMethod.invokeExplosively(FrameworkMethod.java:41)
	at org.junit.internal.runners.statements.InvokeMethod.evaluate(InvokeMethod.java:20)
	at org.junit.runners.BlockJUnit4ClassRunner.runNotIgnored(BlockJUnit4ClassRunner.java:79)
	at org.junit.runners.BlockJUnit4ClassRunner.runChild(BlockJUnit4ClassRunner.java:71)
	at org.junit.runners.BlockJUnit4ClassRunner.runChild(BlockJUnit4ClassRunner.java:49)
	at org.junit.runners.ParentRunner$3.run(ParentRunner.java:193)
	at org.junit.runners.ParentRunner$1.schedule(ParentRunner.java:52)
	at org.junit.runners.ParentRunner.runChildren(ParentRunner.java:191)
	at org.junit.runners.ParentRunner.access$000(ParentRunner.java:42)
	at org.junit.runners.ParentRunner$2.evaluate(ParentRunner.java:184)
	at org.junit.internal.runners.statements.RunBefores.evaluate(RunBefores.java:28)
	at org.junit.internal.runners.statements.RunAfters.evaluate(RunAfters.java:31)
	at org.junit.runners.ParentRunner.run(ParentRunner.java:236)
	at org.apache.maven.surefire.junit4.JUnit4Provider.execute(JUnit4Provider.java:252)
	at org.apache.maven.surefire.junit4.JUnit4Provider.executeTestSet(JUnit4Provider.java:141)
	at org.apache.maven.surefire.junit4.JUnit4Provider.invoke(JUnit4Provider.java:112)
	at sun.reflect.NativeMethodAccessorImpl.invoke0(Native Method)
	at sun.reflect.NativeMethodAccessorImpl.invoke(NativeMethodAccessorImpl.java:39)
	at sun.reflect.DelegatingMethodAccessorImpl.invoke(DelegatingMethodAccessorImpl.java:25)
	at java.lang.reflect.Method.invoke(Method.java:597)
	at org.apache.maven.surefire.util.ReflectionUtils.invokeMethodWithArray(ReflectionUtils.java:189)
	at org.apache.maven.surefire.booter.ProviderFactory$ProviderProxy.invoke(ProviderFactory.java:165)
	at org.apache.maven.surefire.booter.ProviderFactory.invokeProvider(ProviderFactory.java:85)
	at org.apache.maven.surefire.booter.ForkedBooter.runSuitesInProcess(ForkedBooter.java:115)
	at org.apache.maven.surefire.booter.ForkedBooter.main(ForkedBooter.java:75)


FAILED:  org.apache.hadoop.mapreduce.security.TestMRCredentials.test

Error Message:
Job failed

Stack Trace:
java.lang.AssertionError: Job failed
	at org.junit.Assert.fail(Assert.java:91)
	at org.apache.hadoop.mapreduce.security.TestMRCredentials.test(TestMRCredentials.java:132)
	at sun.reflect.NativeMethodAccessorImpl.invoke0(Native Method)
	at sun.reflect.NativeMethodAccessorImpl.invoke(NativeMethodAccessorImpl.java:39)
	at sun.reflect.DelegatingMethodAccessorImpl.invoke(DelegatingMethodAccessorImpl.java:25)
	at java.lang.reflect.Method.invoke(Method.java:597)
	at org.junit.runners.model.FrameworkMethod$1.runReflectiveCall(FrameworkMethod.java:44)
	at org.junit.internal.runners.model.ReflectiveCallable.run(ReflectiveCallable.java:15)
	at org.junit.runners.model.FrameworkMethod.invokeExplosively(FrameworkMethod.java:41)
	at org.junit.internal.runners.statements.InvokeMethod.evaluate(InvokeMethod.java:20)
	at org.junit.runners.BlockJUnit4ClassRunner.runNotIgnored(BlockJUnit4ClassRunner.java:79)
	at org.junit.runners.BlockJUnit4ClassRunner.runChild(BlockJUnit4ClassRunner.java:71)
	at org.junit.runners.BlockJUnit4ClassRunner.runChild(BlockJUnit4ClassRunner.java:49)
	at org.junit.runners.ParentRunner$3.run(ParentRunner.java:193)
	at org.junit.runners.ParentRunner$1.schedule(ParentRunner.java:52)
	at org.junit.runners.ParentRunner.runChildren(ParentRunner.java:191)
	at org.junit.runners.ParentRunner.access$000(ParentRunner.java:42)
	at org.junit.runners.ParentRunner$2.evaluate(ParentRunner.java:184)
	at org.junit.internal.runners.statements.RunBefores.evaluate(RunBefores.java:28)
	at org.junit.internal.runners.statements.RunAfters.evaluate(RunAfters.java:31)
	at org.junit.runners.ParentRunner.run(ParentRunner.java:236)
	at org.apache.maven.surefire.junit4.JUnit4Provider.execute(JUnit4Provider.java:252)
	at org.apache.maven.surefire.junit4.JUnit4Provider.executeTestSet(JUnit4Provider.java:141)
	at org.apache.maven.surefire.junit4.JUnit4Provider.invoke(JUnit4Provider.java:112)
	at sun.reflect.NativeMethodAccessorImpl.invoke0(Native Method)
	at sun.reflect.NativeMethodAccessorImpl.invoke(NativeMethodAccessorImpl.java:39)
	at sun.reflect.DelegatingMethodAccessorImpl.invoke(DelegatingMethodAccessorImpl.java:25)
	at java.lang.reflect.Method.invoke(Method.java:597)
	at org.apache.maven.surefire.util.ReflectionUtils.invokeMethodWithArray(ReflectionUtils.java:189)
	at org.apache.maven.surefire.booter.ProviderFactory$ProviderProxy.invoke(ProviderFactory.java:165)
	at org.apache.maven.surefire.booter.ProviderFactory.invokeProvider(ProviderFactory.java:85)
	at org.apache.maven.surefire.booter.ForkedBooter.runSuitesInProcess(ForkedBooter.java:115)
	at org.apache.maven.surefire.booter.ForkedBooter.main(ForkedBooter.java:75)


FAILED:  org.apache.hadoop.mapreduce.security.ssl.TestEncryptedShuffle.encryptedShuffleWithClientCerts

Error Message:
null

Stack Trace:
java.lang.reflect.UndeclaredThrowableException
	at org.apache.hadoop.yarn.exceptions.impl.pb.YarnRemoteExceptionPBImpl.unwrapAndThrowException(YarnRemoteExceptionPBImpl.java:135)
	at org.apache.hadoop.yarn.api.impl.pb.client.ClientRMProtocolPBClientImpl.getNewApplication(ClientRMProtocolPBClientImpl.java:162)
	at org.apache.hadoop.yarn.client.YarnClientImpl.getNewApplication(YarnClientImpl.java:121)
	at org.apache.hadoop.mapred.ResourceMgrDelegate.getNewJobID(ResourceMgrDelegate.java:102)
	at org.apache.hadoop.mapred.YARNRunner.getNewJobID(YARNRunner.java:215)
	at org.apache.hadoop.mapreduce.JobSubmitter.submitJobInternal(JobSubmitter.java:352)
	at org.apache.hadoop.mapreduce.Job$11.run(Job.java:1218)
	at org.apache.hadoop.mapreduce.Job$11.run(Job.java:1215)
	at java.security.AccessController.doPrivileged(Native Method)
	at javax.security.auth.Subject.doAs(Subject.java:396)
	at org.apache.hadoop.security.UserGroupInformation.doAs(UserGroupInformation.java:1489)
	at org.apache.hadoop.mapreduce.Job.submit(Job.java:1215)
	at org.apache.hadoop.mapred.JobClient$1.run(JobClient.java:581)
	at org.apache.hadoop.mapred.JobClient$1.run(JobClient.java:576)
	at java.security.AccessController.doPrivileged(Native Method)
	at javax.security.auth.Subject.doAs(Subject.java:396)
	at org.apache.hadoop.security.UserGroupInformation.doAs(UserGroupInformation.java:1489)
	at org.apache.hadoop.mapred.JobClient.submitJob(JobClient.java:576)
	at org.apache.hadoop.mapreduce.security.ssl.TestEncryptedShuffle.encryptedShuffleWithCerts(TestEncryptedShuffle.java:153)
	at org.apache.hadoop.mapreduce.security.ssl.TestEncryptedShuffle.encryptedShuffleWithClientCerts(TestEncryptedShuffle.java:164)
	at sun.reflect.NativeMethodAccessorImpl.invoke0(Native Method)
	at sun.reflect.NativeMethodAccessorImpl.invoke(NativeMethodAccessorImpl.java:39)
	at sun.reflect.DelegatingMethodAccessorImpl.invoke(DelegatingMethodAccessorImpl.java:25)
	at java.lang.reflect.Method.invoke(Method.java:597)
	at org.junit.runners.model.FrameworkMethod$1.runReflectiveCall(FrameworkMethod.java:44)
	at org.junit.internal.runners.model.ReflectiveCallable.run(ReflectiveCallable.java:15)
	at org.junit.runners.model.FrameworkMethod.invokeExplosively(FrameworkMethod.java:41)
	at org.junit.internal.runners.statements.InvokeMethod.evaluate(InvokeMethod.java:20)
	at org.junit.internal.runners.statements.RunBefores.evaluate(RunBefores.java:28)
	at org.junit.internal.runners.statements.RunAfters.evaluate(RunAfters.java:31)
	at org.junit.runners.BlockJUnit4ClassRunner.runNotIgnored(BlockJUnit4ClassRunner.java:79)
	at org.junit.runners.BlockJUnit4ClassRunner.runChild(BlockJUnit4ClassRunner.java:71)
	at org.junit.runners.BlockJUnit4ClassRunner.runChild(BlockJUnit4ClassRunner.java:49)
	at org.junit.runners.ParentRunner$3.run(ParentRunner.java:193)
	at org.junit.runners.ParentRunner$1.schedule(ParentRunner.java:52)
	at org.junit.runners.ParentRunner.runChildren(ParentRunner.java:191)
	at org.junit.runners.ParentRunner.access$000(ParentRunner.java:42)
	at org.junit.runners.ParentRunner$2.evaluate(ParentRunner.java:184)
	at org.junit.internal.runners.statements.RunBefores.evaluate(RunBefores.java:28)
	at org.junit.runners.ParentRunner.run(ParentRunner.java:236)
	at org.apache.maven.surefire.junit4.JUnit4Provider.execute(JUnit4Provider.java:252)
	at org.apache.maven.surefire.junit4.JUnit4Provider.executeTestSet(JUnit4Provider.java:141)
	at org.apache.maven.surefire.junit4.JUnit4Provider.invoke(JUnit4Provider.java:112)
	at sun.reflect.NativeMethodAccessorImpl.invoke0(Native Method)
	at sun.reflect.NativeMethodAccessorImpl.invoke(NativeMethodAccessorImpl.java:39)
	at sun.reflect.DelegatingMethodAccessorImpl.invoke(DelegatingMethodAccessorImpl.java:25)
	at java.lang.reflect.Method.invoke(Method.java:597)
	at org.apache.maven.surefire.util.ReflectionUtils.invokeMethodWithArray(ReflectionUtils.java:189)
	at org.apache.maven.surefire.booter.ProviderFactory$ProviderProxy.invoke(ProviderFactory.java:165)
	at org.apache.maven.surefire.booter.ProviderFactory.invokeProvider(ProviderFactory.java:85)
	at org.apache.maven.surefire.booter.ForkedBooter.runSuitesInProcess(ForkedBooter.java:115)
	at org.apache.maven.surefire.booter.ForkedBooter.main(ForkedBooter.java:75)
Caused by: com.google.protobuf.ServiceException: java.net.ConnectException: Call From asf007.sp2.ygridcore.net/67.195.138.25 to 0.0.0.0:8032 failed on connection exception: java.net.ConnectException: Connection refused; For more details see:  http://wiki.apache.org/hadoop/ConnectionRefused
	at org.apache.hadoop.ipc.ProtobufRpcEngine$Invoker.invoke(ProtobufRpcEngine.java:214)
	at $Proxy78.getNewApplication(Unknown Source)
	at org.apache.hadoop.yarn.api.impl.pb.client.ClientRMProtocolPBClientImpl.getNewApplication(ClientRMProtocolPBClientImpl.java:159)
	... 50 more
Caused by: java.net.ConnectException: Call From asf007.sp2.ygridcore.net/67.195.138.25 to 0.0.0.0:8032 failed on connection exception: java.net.ConnectException: Connection refused; For more details see:  http://wiki.apache.org/hadoop/ConnectionRefused
	at sun.reflect.NativeConstructorAccessorImpl.newInstance0(Native Method)
	at sun.reflect.NativeConstructorAccessorImpl.newInstance(NativeConstructorAccessorImpl.java:39)
	at sun.reflect.DelegatingConstructorAccessorImpl.newInstance(DelegatingConstructorAccessorImpl.java:27)
	at java.lang.reflect.Constructor.newInstance(Constructor.java:513)
	at org.apache.hadoop.net.NetUtils.wrapWithMessage(NetUtils.java:780)
	at org.apache.hadoop.net.NetUtils.wrapException(NetUtils.java:727)
	at org.apache.hadoop.ipc.Client.call(Client.java:1305)
	at org.apache.hadoop.ipc.Client.call(Client.java:1253)
	at org.apache.hadoop.ipc.ProtobufRpcEngine$Invoker.invoke(ProtobufRpcEngine.java:204)
	... 52 more
Caused by: java.net.ConnectException: Connection refused
	at sun.nio.ch.SocketChannelImpl.checkConnect(Native Method)
	at sun.nio.ch.SocketChannelImpl.finishConnect(SocketChannelImpl.java:567)
	at org.apache.hadoop.net.SocketIOWithTimeout.connect(SocketIOWithTimeout.java:206)
	at org.apache.hadoop.net.NetUtils.connect(NetUtils.java:526)
	at org.apache.hadoop.net.NetUtils.connect(NetUtils.java:490)
	at org.apache.hadoop.ipc.Client$Connection.setupConnection(Client.java:511)
	at org.apache.hadoop.ipc.Client$Connection.setupIOstreams(Client.java:606)
	at org.apache.hadoop.ipc.Client$Connection.access$2100(Client.java:254)
	at org.apache.hadoop.ipc.Client.getConnection(Client.java:1354)
	at org.apache.hadoop.ipc.Client.call(Client.java:1272)
	... 54 more


FAILED:  org.apache.hadoop.mapreduce.security.ssl.TestEncryptedShuffle.encryptedShuffleWithoutClientCerts

Error Message:
null

Stack Trace:
java.lang.reflect.UndeclaredThrowableException
	at org.apache.hadoop.yarn.exceptions.impl.pb.YarnRemoteExceptionPBImpl.unwrapAndThrowException(YarnRemoteExceptionPBImpl.java:135)
	at org.apache.hadoop.yarn.api.impl.pb.client.ClientRMProtocolPBClientImpl.getNewApplication(ClientRMProtocolPBClientImpl.java:162)
	at org.apache.hadoop.yarn.client.YarnClientImpl.getNewApplication(YarnClientImpl.java:121)
	at org.apache.hadoop.mapred.ResourceMgrDelegate.getNewJobID(ResourceMgrDelegate.java:102)
	at org.apache.hadoop.mapred.YARNRunner.getNewJobID(YARNRunner.java:215)
	at org.apache.hadoop.mapreduce.JobSubmitter.submitJobInternal(JobSubmitter.java:352)
	at org.apache.hadoop.mapreduce.Job$11.run(Job.java:1218)
	at org.apache.hadoop.mapreduce.Job$11.run(Job.java:1215)
	at java.security.AccessController.doPrivileged(Native Method)
	at javax.security.auth.Subject.doAs(Subject.java:396)
	at org.apache.hadoop.security.UserGroupInformation.doAs(UserGroupInformation.java:1489)
	at org.apache.hadoop.mapreduce.Job.submit(Job.java:1215)
	at org.apache.hadoop.mapred.JobClient$1.run(JobClient.java:581)
	at org.apache.hadoop.mapred.JobClient$1.run(JobClient.java:576)
	at java.security.AccessController.doPrivileged(Native Method)
	at javax.security.auth.Subject.doAs(Subject.java:396)
	at org.apache.hadoop.security.UserGroupInformation.doAs(UserGroupInformation.java:1489)
	at org.apache.hadoop.mapred.JobClient.submitJob(JobClient.java:576)
	at org.apache.hadoop.mapreduce.security.ssl.TestEncryptedShuffle.encryptedShuffleWithCerts(TestEncryptedShuffle.java:153)
	at org.apache.hadoop.mapreduce.security.ssl.TestEncryptedShuffle.encryptedShuffleWithoutClientCerts(TestEncryptedShuffle.java:169)
	at sun.reflect.NativeMethodAccessorImpl.invoke0(Native Method)
	at sun.reflect.NativeMethodAccessorImpl.invoke(NativeMethodAccessorImpl.java:39)
	at sun.reflect.DelegatingMethodAccessorImpl.invoke(DelegatingMethodAccessorImpl.java:25)
	at java.lang.reflect.Method.invoke(Method.java:597)
	at org.junit.runners.model.FrameworkMethod$1.runReflectiveCall(FrameworkMethod.java:44)
	at org.junit.internal.runners.model.ReflectiveCallable.run(ReflectiveCallable.java:15)
	at org.junit.runners.model.FrameworkMethod.invokeExplosively(FrameworkMethod.java:41)
	at org.junit.internal.runners.statements.InvokeMethod.evaluate(InvokeMethod.java:20)
	at org.junit.internal.runners.statements.RunBefores.evaluate(RunBefores.java:28)
	at org.junit.internal.runners.statements.RunAfters.evaluate(RunAfters.java:31)
	at org.junit.runners.BlockJUnit4ClassRunner.runNotIgnored(BlockJUnit4ClassRunner.java:79)
	at org.junit.runners.BlockJUnit4ClassRunner.runChild(BlockJUnit4ClassRunner.java:71)
	at org.junit.runners.BlockJUnit4ClassRunner.runChild(BlockJUnit4ClassRunner.java:49)
	at org.junit.runners.ParentRunner$3.run(ParentRunner.java:193)
	at org.junit.runners.ParentRunner$1.schedule(ParentRunner.java:52)
	at org.junit.runners.ParentRunner.runChildren(ParentRunner.java:191)
	at org.junit.runners.ParentRunner.access$000(ParentRunner.java:42)
	at org.junit.runners.ParentRunner$2.evaluate(ParentRunner.java:184)
	at org.junit.internal.runners.statements.RunBefores.evaluate(RunBefores.java:28)
	at org.junit.runners.ParentRunner.run(ParentRunner.java:236)
	at org.apache.maven.surefire.junit4.JUnit4Provider.execute(JUnit4Provider.java:252)
	at org.apache.maven.surefire.junit4.JUnit4Provider.executeTestSet(JUnit4Provider.java:141)
	at org.apache.maven.surefire.junit4.JUnit4Provider.invoke(JUnit4Provider.java:112)
	at sun.reflect.NativeMethodAccessorImpl.invoke0(Native Method)
	at sun.reflect.NativeMethodAccessorImpl.invoke(NativeMethodAccessorImpl.java:39)
	at sun.reflect.DelegatingMethodAccessorImpl.invoke(DelegatingMethodAccessorImpl.java:25)
	at java.lang.reflect.Method.invoke(Method.java:597)
	at org.apache.maven.surefire.util.ReflectionUtils.invokeMethodWithArray(ReflectionUtils.java:189)
	at org.apache.maven.surefire.booter.ProviderFactory$ProviderProxy.invoke(ProviderFactory.java:165)
	at org.apache.maven.surefire.booter.ProviderFactory.invokeProvider(ProviderFactory.java:85)
	at org.apache.maven.surefire.booter.ForkedBooter.runSuitesInProcess(ForkedBooter.java:115)
	at org.apache.maven.surefire.booter.ForkedBooter.main(ForkedBooter.java:75)
Caused by: com.google.protobuf.ServiceException: java.net.ConnectException: Call From asf007.sp2.ygridcore.net/67.195.138.25 to 0.0.0.0:8032 failed on connection exception: java.net.ConnectException: Connection refused; For more details see:  http://wiki.apache.org/hadoop/ConnectionRefused
	at org.apache.hadoop.ipc.ProtobufRpcEngine$Invoker.invoke(ProtobufRpcEngine.java:214)
	at $Proxy78.getNewApplication(Unknown Source)
	at org.apache.hadoop.yarn.api.impl.pb.client.ClientRMProtocolPBClientImpl.getNewApplication(ClientRMProtocolPBClientImpl.java:159)
	... 50 more
Caused by: java.net.ConnectException: Call From asf007.sp2.ygridcore.net/67.195.138.25 to 0.0.0.0:8032 failed on connection exception: java.net.ConnectException: Connection refused; For more details see:  http://wiki.apache.org/hadoop/ConnectionRefused
	at sun.reflect.NativeConstructorAccessorImpl.newInstance0(Native Method)
	at sun.reflect.NativeConstructorAccessorImpl.newInstance(NativeConstructorAccessorImpl.java:39)
	at sun.reflect.DelegatingConstructorAccessorImpl.newInstance(DelegatingConstructorAccessorImpl.java:27)
	at java.lang.reflect.Constructor.newInstance(Constructor.java:513)
	at org.apache.hadoop.net.NetUtils.wrapWithMessage(NetUtils.java:780)
	at org.apache.hadoop.net.NetUtils.wrapException(NetUtils.java:727)
	at org.apache.hadoop.ipc.Client.call(Client.java:1305)
	at org.apache.hadoop.ipc.Client.call(Client.java:1253)
	at org.apache.hadoop.ipc.ProtobufRpcEngine$Invoker.invoke(ProtobufRpcEngine.java:204)
	... 52 more
Caused by: java.net.ConnectException: Connection refused
	at sun.nio.ch.SocketChannelImpl.checkConnect(Native Method)
	at sun.nio.ch.SocketChannelImpl.finishConnect(SocketChannelImpl.java:567)
	at org.apache.hadoop.net.SocketIOWithTimeout.connect(SocketIOWithTimeout.java:206)
	at org.apache.hadoop.net.NetUtils.connect(NetUtils.java:526)
	at org.apache.hadoop.net.NetUtils.connect(NetUtils.java:490)
	at org.apache.hadoop.ipc.Client$Connection.setupConnection(Client.java:511)
	at org.apache.hadoop.ipc.Client$Connection.setupIOstreams(Client.java:606)
	at org.apache.hadoop.ipc.Client$Connection.access$2100(Client.java:254)
	at org.apache.hadoop.ipc.Client.getConnection(Client.java:1354)
	at org.apache.hadoop.ipc.Client.call(Client.java:1272)
	... 54 more


FAILED:  org.apache.hadoop.mapreduce.v2.TestMRAppWithCombiner.org.apache.hadoop.mapreduce.v2.TestMRAppWithCombiner

Error Message:
java.io.IOException: NodeManager 1 failed to start

Stack Trace:
org.apache.hadoop.yarn.YarnException: java.io.IOException: NodeManager 1 failed to start
	at org.apache.hadoop.yarn.server.MiniYARNCluster$NodeManagerWrapper.innerStart(MiniYARNCluster.java:325)
	at org.apache.hadoop.yarn.service.AbstractService.start(AbstractService.java:158)
	at org.apache.hadoop.yarn.service.CompositeService.innerStart(CompositeService.java:65)
	at org.apache.hadoop.yarn.service.AbstractService.start(AbstractService.java:158)
	at org.apache.hadoop.mapreduce.v2.TestMRAppWithCombiner.setup(TestMRAppWithCombiner.java:80)
	at sun.reflect.NativeMethodAccessorImpl.invoke0(Native Method)
	at sun.reflect.NativeMethodAccessorImpl.invoke(NativeMethodAccessorImpl.java:39)
	at sun.reflect.DelegatingMethodAccessorImpl.invoke(DelegatingMethodAccessorImpl.java:25)
	at java.lang.reflect.Method.invoke(Method.java:597)
	at org.junit.runners.model.FrameworkMethod$1.runReflectiveCall(FrameworkMethod.java:44)
	at org.junit.internal.runners.model.ReflectiveCallable.run(ReflectiveCallable.java:15)
	at org.junit.runners.model.FrameworkMethod.invokeExplosively(FrameworkMethod.java:41)
	at org.junit.internal.runners.statements.RunBefores.evaluate(RunBefores.java:27)
	at org.junit.internal.runners.statements.RunAfters.evaluate(RunAfters.java:31)
	at org.junit.runners.ParentRunner.run(ParentRunner.java:236)
	at org.apache.maven.surefire.junit4.JUnit4Provider.execute(JUnit4Provider.java:252)
	at org.apache.maven.surefire.junit4.JUnit4Provider.executeTestSet(JUnit4Provider.java:141)
	at org.apache.maven.surefire.junit4.JUnit4Provider.invoke(JUnit4Provider.java:112)
	at sun.reflect.NativeMethodAccessorImpl.invoke0(Native Method)
	at sun.reflect.NativeMethodAccessorImpl.invoke(NativeMethodAccessorImpl.java:39)
	at sun.reflect.DelegatingMethodAccessorImpl.invoke(DelegatingMethodAccessorImpl.java:25)
	at java.lang.reflect.Method.invoke(Method.java:597)
	at org.apache.maven.surefire.util.ReflectionUtils.invokeMethodWithArray(ReflectionUtils.java:189)
	at org.apache.maven.surefire.booter.ProviderFactory$ProviderProxy.invoke(ProviderFactory.java:165)
	at org.apache.maven.surefire.booter.ProviderFactory.invokeProvider(ProviderFactory.java:85)
	at org.apache.maven.surefire.booter.ForkedBooter.runSuitesInProcess(ForkedBooter.java:115)
	at org.apache.maven.surefire.booter.ForkedBooter.main(ForkedBooter.java:75)
Caused by: java.io.IOException: NodeManager 1 failed to start
	at org.apache.hadoop.yarn.server.MiniYARNCluster$NodeManagerWrapper.innerStart(MiniYARNCluster.java:321)
	... 26 more


FAILED:  org.apache.hadoop.mapreduce.v2.TestMRJobs.org.apache.hadoop.mapreduce.v2.TestMRJobs

Error Message:
java.io.IOException: NodeManager 1 failed to start

Stack Trace:
org.apache.hadoop.yarn.YarnException: java.io.IOException: NodeManager 1 failed to start
	at org.apache.hadoop.yarn.server.MiniYARNCluster$NodeManagerWrapper.innerStart(MiniYARNCluster.java:325)
	at org.apache.hadoop.yarn.service.AbstractService.start(AbstractService.java:158)
	at org.apache.hadoop.yarn.service.CompositeService.innerStart(CompositeService.java:65)
	at org.apache.hadoop.yarn.service.AbstractService.start(AbstractService.java:158)
	at org.apache.hadoop.mapreduce.v2.TestMRJobs.setup(TestMRJobs.java:126)
	at sun.reflect.NativeMethodAccessorImpl.invoke0(Native Method)
	at sun.reflect.NativeMethodAccessorImpl.invoke(NativeMethodAccessorImpl.java:39)
	at sun.reflect.DelegatingMethodAccessorImpl.invoke(DelegatingMethodAccessorImpl.java:25)
	at java.lang.reflect.Method.invoke(Method.java:597)
	at org.junit.runners.model.FrameworkMethod$1.runReflectiveCall(FrameworkMethod.java:44)
	at org.junit.internal.runners.model.ReflectiveCallable.run(ReflectiveCallable.java:15)
	at org.junit.runners.model.FrameworkMethod.invokeExplosively(FrameworkMethod.java:41)
	at org.junit.internal.runners.statements.RunBefores.evaluate(RunBefores.java:27)
	at org.junit.internal.runners.statements.RunAfters.evaluate(RunAfters.java:31)
	at org.junit.runners.ParentRunner.run(ParentRunner.java:236)
	at org.apache.maven.surefire.junit4.JUnit4Provider.execute(JUnit4Provider.java:252)
	at org.apache.maven.surefire.junit4.JUnit4Provider.executeTestSet(JUnit4Provider.java:141)
	at org.apache.maven.surefire.junit4.JUnit4Provider.invoke(JUnit4Provider.java:112)
	at sun.reflect.NativeMethodAccessorImpl.invoke0(Native Method)
	at sun.reflect.NativeMethodAccessorImpl.invoke(NativeMethodAccessorImpl.java:39)
	at sun.reflect.DelegatingMethodAccessorImpl.invoke(DelegatingMethodAccessorImpl.java:25)
	at java.lang.reflect.Method.invoke(Method.java:597)
	at org.apache.maven.surefire.util.ReflectionUtils.invokeMethodWithArray(ReflectionUtils.java:189)
	at org.apache.maven.surefire.booter.ProviderFactory$ProviderProxy.invoke(ProviderFactory.java:165)
	at org.apache.maven.surefire.booter.ProviderFactory.invokeProvider(ProviderFactory.java:85)
	at org.apache.maven.surefire.booter.ForkedBooter.runSuitesInProcess(ForkedBooter.java:115)
	at org.apache.maven.surefire.booter.ForkedBooter.main(ForkedBooter.java:75)
Caused by: java.io.IOException: NodeManager 1 failed to start
	at org.apache.hadoop.yarn.server.MiniYARNCluster$NodeManagerWrapper.innerStart(MiniYARNCluster.java:321)
	... 26 more


FAILED:  org.apache.hadoop.mapreduce.v2.TestMRJobsWithHistoryService.testJobHistoryData

Error Message:
null

Stack Trace:
java.lang.reflect.UndeclaredThrowableException
	at org.apache.hadoop.yarn.exceptions.impl.pb.YarnRemoteExceptionPBImpl.unwrapAndThrowException(YarnRemoteExceptionPBImpl.java:135)
	at org.apache.hadoop.yarn.api.impl.pb.client.ClientRMProtocolPBClientImpl.getNewApplication(ClientRMProtocolPBClientImpl.java:162)
	at org.apache.hadoop.yarn.client.YarnClientImpl.getNewApplication(YarnClientImpl.java:121)
	at org.apache.hadoop.mapred.ResourceMgrDelegate.getNewJobID(ResourceMgrDelegate.java:102)
	at org.apache.hadoop.mapred.YARNRunner.getNewJobID(YARNRunner.java:215)
	at org.apache.hadoop.mapreduce.JobSubmitter.submitJobInternal(JobSubmitter.java:352)
	at org.apache.hadoop.mapreduce.Job$11.run(Job.java:1218)
	at org.apache.hadoop.mapreduce.Job$11.run(Job.java:1215)
	at java.security.AccessController.doPrivileged(Native Method)
	at javax.security.auth.Subject.doAs(Subject.java:396)
	at org.apache.hadoop.security.UserGroupInformation.doAs(UserGroupInformation.java:1489)
	at org.apache.hadoop.mapreduce.Job.submit(Job.java:1215)
	at org.apache.hadoop.mapreduce.Job.waitForCompletion(Job.java:1236)
	at org.apache.hadoop.mapreduce.v2.TestMRJobsWithHistoryService.testJobHistoryData(TestMRJobsWithHistoryService.java:132)
	at sun.reflect.NativeMethodAccessorImpl.invoke0(Native Method)
	at sun.reflect.NativeMethodAccessorImpl.invoke(NativeMethodAccessorImpl.java:39)
	at sun.reflect.DelegatingMethodAccessorImpl.invoke(DelegatingMethodAccessorImpl.java:25)
	at java.lang.reflect.Method.invoke(Method.java:597)
	at org.junit.runners.model.FrameworkMethod$1.runReflectiveCall(FrameworkMethod.java:44)
	at org.junit.internal.runners.model.ReflectiveCallable.run(ReflectiveCallable.java:15)
	at org.junit.runners.model.FrameworkMethod.invokeExplosively(FrameworkMethod.java:41)
	at org.junit.internal.runners.statements.InvokeMethod.evaluate(InvokeMethod.java:20)
	at org.junit.internal.runners.statements.FailOnTimeout$1.run(FailOnTimeout.java:28)
Caused by: com.google.protobuf.ServiceException: java.net.ConnectException: Call From asf007.sp2.ygridcore.net/67.195.138.25 to 0.0.0.0:8032 failed on connection exception: java.net.ConnectException: Connection refused; For more details see:  http://wiki.apache.org/hadoop/ConnectionRefused
	at org.apache.hadoop.ipc.ProtobufRpcEngine$Invoker.invoke(ProtobufRpcEngine.java:214)
	at $Proxy73.getNewApplication(Unknown Source)
	at org.apache.hadoop.yarn.api.impl.pb.client.ClientRMProtocolPBClientImpl.getNewApplication(ClientRMProtocolPBClientImpl.java:159)
	... 21 more
Caused by: java.net.ConnectException: Call From asf007.sp2.ygridcore.net/67.195.138.25 to 0.0.0.0:8032 failed on connection exception: java.net.ConnectException: Connection refused; For more details see:  http://wiki.apache.org/hadoop/ConnectionRefused
	at sun.reflect.NativeConstructorAccessorImpl.newInstance0(Native Method)
	at sun.reflect.NativeConstructorAccessorImpl.newInstance(NativeConstructorAccessorImpl.java:39)
	at sun.reflect.DelegatingConstructorAccessorImpl.newInstance(DelegatingConstructorAccessorImpl.java:27)
	at java.lang.reflect.Constructor.newInstance(Constructor.java:513)
	at org.apache.hadoop.net.NetUtils.wrapWithMessage(NetUtils.java:780)
	at org.apache.hadoop.net.NetUtils.wrapException(NetUtils.java:727)
	at org.apache.hadoop.ipc.Client.call(Client.java:1305)
	at org.apache.hadoop.ipc.Client.call(Client.java:1253)
	at org.apache.hadoop.ipc.ProtobufRpcEngine$Invoker.invoke(ProtobufRpcEngine.java:204)
	... 23 more
Caused by: java.net.ConnectException: Connection refused
	at sun.nio.ch.SocketChannelImpl.checkConnect(Native Method)
	at sun.nio.ch.SocketChannelImpl.finishConnect(SocketChannelImpl.java:567)
	at org.apache.hadoop.net.SocketIOWithTimeout.connect(SocketIOWithTimeout.java:206)
	at org.apache.hadoop.net.NetUtils.connect(NetUtils.java:526)
	at org.apache.hadoop.net.NetUtils.connect(NetUtils.java:490)
	at org.apache.hadoop.ipc.Client$Connection.setupConnection(Client.java:511)
	at org.apache.hadoop.ipc.Client$Connection.setupIOstreams(Client.java:606)
	at org.apache.hadoop.ipc.Client$Connection.access$2100(Client.java:254)
	at org.apache.hadoop.ipc.Client.getConnection(Client.java:1354)
	at org.apache.hadoop.ipc.Client.call(Client.java:1272)
	... 25 more


FAILED:  org.apache.hadoop.mapreduce.v2.TestMROldApiJobs.testJobSucceed

Error Message:
null

Stack Trace:
java.lang.reflect.UndeclaredThrowableException
	at org.apache.hadoop.yarn.exceptions.impl.pb.YarnRemoteExceptionPBImpl.unwrapAndThrowException(YarnRemoteExceptionPBImpl.java:135)
	at org.apache.hadoop.yarn.api.impl.pb.client.ClientRMProtocolPBClientImpl.getNewApplication(ClientRMProtocolPBClientImpl.java:162)
	at org.apache.hadoop.yarn.client.YarnClientImpl.getNewApplication(YarnClientImpl.java:121)
	at org.apache.hadoop.mapred.ResourceMgrDelegate.getNewJobID(ResourceMgrDelegate.java:102)
	at org.apache.hadoop.mapred.YARNRunner.getNewJobID(YARNRunner.java:215)
	at org.apache.hadoop.mapreduce.JobSubmitter.submitJobInternal(JobSubmitter.java:352)
	at org.apache.hadoop.mapreduce.Job$11.run(Job.java:1218)
	at org.apache.hadoop.mapreduce.Job$11.run(Job.java:1215)
	at java.security.AccessController.doPrivileged(Native Method)
	at javax.security.auth.Subject.doAs(Subject.java:396)
	at org.apache.hadoop.security.UserGroupInformation.doAs(UserGroupInformation.java:1489)
	at org.apache.hadoop.mapreduce.Job.submit(Job.java:1215)
	at org.apache.hadoop.mapred.JobClient$1.run(JobClient.java:581)
	at org.apache.hadoop.mapred.JobClient$1.run(JobClient.java:576)
	at java.security.AccessController.doPrivileged(Native Method)
	at javax.security.auth.Subject.doAs(Subject.java:396)
	at org.apache.hadoop.security.UserGroupInformation.doAs(UserGroupInformation.java:1489)
	at org.apache.hadoop.mapred.JobClient.submitJob(JobClient.java:576)
	at org.apache.hadoop.mapreduce.v2.TestMROldApiJobs.runJob(TestMROldApiJobs.java:212)
	at org.apache.hadoop.mapreduce.v2.TestMROldApiJobs.runJobSucceed(TestMROldApiJobs.java:177)
	at org.apache.hadoop.mapreduce.v2.TestMROldApiJobs.testJobSucceed(TestMROldApiJobs.java:116)
	at sun.reflect.NativeMethodAccessorImpl.invoke0(Native Method)
	at sun.reflect.NativeMethodAccessorImpl.invoke(NativeMethodAccessorImpl.java:39)
	at sun.reflect.DelegatingMethodAccessorImpl.invoke(DelegatingMethodAccessorImpl.java:25)
	at java.lang.reflect.Method.invoke(Method.java:597)
	at org.junit.runners.model.FrameworkMethod$1.runReflectiveCall(FrameworkMethod.java:44)
	at org.junit.internal.runners.model.ReflectiveCallable.run(ReflectiveCallable.java:15)
	at org.junit.runners.model.FrameworkMethod.invokeExplosively(FrameworkMethod.java:41)
	at org.junit.internal.runners.statements.InvokeMethod.evaluate(InvokeMethod.java:20)
	at org.junit.runners.BlockJUnit4ClassRunner.runNotIgnored(BlockJUnit4ClassRunner.java:79)
	at org.junit.runners.BlockJUnit4ClassRunner.runChild(BlockJUnit4ClassRunner.java:71)
	at org.junit.runners.BlockJUnit4ClassRunner.runChild(BlockJUnit4ClassRunner.java:49)
	at org.junit.runners.ParentRunner$3.run(ParentRunner.java:193)
	at org.junit.runners.ParentRunner$1.schedule(ParentRunner.java:52)
	at org.junit.runners.ParentRunner.runChildren(ParentRunner.java:191)
	at org.junit.runners.ParentRunner.access$000(ParentRunner.java:42)
	at org.junit.runners.ParentRunner$2.evaluate(ParentRunner.java:184)
	at org.junit.internal.runners.statements.RunBefores.evaluate(RunBefores.java:28)
	at org.junit.internal.runners.statements.RunAfters.evaluate(RunAfters.java:31)
	at org.junit.runners.ParentRunner.run(ParentRunner.java:236)
	at org.apache.maven.surefire.junit4.JUnit4Provider.execute(JUnit4Provider.java:252)
	at org.apache.maven.surefire.junit4.JUnit4Provider.executeTestSet(JUnit4Provider.java:141)
	at org.apache.maven.surefire.junit4.JUnit4Provider.invoke(JUnit4Provider.java:112)
	at sun.reflect.NativeMethodAccessorImpl.invoke0(Native Method)
	at sun.reflect.NativeMethodAccessorImpl.invoke(NativeMethodAccessorImpl.java:39)
	at sun.reflect.DelegatingMethodAccessorImpl.invoke(DelegatingMethodAccessorImpl.java:25)
	at java.lang.reflect.Method.invoke(Method.java:597)
	at org.apache.maven.surefire.util.ReflectionUtils.invokeMethodWithArray(ReflectionUtils.java:189)
	at org.apache.maven.surefire.booter.ProviderFactory$ProviderProxy.invoke(ProviderFactory.java:165)
	at org.apache.maven.surefire.booter.ProviderFactory.invokeProvider(ProviderFactory.java:85)
	at org.apache.maven.surefire.booter.ForkedBooter.runSuitesInProcess(ForkedBooter.java:115)
	at org.apache.maven.surefire.booter.ForkedBooter.main(ForkedBooter.java:75)
Caused by: com.google.protobuf.ServiceException: java.net.ConnectException: Call From asf007.sp2.ygridcore.net/67.195.138.25 to 0.0.0.0:8032 failed on connection exception: java.net.ConnectException: Connection refused; For more details see:  http://wiki.apache.org/hadoop/ConnectionRefused
	at org.apache.hadoop.ipc.ProtobufRpcEngine$Invoker.invoke(ProtobufRpcEngine.java:214)
	at $Proxy77.getNewApplication(Unknown Source)
	at org.apache.hadoop.yarn.api.impl.pb.client.ClientRMProtocolPBClientImpl.getNewApplication(ClientRMProtocolPBClientImpl.java:159)
	... 50 more
Caused by: java.net.ConnectException: Call From asf007.sp2.ygridcore.net/67.195.138.25 to 0.0.0.0:8032 failed on connection exception: java.net.ConnectException: Connection refused; For more details see:  http://wiki.apache.org/hadoop/ConnectionRefused
	at sun.reflect.NativeConstructorAccessorImpl.newInstance0(Native Method)
	at sun.reflect.NativeConstructorAccessorImpl.newInstance(NativeConstructorAccessorImpl.java:39)
	at sun.reflect.DelegatingConstructorAccessorImpl.newInstance(DelegatingConstructorAccessorImpl.java:27)
	at java.lang.reflect.Constructor.newInstance(Constructor.java:513)
	at org.apache.hadoop.net.NetUtils.wrapWithMessage(NetUtils.java:780)
	at org.apache.hadoop.net.NetUtils.wrapException(NetUtils.java:727)
	at org.apache.hadoop.ipc.Client.call(Client.java:1305)
	at org.apache.hadoop.ipc.Client.call(Client.java:1253)
	at org.apache.hadoop.ipc.ProtobufRpcEngine$Invoker.invoke(ProtobufRpcEngine.java:204)
	... 52 more
Caused by: java.net.ConnectException: Connection refused
	at sun.nio.ch.SocketChannelImpl.checkConnect(Native Method)
	at sun.nio.ch.SocketChannelImpl.finishConnect(SocketChannelImpl.java:567)
	at org.apache.hadoop.net.SocketIOWithTimeout.connect(SocketIOWithTimeout.java:206)
	at org.apache.hadoop.net.NetUtils.connect(NetUtils.java:526)
	at org.apache.hadoop.net.NetUtils.connect(NetUtils.java:490)
	at org.apache.hadoop.ipc.Client$Connection.setupConnection(Client.java:511)
	at org.apache.hadoop.ipc.Client$Connection.setupIOstreams(Client.java:606)
	at org.apache.hadoop.ipc.Client$Connection.access$2100(Client.java:254)
	at org.apache.hadoop.ipc.Client.getConnection(Client.java:1354)
	at org.apache.hadoop.ipc.Client.call(Client.java:1272)
	... 54 more


FAILED:  org.apache.hadoop.mapreduce.v2.TestMROldApiJobs.testJobFail

Error Message:
null

Stack Trace:
java.lang.reflect.UndeclaredThrowableException
	at org.apache.hadoop.yarn.exceptions.impl.pb.YarnRemoteExceptionPBImpl.unwrapAndThrowException(YarnRemoteExceptionPBImpl.java:135)
	at org.apache.hadoop.yarn.api.impl.pb.client.ClientRMProtocolPBClientImpl.getNewApplication(ClientRMProtocolPBClientImpl.java:162)
	at org.apache.hadoop.yarn.client.YarnClientImpl.getNewApplication(YarnClientImpl.java:121)
	at org.apache.hadoop.mapred.ResourceMgrDelegate.getNewJobID(ResourceMgrDelegate.java:102)
	at org.apache.hadoop.mapred.YARNRunner.getNewJobID(YARNRunner.java:215)
	at org.apache.hadoop.mapreduce.JobSubmitter.submitJobInternal(JobSubmitter.java:352)
	at org.apache.hadoop.mapreduce.Job$11.run(Job.java:1218)
	at org.apache.hadoop.mapreduce.Job$11.run(Job.java:1215)
	at java.security.AccessController.doPrivileged(Native Method)
	at javax.security.auth.Subject.doAs(Subject.java:396)
	at org.apache.hadoop.security.UserGroupInformation.doAs(UserGroupInformation.java:1489)
	at org.apache.hadoop.mapreduce.Job.submit(Job.java:1215)
	at org.apache.hadoop.mapred.JobClient$1.run(JobClient.java:581)
	at org.apache.hadoop.mapred.JobClient$1.run(JobClient.java:576)
	at java.security.AccessController.doPrivileged(Native Method)
	at javax.security.auth.Subject.doAs(Subject.java:396)
	at org.apache.hadoop.security.UserGroupInformation.doAs(UserGroupInformation.java:1489)
	at org.apache.hadoop.mapred.JobClient.submitJob(JobClient.java:576)
	at org.apache.hadoop.mapreduce.v2.TestMROldApiJobs.runJob(TestMROldApiJobs.java:212)
	at org.apache.hadoop.mapreduce.v2.TestMROldApiJobs.runJobFail(TestMROldApiJobs.java:165)
	at org.apache.hadoop.mapreduce.v2.TestMROldApiJobs.testJobFail(TestMROldApiJobs.java:145)
	at sun.reflect.NativeMethodAccessorImpl.invoke0(Native Method)
	at sun.reflect.NativeMethodAccessorImpl.invoke(NativeMethodAccessorImpl.java:39)
	at sun.reflect.DelegatingMethodAccessorImpl.invoke(DelegatingMethodAccessorImpl.java:25)
	at java.lang.reflect.Method.invoke(Method.java:597)
	at org.junit.runners.model.FrameworkMethod$1.runReflectiveCall(FrameworkMethod.java:44)
	at org.junit.internal.runners.model.ReflectiveCallable.run(ReflectiveCallable.java:15)
	at org.junit.runners.model.FrameworkMethod.invokeExplosively(FrameworkMethod.java:41)
	at org.junit.internal.runners.statements.InvokeMethod.evaluate(InvokeMethod.java:20)
	at org.junit.runners.BlockJUnit4ClassRunner.runNotIgnored(BlockJUnit4ClassRunner.java:79)
	at org.junit.runners.BlockJUnit4ClassRunner.runChild(BlockJUnit4ClassRunner.java:71)
	at org.junit.runners.BlockJUnit4ClassRunner.runChild(BlockJUnit4ClassRunner.java:49)
	at org.junit.runners.ParentRunner$3.run(ParentRunner.java:193)
	at org.junit.runners.ParentRunner$1.schedule(ParentRunner.java:52)
	at org.junit.runners.ParentRunner.runChildren(ParentRunner.java:191)
	at org.junit.runners.ParentRunner.access$000(ParentRunner.java:42)
	at org.junit.runners.ParentRunner$2.evaluate(ParentRunner.java:184)
	at org.junit.internal.runners.statements.RunBefores.evaluate(RunBefores.java:28)
	at org.junit.internal.runners.statements.RunAfters.evaluate(RunAfters.java:31)
	at org.junit.runners.ParentRunner.run(ParentRunner.java:236)
	at org.apache.maven.surefire.junit4.JUnit4Provider.execute(JUnit4Provider.java:252)
	at org.apache.maven.surefire.junit4.JUnit4Provider.executeTestSet(JUnit4Provider.java:141)
	at org.apache.maven.surefire.junit4.JUnit4Provider.invoke(JUnit4Provider.java:112)
	at sun.reflect.NativeMethodAccessorImpl.invoke0(Native Method)
	at sun.reflect.NativeMethodAccessorImpl.invoke(NativeMethodAccessorImpl.java:39)
	at sun.reflect.DelegatingMethodAccessorImpl.invoke(DelegatingMethodAccessorImpl.java:25)
	at java.lang.reflect.Method.invoke(Method.java:597)
	at org.apache.maven.surefire.util.ReflectionUtils.invokeMethodWithArray(ReflectionUtils.java:189)
	at org.apache.maven.surefire.booter.ProviderFactory$ProviderProxy.invoke(ProviderFactory.java:165)
	at org.apache.maven.surefire.booter.ProviderFactory.invokeProvider(ProviderFactory.java:85)
	at org.apache.maven.surefire.booter.ForkedBooter.runSuitesInProcess(ForkedBooter.java:115)
	at org.apache.maven.surefire.booter.ForkedBooter.main(ForkedBooter.java:75)
Caused by: com.google.protobuf.ServiceException: java.net.ConnectException: Call From asf007.sp2.ygridcore.net/67.195.138.25 to 0.0.0.0:8032 failed on connection exception: java.net.ConnectException: Connection refused; For more details see:  http://wiki.apache.org/hadoop/ConnectionRefused
	at org.apache.hadoop.ipc.ProtobufRpcEngine$Invoker.invoke(ProtobufRpcEngine.java:214)
	at $Proxy77.getNewApplication(Unknown Source)
	at org.apache.hadoop.yarn.api.impl.pb.client.ClientRMProtocolPBClientImpl.getNewApplication(ClientRMProtocolPBClientImpl.java:159)
	... 50 more
Caused by: java.net.ConnectException: Call From asf007.sp2.ygridcore.net/67.195.138.25 to 0.0.0.0:8032 failed on connection exception: java.net.ConnectException: Connection refused; For more details see:  http://wiki.apache.org/hadoop/ConnectionRefused
	at sun.reflect.NativeConstructorAccessorImpl.newInstance0(Native Method)
	at sun.reflect.NativeConstructorAccessorImpl.newInstance(NativeConstructorAccessorImpl.java:39)
	at sun.reflect.DelegatingConstructorAccessorImpl.newInstance(DelegatingConstructorAccessorImpl.java:27)
	at java.lang.reflect.Constructor.newInstance(Constructor.java:513)
	at org.apache.hadoop.net.NetUtils.wrapWithMessage(NetUtils.java:780)
	at org.apache.hadoop.net.NetUtils.wrapException(NetUtils.java:727)
	at org.apache.hadoop.ipc.Client.call(Client.java:1305)
	at org.apache.hadoop.ipc.Client.call(Client.java:1253)
	at org.apache.hadoop.ipc.ProtobufRpcEngine$Invoker.invoke(ProtobufRpcEngine.java:204)
	... 52 more
Caused by: java.net.ConnectException: Connection refused
	at sun.nio.ch.SocketChannelImpl.checkConnect(Native Method)
	at sun.nio.ch.SocketChannelImpl.finishConnect(SocketChannelImpl.java:567)
	at org.apache.hadoop.net.SocketIOWithTimeout.connect(SocketIOWithTimeout.java:206)
	at org.apache.hadoop.net.NetUtils.connect(NetUtils.java:526)
	at org.apache.hadoop.net.NetUtils.connect(NetUtils.java:490)
	at org.apache.hadoop.ipc.Client$Connection.setupConnection(Client.java:511)
	at org.apache.hadoop.ipc.Client$Connection.setupIOstreams(Client.java:606)
	at org.apache.hadoop.ipc.Client$Connection.access$2100(Client.java:254)
	at org.apache.hadoop.ipc.Client.getConnection(Client.java:1354)
	at org.apache.hadoop.ipc.Client.call(Client.java:1272)
	... 54 more


FAILED:  org.apache.hadoop.mapreduce.v2.TestMiniMRProxyUser.testValidProxyUser

Error Message:
java.io.IOException: NodeManager 1 failed to start

Stack Trace:
org.apache.hadoop.yarn.YarnException: java.io.IOException: NodeManager 1 failed to start
	at org.apache.hadoop.yarn.server.MiniYARNCluster$NodeManagerWrapper.innerStart(MiniYARNCluster.java:325)
	at org.apache.hadoop.yarn.service.AbstractService.start(AbstractService.java:158)
	at org.apache.hadoop.yarn.service.CompositeService.innerStart(CompositeService.java:65)
	at org.apache.hadoop.yarn.service.AbstractService.start(AbstractService.java:158)
	at org.apache.hadoop.mapred.MiniMRClientClusterFactory.create(MiniMRClientClusterFactory.java:80)
	at org.apache.hadoop.mapred.MiniMRCluster.<init>(MiniMRCluster.java:183)
	at org.apache.hadoop.mapred.MiniMRCluster.<init>(MiniMRCluster.java:171)
	at org.apache.hadoop.mapred.MiniMRCluster.<init>(MiniMRCluster.java:163)
	at org.apache.hadoop.mapreduce.v2.TestMiniMRProxyUser.setUp(TestMiniMRProxyUser.java:85)
	at junit.framework.TestCase.runBare(TestCase.java:132)
	at junit.framework.TestResult$1.protect(TestResult.java:110)
	at junit.framework.TestResult.runProtected(TestResult.java:128)
	at junit.framework.TestResult.run(TestResult.java:113)
	at junit.framework.TestCase.run(TestCase.java:124)
	at junit.framework.TestSuite.runTest(TestSuite.java:243)
	at junit.framework.TestSuite.run(TestSuite.java:238)
	at org.junit.internal.runners.JUnit38ClassRunner.run(JUnit38ClassRunner.java:83)
	at org.apache.maven.surefire.junit4.JUnit4Provider.execute(JUnit4Provider.java:252)
	at org.apache.maven.surefire.junit4.JUnit4Provider.executeTestSet(JUnit4Provider.java:141)
	at org.apache.maven.surefire.junit4.JUnit4Provider.invoke(JUnit4Provider.java:112)
	at sun.reflect.NativeMethodAccessorImpl.invoke0(Native Method)
	at sun.reflect.NativeMethodAccessorImpl.invoke(NativeMethodAccessorImpl.java:39)
	at sun.reflect.DelegatingMethodAccessorImpl.invoke(DelegatingMethodAccessorImpl.java:25)
	at java.lang.reflect.Method.invoke(Method.java:597)
	at org.apache.maven.surefire.util.ReflectionUtils.invokeMethodWithArray(ReflectionUtils.java:189)
	at org.apache.maven.surefire.booter.ProviderFactory$ProviderProxy.invoke(ProviderFactory.java:165)
	at org.apache.maven.surefire.booter.ProviderFactory.invokeProvider(ProviderFactory.java:85)
	at org.apache.maven.surefire.booter.ForkedBooter.runSuitesInProcess(ForkedBooter.java:115)
	at org.apache.maven.surefire.booter.ForkedBooter.main(ForkedBooter.java:75)
Caused by: java.io.IOException: NodeManager 1 failed to start
	at org.apache.hadoop.yarn.server.MiniYARNCluster$NodeManagerWrapper.innerStart(MiniYARNCluster.java:321)
	... 28 more


FAILED:  org.apache.hadoop.mapreduce.v2.TestNonExistentJob.testGetInvalidJob

Error Message:
java.io.IOException: NodeManager 1 failed to start

Stack Trace:
org.apache.hadoop.yarn.YarnException: java.io.IOException: NodeManager 1 failed to start
	at org.apache.hadoop.yarn.server.MiniYARNCluster$NodeManagerWrapper.innerStart(MiniYARNCluster.java:325)
	at org.apache.hadoop.yarn.service.AbstractService.start(AbstractService.java:158)
	at org.apache.hadoop.yarn.service.CompositeService.innerStart(CompositeService.java:65)
	at org.apache.hadoop.yarn.service.AbstractService.start(AbstractService.java:158)
	at org.apache.hadoop.mapred.MiniMRClientClusterFactory.create(MiniMRClientClusterFactory.java:80)
	at org.apache.hadoop.mapred.MiniMRCluster.<init>(MiniMRCluster.java:183)
	at org.apache.hadoop.mapred.MiniMRCluster.<init>(MiniMRCluster.java:171)
	at org.apache.hadoop.mapred.MiniMRCluster.<init>(MiniMRCluster.java:163)
	at org.apache.hadoop.mapreduce.v2.TestNonExistentJob.setUp(TestNonExistentJob.java:79)
	at junit.framework.TestCase.runBare(TestCase.java:132)
	at junit.framework.TestResult$1.protect(TestResult.java:110)
	at junit.framework.TestResult.runProtected(TestResult.java:128)
	at junit.framework.TestResult.run(TestResult.java:113)
	at junit.framework.TestCase.run(TestCase.java:124)
	at junit.framework.TestSuite.runTest(TestSuite.java:243)
	at junit.framework.TestSuite.run(TestSuite.java:238)
	at org.junit.internal.runners.JUnit38ClassRunner.run(JUnit38ClassRunner.java:83)
	at org.apache.maven.surefire.junit4.JUnit4Provider.execute(JUnit4Provider.java:252)
	at org.apache.maven.surefire.junit4.JUnit4Provider.executeTestSet(JUnit4Provider.java:141)
	at org.apache.maven.surefire.junit4.JUnit4Provider.invoke(JUnit4Provider.java:112)
	at sun.reflect.NativeMethodAccessorImpl.invoke0(Native Method)
	at sun.reflect.NativeMethodAccessorImpl.invoke(NativeMethodAccessorImpl.java:39)
	at sun.reflect.DelegatingMethodAccessorImpl.invoke(DelegatingMethodAccessorImpl.java:25)
	at java.lang.reflect.Method.invoke(Method.java:597)
	at org.apache.maven.surefire.util.ReflectionUtils.invokeMethodWithArray(ReflectionUtils.java:189)
	at org.apache.maven.surefire.booter.ProviderFactory$ProviderProxy.invoke(ProviderFactory.java:165)
	at org.apache.maven.surefire.booter.ProviderFactory.invokeProvider(ProviderFactory.java:85)
	at org.apache.maven.surefire.booter.ForkedBooter.runSuitesInProcess(ForkedBooter.java:115)
	at org.apache.maven.surefire.booter.ForkedBooter.main(ForkedBooter.java:75)
Caused by: java.io.IOException: NodeManager 1 failed to start
	at org.apache.hadoop.yarn.server.MiniYARNCluster$NodeManagerWrapper.innerStart(MiniYARNCluster.java:321)
	... 28 more


FAILED:  org.apache.hadoop.mapreduce.v2.TestRMNMInfo.org.apache.hadoop.mapreduce.v2.TestRMNMInfo

Error Message:
java.io.IOException: NodeManager 1 failed to start

Stack Trace:
org.apache.hadoop.yarn.YarnException: java.io.IOException: NodeManager 1 failed to start
	at org.apache.hadoop.yarn.server.MiniYARNCluster$NodeManagerWrapper.innerStart(MiniYARNCluster.java:325)
	at org.apache.hadoop.yarn.service.AbstractService.start(AbstractService.java:158)
	at org.apache.hadoop.yarn.service.CompositeService.innerStart(CompositeService.java:65)
	at org.apache.hadoop.yarn.service.AbstractService.start(AbstractService.java:158)
	at org.apache.hadoop.mapreduce.v2.TestRMNMInfo.setup(TestRMNMInfo.java:80)
	at sun.reflect.NativeMethodAccessorImpl.invoke0(Native Method)
	at sun.reflect.NativeMethodAccessorImpl.invoke(NativeMethodAccessorImpl.java:39)
	at sun.reflect.DelegatingMethodAccessorImpl.invoke(DelegatingMethodAccessorImpl.java:25)
	at java.lang.reflect.Method.invoke(Method.java:597)
	at org.junit.runners.model.FrameworkMethod$1.runReflectiveCall(FrameworkMethod.java:44)
	at org.junit.internal.runners.model.ReflectiveCallable.run(ReflectiveCallable.java:15)
	at org.junit.runners.model.FrameworkMethod.invokeExplosively(FrameworkMethod.java:41)
	at org.junit.internal.runners.statements.RunBefores.evaluate(RunBefores.java:27)
	at org.junit.internal.runners.statements.RunAfters.evaluate(RunAfters.java:31)
	at org.junit.runners.ParentRunner.run(ParentRunner.java:236)
	at org.apache.maven.surefire.junit4.JUnit4Provider.execute(JUnit4Provider.java:252)
	at org.apache.maven.surefire.junit4.JUnit4Provider.executeTestSet(JUnit4Provider.java:141)
	at org.apache.maven.surefire.junit4.JUnit4Provider.invoke(JUnit4Provider.java:112)
	at sun.reflect.NativeMethodAccessorImpl.invoke0(Native Method)
	at sun.reflect.NativeMethodAccessorImpl.invoke(NativeMethodAccessorImpl.java:39)
	at sun.reflect.DelegatingMethodAccessorImpl.invoke(DelegatingMethodAccessorImpl.java:25)
	at java.lang.reflect.Method.invoke(Method.java:597)
	at org.apache.maven.surefire.util.ReflectionUtils.invokeMethodWithArray(ReflectionUtils.java:189)
	at org.apache.maven.surefire.booter.ProviderFactory$ProviderProxy.invoke(ProviderFactory.java:165)
	at org.apache.maven.surefire.booter.ProviderFactory.invokeProvider(ProviderFactory.java:85)
	at org.apache.maven.surefire.booter.ForkedBooter.runSuitesInProcess(ForkedBooter.java:115)
	at org.apache.maven.surefire.booter.ForkedBooter.main(ForkedBooter.java:75)
Caused by: java.io.IOException: NodeManager 1 failed to start
	at org.apache.hadoop.yarn.server.MiniYARNCluster$NodeManagerWrapper.innerStart(MiniYARNCluster.java:321)
	... 26 more


FAILED:  org.apache.hadoop.mapreduce.v2.TestSpeculativeExecution.org.apache.hadoop.mapreduce.v2.TestSpeculativeExecution

Error Message:
java.io.IOException: NodeManager 1 failed to start

Stack Trace:
org.apache.hadoop.yarn.YarnException: java.io.IOException: NodeManager 1 failed to start
	at org.apache.hadoop.yarn.server.MiniYARNCluster$NodeManagerWrapper.innerStart(MiniYARNCluster.java:325)
	at org.apache.hadoop.yarn.service.AbstractService.start(AbstractService.java:158)
	at org.apache.hadoop.yarn.service.CompositeService.innerStart(CompositeService.java:65)
	at org.apache.hadoop.yarn.service.AbstractService.start(AbstractService.java:158)
	at org.apache.hadoop.mapreduce.v2.TestSpeculativeExecution.setup(TestSpeculativeExecution.java:118)
	at sun.reflect.NativeMethodAccessorImpl.invoke0(Native Method)
	at sun.reflect.NativeMethodAccessorImpl.invoke(NativeMethodAccessorImpl.java:39)
	at sun.reflect.DelegatingMethodAccessorImpl.invoke(DelegatingMethodAccessorImpl.java:25)
	at java.lang.reflect.Method.invoke(Method.java:597)
	at org.junit.runners.model.FrameworkMethod$1.runReflectiveCall(FrameworkMethod.java:44)
	at org.junit.internal.runners.model.ReflectiveCallable.run(ReflectiveCallable.java:15)
	at org.junit.runners.model.FrameworkMethod.invokeExplosively(FrameworkMethod.java:41)
	at org.junit.internal.runners.statements.RunBefores.evaluate(RunBefores.java:27)
	at org.junit.internal.runners.statements.RunAfters.evaluate(RunAfters.java:31)
	at org.junit.runners.ParentRunner.run(ParentRunner.java:236)
	at org.apache.maven.surefire.junit4.JUnit4Provider.execute(JUnit4Provider.java:252)
	at org.apache.maven.surefire.junit4.JUnit4Provider.executeTestSet(JUnit4Provider.java:141)
	at org.apache.maven.surefire.junit4.JUnit4Provider.invoke(JUnit4Provider.java:112)
	at sun.reflect.NativeMethodAccessorImpl.invoke0(Native Method)
	at sun.reflect.NativeMethodAccessorImpl.invoke(NativeMethodAccessorImpl.java:39)
	at sun.reflect.DelegatingMethodAccessorImpl.invoke(DelegatingMethodAccessorImpl.java:25)
	at java.lang.reflect.Method.invoke(Method.java:597)
	at org.apache.maven.surefire.util.ReflectionUtils.invokeMethodWithArray(ReflectionUtils.java:189)
	at org.apache.maven.surefire.booter.ProviderFactory$ProviderProxy.invoke(ProviderFactory.java:165)
	at org.apache.maven.surefire.booter.ProviderFactory.invokeProvider(ProviderFactory.java:85)
	at org.apache.maven.surefire.booter.ForkedBooter.runSuitesInProcess(ForkedBooter.java:115)
	at org.apache.maven.surefire.booter.ForkedBooter.main(ForkedBooter.java:75)
Caused by: java.io.IOException: NodeManager 1 failed to start
	at org.apache.hadoop.yarn.server.MiniYARNCluster$NodeManagerWrapper.innerStart(MiniYARNCluster.java:321)
	... 26 more


FAILED:  org.apache.hadoop.mapreduce.v2.TestUberAM.org.apache.hadoop.mapreduce.v2.TestUberAM

Error Message:
java.io.IOException: NodeManager 1 failed to start

Stack Trace:
org.apache.hadoop.yarn.YarnException: java.io.IOException: NodeManager 1 failed to start
	at org.apache.hadoop.yarn.server.MiniYARNCluster$NodeManagerWrapper.innerStart(MiniYARNCluster.java:325)
	at org.apache.hadoop.yarn.service.AbstractService.start(AbstractService.java:158)
	at org.apache.hadoop.yarn.service.CompositeService.innerStart(CompositeService.java:65)
	at org.apache.hadoop.yarn.service.AbstractService.start(AbstractService.java:158)
	at org.apache.hadoop.mapreduce.v2.TestMRJobs.setup(TestMRJobs.java:126)
	at org.apache.hadoop.mapreduce.v2.TestUberAM.setup(TestUberAM.java:45)
	at sun.reflect.NativeMethodAccessorImpl.invoke0(Native Method)
	at sun.reflect.NativeMethodAccessorImpl.invoke(NativeMethodAccessorImpl.java:39)
	at sun.reflect.DelegatingMethodAccessorImpl.invoke(DelegatingMethodAccessorImpl.java:25)
	at java.lang.reflect.Method.invoke(Method.java:597)
	at org.junit.runners.model.FrameworkMethod$1.runReflectiveCall(FrameworkMethod.java:44)
	at org.junit.internal.runners.model.ReflectiveCallable.run(ReflectiveCallable.java:15)
	at org.junit.runners.model.FrameworkMethod.invokeExplosively(FrameworkMethod.java:41)
	at org.junit.internal.runners.statements.RunBefores.evaluate(RunBefores.java:27)
	at org.junit.internal.runners.statements.RunAfters.evaluate(RunAfters.java:31)
	at org.junit.runners.ParentRunner.run(ParentRunner.java:236)
	at org.apache.maven.surefire.junit4.JUnit4Provider.execute(JUnit4Provider.java:252)
	at org.apache.maven.surefire.junit4.JUnit4Provider.executeTestSet(JUnit4Provider.java:141)
	at org.apache.maven.surefire.junit4.JUnit4Provider.invoke(JUnit4Provider.java:112)
	at sun.reflect.NativeMethodAccessorImpl.invoke0(Native Method)
	at sun.reflect.NativeMethodAccessorImpl.invoke(NativeMethodAccessorImpl.java:39)
	at sun.reflect.DelegatingMethodAccessorImpl.invoke(DelegatingMethodAccessorImpl.java:25)
	at java.lang.reflect.Method.invoke(Method.java:597)
	at org.apache.maven.surefire.util.ReflectionUtils.invokeMethodWithArray(ReflectionUtils.java:189)
	at org.apache.maven.surefire.booter.ProviderFactory$ProviderProxy.invoke(ProviderFactory.java:165)
	at org.apache.maven.surefire.booter.ProviderFactory.invokeProvider(ProviderFactory.java:85)
	at org.apache.maven.surefire.booter.ForkedBooter.runSuitesInProcess(ForkedBooter.java:115)
	at org.apache.maven.surefire.booter.ForkedBooter.main(ForkedBooter.java:75)
Caused by: java.io.IOException: NodeManager 1 failed to start
	at org.apache.hadoop.yarn.server.MiniYARNCluster$NodeManagerWrapper.innerStart(MiniYARNCluster.java:321)
	... 27 more


FAILED:  org.apache.hadoop.yarn.applications.unmanagedamlauncher.TestUnmanagedAMLauncher.org.apache.hadoop.yarn.applications.unmanagedamlauncher.TestUnmanagedAMLauncher

Error Message:
Error parsing 'yarn-site.xml' : org.xml.sax.SAXParseException: Premature end of file.

Stack Trace:
java.lang.RuntimeException: Error parsing 'yarn-site.xml' : org.xml.sax.SAXParseException: Premature end of file.
	at org.apache.hadoop.conf.Configuration.loadResource(Configuration.java:2050)
	at org.apache.hadoop.conf.Configuration.loadResources(Configuration.java:1899)
	at org.apache.hadoop.conf.Configuration.getProps(Configuration.java:1816)
	at org.apache.hadoop.conf.Configuration.handleDeprecation(Configuration.java:465)
	at org.apache.hadoop.conf.Configuration.asXmlDocument(Configuration.java:2127)
	at org.apache.hadoop.conf.Configuration.writeXml(Configuration.java:2096)
	at org.apache.hadoop.conf.Configuration.writeXml(Configuration.java:2086)
	at org.apache.hadoop.yarn.applications.unmanagedamlauncher.TestUnmanagedAMLauncher.setup(TestUnmanagedAMLauncher.java:63)
	at sun.reflect.NativeMethodAccessorImpl.invoke0(Native Method)
	at sun.reflect.NativeMethodAccessorImpl.invoke(NativeMethodAccessorImpl.java:39)
	at sun.reflect.DelegatingMethodAccessorImpl.invoke(DelegatingMethodAccessorImpl.java:25)
	at java.lang.reflect.Method.invoke(Method.java:597)
	at org.junit.runners.model.FrameworkMethod$1.runReflectiveCall(FrameworkMethod.java:44)
	at org.junit.internal.runners.model.ReflectiveCallable.run(ReflectiveCallable.java:15)
	at org.junit.runners.model.FrameworkMethod.invokeExplosively(FrameworkMethod.java:41)
	at org.junit.internal.runners.statements.RunBefores.evaluate(RunBefores.java:27)
	at org.junit.internal.runners.statements.RunAfters.evaluate(RunAfters.java:31)
	at org.junit.runners.ParentRunner.run(ParentRunner.java:236)
	at org.apache.maven.surefire.junit4.JUnit4Provider.execute(JUnit4Provider.java:252)
	at org.apache.maven.surefire.junit4.JUnit4Provider.executeTestSet(JUnit4Provider.java:141)
	at org.apache.maven.surefire.junit4.JUnit4Provider.invoke(JUnit4Provider.java:112)
	at sun.reflect.NativeMethodAccessorImpl.invoke0(Native Method)
	at sun.reflect.NativeMethodAccessorImpl.invoke(NativeMethodAccessorImpl.java:39)
	at sun.reflect.DelegatingMethodAccessorImpl.invoke(DelegatingMethodAccessorImpl.java:25)
	at java.lang.reflect.Method.invoke(Method.java:597)
	at org.apache.maven.surefire.util.ReflectionUtils.invokeMethodWithArray(ReflectionUtils.java:189)
	at org.apache.maven.surefire.booter.ProviderFactory$ProviderProxy.invoke(ProviderFactory.java:165)
	at org.apache.maven.surefire.booter.ProviderFactory.invokeProvider(ProviderFactory.java:85)
	at org.apache.maven.surefire.booter.ForkedBooter.runSuitesInProcess(ForkedBooter.java:115)
	at org.apache.maven.surefire.booter.ForkedBooter.main(ForkedBooter.java:75)
Caused by: org.xml.sax.SAXParseException: Premature end of file.
	at com.sun.org.apache.xerces.internal.parsers.DOMParser.parse(DOMParser.java:249)
	at com.sun.org.apache.xerces.internal.jaxp.DocumentBuilderImpl.parse(DocumentBuilderImpl.java:284)
	at javax.xml.parsers.DocumentBuilder.parse(DocumentBuilder.java:153)
	at org.apache.hadoop.conf.Configuration.parse(Configuration.java:1887)
	at org.apache.hadoop.conf.Configuration.parse(Configuration.java:1875)
	at org.apache.hadoop.conf.Configuration.loadResource(Configuration.java:1946)
	... 29 more


FAILED:  org.apache.hadoop.yarn.server.resourcemanager.resourcetracker.TestNMExpiry.testNMExpiry

Error Message:
expected:<2> but was:<0>

Stack Trace:
junit.framework.AssertionFailedError: expected:<2> but was:<0>
	at junit.framework.Assert.fail(Assert.java:47)
	at junit.framework.Assert.failNotEquals(Assert.java:283)
	at junit.framework.Assert.assertEquals(Assert.java:64)
	at junit.framework.Assert.assertEquals(Assert.java:195)
	at junit.framework.Assert.assertEquals(Assert.java:201)
	at org.apache.hadoop.yarn.server.resourcemanager.resourcetracker.TestNMExpiry.testNMExpiry(TestNMExpiry.java:157)
	at sun.reflect.NativeMethodAccessorImpl.invoke0(Native Method)
	at sun.reflect.NativeMethodAccessorImpl.invoke(NativeMethodAccessorImpl.java:39)
	at sun.reflect.DelegatingMethodAccessorImpl.invoke(DelegatingMethodAccessorImpl.java:25)
	at java.lang.reflect.Method.invoke(Method.java:597)
	at org.junit.runners.model.FrameworkMethod$1.runReflectiveCall(FrameworkMethod.java:44)
	at org.junit.internal.runners.model.ReflectiveCallable.run(ReflectiveCallable.java:15)
	at org.junit.runners.model.FrameworkMethod.invokeExplosively(FrameworkMethod.java:41)
	at org.junit.internal.runners.statements.InvokeMethod.evaluate(InvokeMethod.java:20)
	at org.junit.internal.runners.statements.RunBefores.evaluate(RunBefores.java:28)
	at org.junit.runners.BlockJUnit4ClassRunner.runNotIgnored(BlockJUnit4ClassRunner.java:79)
	at org.junit.runners.BlockJUnit4ClassRunner.runChild(BlockJUnit4ClassRunner.java:71)
	at org.junit.runners.BlockJUnit4ClassRunner.runChild(BlockJUnit4ClassRunner.java:49)
	at org.junit.runners.ParentRunner$3.run(ParentRunner.java:193)
	at org.junit.runners.ParentRunner$1.schedule(ParentRunner.java:52)
	at org.junit.runners.ParentRunner.runChildren(ParentRunner.java:191)
	at org.junit.runners.ParentRunner.access$000(ParentRunner.java:42)
	at org.junit.runners.ParentRunner$2.evaluate(ParentRunner.java:184)
	at org.junit.runners.ParentRunner.run(ParentRunner.java:236)
	at org.apache.maven.surefire.junit4.JUnit4Provider.execute(JUnit4Provider.java:252)
	at org.apache.maven.surefire.junit4.JUnit4Provider.executeTestSet(JUnit4Provider.java:141)
	at org.apache.maven.surefire.junit4.JUnit4Provider.invoke(JUnit4Provider.java:112)
	at sun.reflect.NativeMethodAccessorImpl.invoke0(Native Method)
	at sun.reflect.NativeMethodAccessorImpl.invoke(NativeMethodAccessorImpl.java:39)
	at sun.reflect.DelegatingMethodAccessorImpl.invoke(DelegatingMethodAccessorImpl.java:25)
	at java.lang.reflect.Method.invoke(Method.java:597)
	at org.apache.maven.surefire.util.ReflectionUtils.invokeMethodWithArray(ReflectionUtils.java:189)
	at org.apache.maven.surefire.booter.ProviderFactory$ProviderProxy.invoke(ProviderFactory.java:165)
	at org.apache.maven.surefire.booter.ProviderFactory.invokeProvider(ProviderFactory.java:85)
	at org.apache.maven.surefire.booter.ForkedBooter.runSuitesInProcess(ForkedBooter.java:115)
	at org.apache.maven.surefire.booter.ForkedBooter.main(ForkedBooter.java:75)



Mime
  • Unnamed multipart/mixed (inline, None, 0 bytes)
View raw message