hadoop-yarn-dev mailing list archives

Site index · List index
Message view « Date » · « Thread »
Top « Date » · « Thread »
From Apache Jenkins Server <jenk...@builds.apache.org>
Subject Success: YARN-557 PreCommit Build #686
Date Tue, 09 Apr 2013 01:54:55 GMT
Jira: https://issues.apache.org/jira/browse/YARN-557
Build: https://builds.apache.org/job/PreCommit-YARN-Build/686/

###################################################################################
########################## LAST 60 LINES OF THE CONSOLE ###########################
[...truncated 2727 lines...]
    Adding comment to Jira.
======================================================================
======================================================================


Comment added.
be31cf0d694eac86def1dcb464672137d83a0fd7 logged out


======================================================================
======================================================================
    Finished build.
======================================================================
======================================================================


Archiving artifacts
Description set: YARN-557
Recording test results
ln builds/2013-04-08_23-11-46 /home/hudson/hudson/jobs/PreCommit-YARN-Build/builds/../lastSuccessful
failed
java.nio.file.FileAlreadyExistsException: /home/hudson/hudson/jobs/PreCommit-YARN-Build/builds/../lastSuccessful
	at sun.nio.fs.UnixException.translateToIOException(UnixException.java:88)
	at sun.nio.fs.UnixException.rethrowAsIOException(UnixException.java:102)
	at sun.nio.fs.UnixException.rethrowAsIOException(UnixException.java:107)
	at sun.nio.fs.UnixFileSystemProvider.createSymbolicLink(UnixFileSystemProvider.java:455)
	at java.nio.file.Files.createSymbolicLink(Files.java:994)
	at sun.reflect.GeneratedMethodAccessor3453.invoke(Unknown Source)
	at sun.reflect.DelegatingMethodAccessorImpl.invoke(DelegatingMethodAccessorImpl.java:43)
	at java.lang.reflect.Method.invoke(Method.java:601)
	at hudson.Util.createSymlinkJava7(Util.java:1065)
	at hudson.Util.createSymlink(Util.java:1009)
	at hudson.model.AbstractBuild.createSymlink(AbstractBuild.java:500)
	at hudson.model.AbstractBuild.access$700(AbstractBuild.java:100)
	at hudson.model.AbstractBuild$AbstractBuildExecution.post(AbstractBuild.java:735)
	at hudson.model.Run.execute(Run.java:1593)
	at hudson.model.FreeStyleBuild.run(FreeStyleBuild.java:46)
	at hudson.model.ResourceController.execute(ResourceController.java:88)
	at hudson.model.Executor.run(Executor.java:236)
ln builds/2013-04-08_23-11-46 /home/hudson/hudson/jobs/PreCommit-YARN-Build/builds/../lastStable
failed
java.nio.file.FileAlreadyExistsException: /home/hudson/hudson/jobs/PreCommit-YARN-Build/builds/../lastStable
	at sun.nio.fs.UnixException.translateToIOException(UnixException.java:88)
	at sun.nio.fs.UnixException.rethrowAsIOException(UnixException.java:102)
	at sun.nio.fs.UnixException.rethrowAsIOException(UnixException.java:107)
	at sun.nio.fs.UnixFileSystemProvider.createSymbolicLink(UnixFileSystemProvider.java:455)
	at java.nio.file.Files.createSymbolicLink(Files.java:994)
	at sun.reflect.GeneratedMethodAccessor3453.invoke(Unknown Source)
	at sun.reflect.DelegatingMethodAccessorImpl.invoke(DelegatingMethodAccessorImpl.java:43)
	at java.lang.reflect.Method.invoke(Method.java:601)
	at hudson.Util.createSymlinkJava7(Util.java:1065)
	at hudson.Util.createSymlink(Util.java:1009)
	at hudson.model.AbstractBuild.createSymlink(AbstractBuild.java:500)
	at hudson.model.AbstractBuild.access$700(AbstractBuild.java:100)
	at hudson.model.AbstractBuild$AbstractBuildExecution.post(AbstractBuild.java:738)
	at hudson.model.Run.execute(Run.java:1593)
	at hudson.model.FreeStyleBuild.run(FreeStyleBuild.java:46)
	at hudson.model.ResourceController.execute(ResourceController.java:88)
	at hudson.model.Executor.run(Executor.java:236)
Email was triggered for: Success
Sending email for trigger: Success



###################################################################################
############################## FAILED TESTS (if any) ##############################
All tests passed
Mime
  • Unnamed multipart/mixed (inline, None, 0 bytes)
View raw message