hadoop-yarn-dev mailing list archives

Site index · List index
Message view « Date » · « Thread »
Top « Date » · « Thread »
From Apache Jenkins Server <jenk...@builds.apache.org>
Subject Hadoop-Yarn-trunk - Build # 169 - Failure
Date Fri, 29 Mar 2013 10:40:11 GMT
See https://builds.apache.org/job/Hadoop-Yarn-trunk/169/

###################################################################################
########################## LAST 60 LINES OF THE CONSOLE ###########################
[...truncated 11757 lines...]
[INFO] ------------------------------------------------------------------------
[INFO] Reactor Summary:
[INFO] 
[INFO] hadoop-yarn ....................................... SUCCESS [2.879s]
[INFO] hadoop-yarn-api ................................... SUCCESS [1:39.793s]
[INFO] hadoop-yarn-common ................................ SUCCESS [1:51.860s]
[INFO] hadoop-yarn-server ................................ SUCCESS [0.154s]
[INFO] hadoop-yarn-server-common ......................... SUCCESS [22.590s]
[INFO] hadoop-yarn-server-nodemanager .................... FAILURE [2:43.380s]
[INFO] hadoop-yarn-server-web-proxy ...................... SKIPPED
[INFO] hadoop-yarn-server-resourcemanager ................ SKIPPED
[INFO] hadoop-yarn-server-tests .......................... SKIPPED
[INFO] hadoop-yarn-client ................................ SKIPPED
[INFO] hadoop-yarn-applications .......................... SKIPPED
[INFO] hadoop-yarn-applications-distributedshell ......... SKIPPED
[INFO] hadoop-yarn-applications-unmanaged-am-launcher .... SKIPPED
[INFO] hadoop-yarn-site .................................. SKIPPED
[INFO] hadoop-yarn-project ............................... SKIPPED
[INFO] ------------------------------------------------------------------------
[INFO] BUILD FAILURE
[INFO] ------------------------------------------------------------------------
[INFO] Total time: 6:42.257s
[INFO] Finished at: Fri Mar 29 10:39:55 UTC 2013
[INFO] Final Memory: 44M/776M
[INFO] ------------------------------------------------------------------------
[ERROR] Failed to execute goal org.apache.maven.plugins:maven-surefire-plugin:2.12.3:test
(default-test) on project hadoop-yarn-server-nodemanager: There are test failures.
[ERROR] 
[ERROR] Please refer to /home/jenkins/jenkins-slave/workspace/Hadoop-Yarn-trunk/trunk/hadoop-yarn-project/hadoop-yarn/hadoop-yarn-server/hadoop-yarn-server-nodemanager/target/surefire-reports
for the individual test results.
[ERROR] -> [Help 1]
[ERROR] 
[ERROR] To see the full stack trace of the errors, re-run Maven with the -e switch.
[ERROR] Re-run Maven using the -X switch to enable full debug logging.
[ERROR] 
[ERROR] For more information about the errors and possible solutions, please read the following
articles:
[ERROR] [Help 1] http://cwiki.apache.org/confluence/display/MAVEN/MojoFailureException
[ERROR] 
[ERROR] After correcting the problems, you can resume the build with the command
[ERROR]   mvn <goals> -rf :hadoop-yarn-server-nodemanager
Build step 'Execute shell' marked build as failure
Archiving artifacts
Updating HADOOP-8415
Updating MAPREDUCE-4994
Updating HADOOP-9357
Updating HADOOP-9358
Updating YARN-209
Updating YARN-450
Updating HDFS-4581
Updating MAPREDUCE-5006
Updating YARN-496
Updating HADOOP-9150
Updating HDFS-4618
Updating HADOOP-9125
Updating YARN-24
Updating HADOOP-9444
Updating HDFS-4621
Updating HDFS-4633
Sending e-mails to: yarn-dev@hadoop.apache.org
Email was triggered for: Failure
Sending email for trigger: Failure



###################################################################################
############################## FAILED TESTS (if any) ##############################
No tests ran.
Mime
  • Unnamed multipart/mixed (inline, None, 0 bytes)
View raw message