hadoop-yarn-dev mailing list archives

Site index · List index
Message view « Date » · « Thread »
Top « Date » · « Thread »
From Apache Jenkins Server <jenk...@builds.apache.org>
Subject Hadoop-Yarn-trunk - Build # 119 - Still Failing
Date Wed, 06 Feb 2013 10:40:01 GMT
See https://builds.apache.org/job/Hadoop-Yarn-trunk/119/

###################################################################################
########################## LAST 60 LINES OF THE CONSOLE ###########################
[...truncated 11844 lines...]
Running org.apache.hadoop.yarn.server.nodemanager.webapp.TestNMWebServer
Tests run: 3, Failures: 0, Errors: 0, Skipped: 0, Time elapsed: 2.775 sec
Running org.apache.hadoop.yarn.server.nodemanager.webapp.TestNMWebServicesContainers
Tests run: 12, Failures: 0, Errors: 0, Skipped: 0, Time elapsed: 5.843 sec

Results :

Failed tests:   testContainerKillOnMemoryOverflow(org.apache.hadoop.yarn.server.nodemanager.containermanager.monitor.TestContainersMonitor):
Expected message pattern is: Container \[pid=22914,containerID=container_0_0000_01_000000\]
is running beyond virtual memory limits. Current usage: [0-9.]+m?b of [0-9.]+m?b physical
memory used; [0-9.]+m?b of [0-9.]+m?b virtual memory used. Killing container.(..)

Tests run: 151, Failures: 1, Errors: 0, Skipped: 0

[INFO] ------------------------------------------------------------------------
[INFO] Reactor Summary:
[INFO] 
[INFO] hadoop-yarn ....................................... SUCCESS [2.896s]
[INFO] hadoop-yarn-api ................................... SUCCESS [1:39.433s]
[INFO] hadoop-yarn-common ................................ SUCCESS [1:48.812s]
[INFO] hadoop-yarn-server ................................ SUCCESS [0.110s]
[INFO] hadoop-yarn-server-common ......................... SUCCESS [23.446s]
[INFO] hadoop-yarn-server-nodemanager .................... FAILURE [2:30.622s]
[INFO] hadoop-yarn-server-web-proxy ...................... SKIPPED
[INFO] hadoop-yarn-server-resourcemanager ................ SKIPPED
[INFO] hadoop-yarn-server-tests .......................... SKIPPED
[INFO] hadoop-yarn-client ................................ SKIPPED
[INFO] hadoop-yarn-applications .......................... SKIPPED
[INFO] hadoop-yarn-applications-distributedshell ......... SKIPPED
[INFO] hadoop-yarn-applications-unmanaged-am-launcher .... SKIPPED
[INFO] hadoop-yarn-site .................................. SKIPPED
[INFO] hadoop-yarn-project ............................... SKIPPED
[INFO] ------------------------------------------------------------------------
[INFO] BUILD FAILURE
[INFO] ------------------------------------------------------------------------
[INFO] Total time: 6:26.591s
[INFO] Finished at: Wed Feb 06 10:39:54 UTC 2013
[INFO] Final Memory: 47M/758M
[INFO] ------------------------------------------------------------------------
[ERROR] Failed to execute goal org.apache.maven.plugins:maven-surefire-plugin:2.12.3:test
(default-test) on project hadoop-yarn-server-nodemanager: There are test failures.
[ERROR] 
[ERROR] Please refer to /home/jenkins/jenkins-slave/workspace/Hadoop-Yarn-trunk/trunk/hadoop-yarn-project/hadoop-yarn/hadoop-yarn-server/hadoop-yarn-server-nodemanager/target/surefire-reports
for the individual test results.
[ERROR] -> [Help 1]
[ERROR] 
[ERROR] To see the full stack trace of the errors, re-run Maven with the -e switch.
[ERROR] Re-run Maven using the -X switch to enable full debug logging.
[ERROR] 
[ERROR] For more information about the errors and possible solutions, please read the following
articles:
[ERROR] [Help 1] http://cwiki.apache.org/confluence/display/MAVEN/MojoFailureException
[ERROR] 
[ERROR] After correcting the problems, you can resume the build with the command
[ERROR]   mvn <goals> -rf :hadoop-yarn-server-nodemanager
Build step 'Execute shell' marked build as failure
Archiving artifacts
Updating HADOOP-9260
Updating HADOOP-9252
Updating YARN-370
Updating HADOOP-9278
Updating HDFS-4468
Sending e-mails to: yarn-dev@hadoop.apache.org
Email was triggered for: Failure
Sending email for trigger: Failure



###################################################################################
############################## FAILED TESTS (if any) ##############################
No tests ran.
Mime
  • Unnamed multipart/mixed (inline, None, 0 bytes)
View raw message