hadoop-yarn-dev mailing list archives

Site index · List index
Message view « Date » · « Thread »
Top « Date » · « Thread »
From Apache Jenkins Server <jenk...@builds.apache.org>
Subject Build failed in Jenkins: Hadoop-Yarn-trunk #87
Date Sat, 05 Jan 2013 10:32:45 GMT
See <https://builds.apache.org/job/Hadoop-Yarn-trunk/87/changes>

Changes:

[bobby] MAPREDUCE-4819. AM can rerun job after reporting final job status to the client (bobby
and Bikas Saha via bobby)

[tgraves] MAPREDUCE-4894. Renewal / cancellation of JobHistory tokens (Siddharth Seth via
tgraves

[tgraves] YARN-50. Implement renewal / cancellation of Delegation Tokens(Siddharth Seth via
tgraves)

[jlowe] MAPREDUCE-4832. MR AM can get in a split brain situation. Contributed by Jason Lowe

[suresh] HADOOP-9173. Add security token protobuf definition to common and use it in hdfs.
Contributed by Suresh Srinivas.

[suresh] HADOOP-9173. Add security token protobuf definition to common and use it in hdfs.
Contributed by Suresh Srinivas.

[tomwhite] YARN-286. Add a YARN ApplicationClassLoader.

------------------------------------------
[...truncated 20977 lines...]
34 KB   2324 KB   32 KB   
34 KB   2328 KB   32 KB   
34 KB   2332 KB   32 KB   
34 KB   2336 KB   32 KB   
34 KB   2340 KB   32 KB   
34 KB   2344 KB   32 KB   
34 KB   2348 KB   32 KB   
34 KB   2352 KB   32 KB   
34 KB   2356 KB   32 KB   
34 KB   2360 KB   32 KB   
34 KB   2364 KB   32 KB   
34 KB   2368 KB   32 KB   
34 KB   2372 KB   32 KB   
34 KB   2376 KB   32 KB   
34 KB   2380 KB   32 KB   
34 KB   2384 KB   32 KB   
34 KB   2388 KB   32 KB   
34 KB   2392 KB   32 KB   
34 KB   2394 KB   32 KB   
                          
Downloaded: http://repo1.maven.org/maven2/asm/asm-util/3.1/asm-util-3.1.jar (34 KB at 909.1
KB/sec)
Downloading: http://repo1.maven.org/maven2/asm/asm-xml/3.1/asm-xml-3.1.jar
                          
Downloaded: http://repo1.maven.org/maven2/com/ibm/icu/icu4j/2.6.1/icu4j-2.6.1.jar (2394 KB
at 21957.0 KB/sec)
Downloading: http://repo1.maven.org/maven2/jgoodies/plastic/1.2.0/plastic-1.2.0.jar
4 KB   32 KB              
8 KB   32 KB   
12 KB   32 KB   
16 KB   32 KB   
20 KB   32 KB   
24 KB   32 KB   
28 KB   32 KB   
32 KB   32 KB   
36 KB   32 KB   
40 KB   32 KB   
44 KB   32 KB   
48 KB   32 KB   
52 KB   32 KB   
52 KB   4 KB   32 KB   
56 KB   4 KB   32 KB   
60 KB   4 KB   32 KB   
60 KB   8 KB   32 KB   
64 KB   8 KB   32 KB   
64 KB   12 KB   32 KB   
68 KB   12 KB   32 KB   
68 KB   16 KB   32 KB   
72 KB   16 KB   32 KB   
72 KB   18 KB   32 KB   
76 KB   18 KB   32 KB   
80 KB   18 KB   32 KB   
84 KB   18 KB   32 KB   
88 KB   18 KB   32 KB   
92 KB   18 KB   32 KB   
96 KB   18 KB   32 KB   
100 KB   18 KB   32 KB   
104 KB   18 KB   32 KB   
108 KB   18 KB   32 KB   
112 KB   18 KB   32 KB   
116 KB   18 KB   32 KB   
120 KB   18 KB   32 KB   
124 KB   18 KB   32 KB   
128 KB   18 KB   32 KB   
132 KB   18 KB   32 KB   
136 KB   18 KB   32 KB   
140 KB   18 KB   32 KB   
144 KB   18 KB   32 KB   
148 KB   18 KB   32 KB   
152 KB   18 KB   32 KB   
156 KB   18 KB   32 KB   
160 KB   18 KB   32 KB   
164 KB   18 KB   32 KB   
168 KB   18 KB   32 KB   
172 KB   18 KB   32 KB   
176 KB   18 KB   32 KB   
180 KB   18 KB   32 KB   
184 KB   18 KB   32 KB   
188 KB   18 KB   32 KB   
192 KB   18 KB   32 KB   
196 KB   18 KB   32 KB   
200 KB   18 KB   32 KB   
204 KB   18 KB   32 KB   
208 KB   18 KB   32 KB   
212 KB   18 KB   32 KB   
216 KB   18 KB   32 KB   
220 KB   18 KB   32 KB   
224 KB   18 KB   32 KB   
228 KB   18 KB   32 KB   
228 KB   18 KB   32 KB   4 KB   
228 KB   18 KB   32 KB   8 KB   
228 KB   18 KB   32 KB   12 KB   
228 KB   18 KB   32 KB   16 KB   
228 KB   18 KB   32 KB   20 KB   
228 KB   18 KB   32 KB   22 KB   
                                 
Downloaded: http://repo1.maven.org/maven2/jgoodies/plastic/1.2.0/plastic-1.2.0.jar (228 KB
at 22708.5 KB/sec)
Downloading: http://repo1.maven.org/maven2/org/codehaus/plexus/plexus-resources/1.0-alpha-4/plexus-resources-1.0-alpha-4.jar
18 KB   32 KB   22 KB   4 KB     
18 KB   32 KB   22 KB   8 KB   
18 KB   32 KB   22 KB   12 KB   
18 KB   32 KB   22 KB   16 KB   
18 KB   32 KB   22 KB   17 KB   
                                
Downloaded: http://repo1.maven.org/maven2/asm/asm-analysis/3.1/asm-analysis-3.1.jar (18 KB
at 161.7 KB/sec)
Downloading: http://repo1.maven.org/maven2/org/codehaus/plexus/plexus-utils/1.5.1/plexus-utils-1.5.1.jar
                                
Downloaded: http://repo1.maven.org/maven2/org/codehaus/plexus/plexus-resources/1.0-alpha-4/plexus-resources-1.0-alpha-4.jar
(17 KB at 2710.0 KB/sec)
4 KB   32 KB   22 KB            
8 KB   32 KB   22 KB   
12 KB   32 KB   22 KB   
16 KB   32 KB   22 KB   
20 KB   32 KB   22 KB   
24 KB   32 KB   22 KB   
28 KB   32 KB   22 KB   
32 KB   32 KB   22 KB   
36 KB   32 KB   22 KB   
40 KB   32 KB   22 KB   
44 KB   32 KB   22 KB   
48 KB   32 KB   22 KB   
51 KB   32 KB   22 KB   
51 KB   4 KB   32 KB   22 KB   
51 KB   8 KB   32 KB   22 KB   
51 KB   12 KB   32 KB   22 KB   
51 KB   16 KB   32 KB   22 KB   
51 KB   20 KB   32 KB   22 KB   
51 KB   24 KB   32 KB   22 KB   
51 KB   28 KB   32 KB   22 KB   
51 KB   32 KB   32 KB   22 KB   
51 KB   36 KB   32 KB   22 KB   
51 KB   40 KB   32 KB   22 KB   
51 KB   44 KB   32 KB   22 KB   
51 KB   48 KB   32 KB   22 KB   
51 KB   52 KB   32 KB   22 KB   
51 KB   56 KB   32 KB   22 KB   
51 KB   60 KB   32 KB   22 KB   
51 KB   64 KB   32 KB   22 KB   
51 KB   68 KB   32 KB   22 KB   
51 KB   72 KB   32 KB   22 KB   
51 KB   76 KB   32 KB   22 KB   
51 KB   80 KB   32 KB   22 KB   
51 KB   84 KB   32 KB   22 KB   
51 KB   88 KB   32 KB   22 KB   
51 KB   92 KB   32 KB   22 KB   
51 KB   96 KB   32 KB   22 KB   
51 KB   100 KB   32 KB   22 KB   
51 KB   104 KB   32 KB   22 KB   
51 KB   108 KB   32 KB   22 KB   
51 KB   112 KB   32 KB   22 KB   
51 KB   116 KB   32 KB   22 KB   
51 KB   120 KB   32 KB   22 KB   
51 KB   124 KB   32 KB   22 KB   
51 KB   128 KB   32 KB   22 KB   
51 KB   132 KB   32 KB   22 KB   
51 KB   136 KB   32 KB   22 KB   
51 KB   140 KB   32 KB   22 KB   
51 KB   144 KB   32 KB   22 KB   
51 KB   148 KB   32 KB   22 KB   
51 KB   152 KB   32 KB   22 KB   
51 KB   156 KB   32 KB   22 KB   
51 KB   160 KB   32 KB   22 KB   
51 KB   164 KB   32 KB   22 KB   
51 KB   168 KB   32 KB   22 KB   
51 KB   172 KB   32 KB   22 KB   
51 KB   176 KB   32 KB   22 KB   
51 KB   180 KB   32 KB   22 KB   
                                 
Downloaded: http://repo1.maven.org/maven2/asm/asm-xml/3.1/asm-xml-3.1.jar (51 KB at 1806.6
KB/sec)
184 KB   32 KB   22 KB           
188 KB   32 KB   22 KB   
192 KB   32 KB   22 KB   
196 KB   32 KB   22 KB   
200 KB   32 KB   22 KB   
204 KB   32 KB   22 KB   
206 KB   32 KB   22 KB   
                         
Downloaded: http://repo1.maven.org/maven2/asm/asm-commons/3.1/asm-commons-3.1.jar (32 KB at
266.1 KB/sec)
                         
Downloaded: http://repo1.maven.org/maven2/org/codehaus/plexus/plexus-utils/1.5.1/plexus-utils-1.5.1.jar
(206 KB at 8229.7 KB/sec)
                         
Downloaded: http://repo1.maven.org/maven2/asm/asm-tree/3.1/asm-tree-3.1.jar (22 KB at 218.0
KB/sec)
[INFO] ****** FindBugsMojo execute *******
[INFO] canGenerate is false
[INFO]                                                                         
[INFO] ------------------------------------------------------------------------
[INFO] Building hadoop-yarn-api 3.0.0-SNAPSHOT
[INFO] ------------------------------------------------------------------------
[WARNING] The POM for org.eclipse.m2e:lifecycle-mapping:jar:1.0.0 is missing, no dependency
information available
[WARNING] Failed to retrieve plugin descriptor for org.eclipse.m2e:lifecycle-mapping:1.0.0:
Plugin org.eclipse.m2e:lifecycle-mapping:1.0.0 or one of its dependencies could not be resolved:
Failed to read artifact descriptor for org.eclipse.m2e:lifecycle-mapping:jar:1.0.0
[INFO] 
[INFO] --- maven-clean-plugin:2.4.1:clean (default-clean) @ hadoop-yarn-api ---
[INFO] 
[INFO] --- maven-antrun-plugin:1.6:run (create-testdirs) @ hadoop-yarn-api ---
[INFO] Executing tasks

main:
    [mkdir] Created dir: <https://builds.apache.org/job/Hadoop-Yarn-trunk/ws/trunk/hadoop-yarn-project/hadoop-yarn/hadoop-yarn-api/target/test-dir>
[INFO] Executed tasks
[INFO] 
[INFO] --- maven-antrun-plugin:1.6:run (create-protobuf-generated-sources-directory) @ hadoop-yarn-api
---
[INFO] Executing tasks

main:
    [mkdir] Created dir: <https://builds.apache.org/job/Hadoop-Yarn-trunk/ws/trunk/hadoop-yarn-project/hadoop-yarn/hadoop-yarn-api/target/generated-sources/proto>
[INFO] Executed tasks
[INFO] 
[INFO] --- exec-maven-plugin:1.2:exec (generate-sources) @ hadoop-yarn-api ---
yarn_protos.proto:21:8: Option "java_generic_services" unknown.
[INFO] ------------------------------------------------------------------------
[INFO] Reactor Summary:
[INFO] 
[INFO] hadoop-yarn ....................................... SUCCESS [27.646s]
[INFO] hadoop-yarn-api ................................... FAILURE [0.462s]
[INFO] hadoop-yarn-common ................................ SKIPPED
[INFO] hadoop-yarn-server ................................ SKIPPED
[INFO] hadoop-yarn-server-common ......................... SKIPPED
[INFO] hadoop-yarn-server-nodemanager .................... SKIPPED
[INFO] hadoop-yarn-server-web-proxy ...................... SKIPPED
[INFO] hadoop-yarn-server-resourcemanager ................ SKIPPED
[INFO] hadoop-yarn-server-tests .......................... SKIPPED
[INFO] hadoop-yarn-client ................................ SKIPPED
[INFO] hadoop-yarn-applications .......................... SKIPPED
[INFO] hadoop-yarn-applications-distributedshell ......... SKIPPED
[INFO] hadoop-yarn-applications-unmanaged-am-launcher .... SKIPPED
[INFO] hadoop-yarn-site .................................. SKIPPED
[INFO] hadoop-yarn-project ............................... SKIPPED
[INFO] ------------------------------------------------------------------------
[INFO] BUILD FAILURE
[INFO] ------------------------------------------------------------------------
[INFO] Total time: 31.059s
[INFO] Finished at: Sat Jan 05 10:32:37 UTC 2013
[INFO] Final Memory: 28M/154M
[INFO] ------------------------------------------------------------------------
[ERROR] Failed to execute goal org.codehaus.mojo:exec-maven-plugin:1.2:exec (generate-sources)
on project hadoop-yarn-api: Command execution failed. Process exited with an error: 1(Exit
value: 1) -> [Help 1]
[ERROR] 
[ERROR] To see the full stack trace of the errors, re-run Maven with the -e switch.
[ERROR] Re-run Maven using the -X switch to enable full debug logging.
[ERROR] 
[ERROR] For more information about the errors and possible solutions, please read the following
articles:
[ERROR] [Help 1] http://cwiki.apache.org/confluence/display/MAVEN/MojoExecutionException
[ERROR] 
[ERROR] After correcting the problems, you can resume the build with the command
[ERROR]   mvn <goals> -rf :hadoop-yarn-api
Build step 'Execute shell' marked build as failure
Archiving artifacts
Updating MAPREDUCE-4819
Updating MAPREDUCE-4832
Updating HADOOP-9173
Updating YARN-50
Updating MAPREDUCE-4894
Updating YARN-286

Mime
View raw message