hadoop-yarn-dev mailing list archives

Site index · List index
Message view « Date » · « Thread »
Top « Date » · « Thread »
From Apache Jenkins Server <jenk...@builds.apache.org>
Subject Build failed in Jenkins: Hadoop-Yarn-trunk #106
Date Thu, 24 Jan 2013 10:32:46 GMT
See <https://builds.apache.org/job/Hadoop-Yarn-trunk/106/changes>

Changes:

[szetszwo] Add .classpath, .project, .settings and target to svn:ignore.

[jlowe] YARN-354. WebAppProxyServer exits immediately after startup. Contributed by Liang
Xie

[suresh] HDFS-4426. Secondary namenode shuts down immediately after startup. Contributed by
Arpit Agarwal.

[tomwhite] YARN-319. Submitting a job to a fair scheduler queue for which the user does not
have permission causes the client to wait forever. Contributed by shenhong.

------------------------------------------
[...truncated 7517 lines...]
    [mkdir] Created dir: <https://builds.apache.org/job/Hadoop-Yarn-trunk/ws/trunk/hadoop-yarn-project/hadoop-yarn/hadoop-yarn-api/target/test-dir>
[INFO] Executed tasks
[INFO] 
[INFO] --- maven-antrun-plugin:1.6:run (create-protobuf-generated-sources-directory) @ hadoop-yarn-api
---
[INFO] Executing tasks

main:
    [mkdir] Created dir: <https://builds.apache.org/job/Hadoop-Yarn-trunk/ws/trunk/hadoop-yarn-project/hadoop-yarn/hadoop-yarn-api/target/generated-sources/proto>
[INFO] Executed tasks
[INFO] 
[INFO] --- exec-maven-plugin:1.2:exec (generate-sources) @ hadoop-yarn-api ---
[INFO] 
[INFO] --- build-helper-maven-plugin:1.5:add-source (add-source) @ hadoop-yarn-api ---
[INFO] Source directory: <https://builds.apache.org/job/Hadoop-Yarn-trunk/ws/trunk/hadoop-yarn-project/hadoop-yarn/hadoop-yarn-api/target/generated-sources/proto>
added.
[INFO] 
[INFO] --- maven-resources-plugin:2.2:resources (default-resources) @ hadoop-yarn-api ---
[INFO] Using default encoding to copy filtered resources.
[INFO] 
[INFO] --- maven-compiler-plugin:2.5.1:compile (default-compile) @ hadoop-yarn-api ---
[INFO] Compiling 188 source files to <https://builds.apache.org/job/Hadoop-Yarn-trunk/ws/trunk/hadoop-yarn-project/hadoop-yarn/hadoop-yarn-api/target/classes>
[INFO] -------------------------------------------------------------
[ERROR] COMPILATION ERROR : 
[INFO] -------------------------------------------------------------
[ERROR] error: error reading /home/jenkins/.m2/repository/org/glassfish/grizzly/grizzly-framework/2.1.1/grizzly-framework-2.1.1.jar;
error in opening zip file
[ERROR] error: error reading /home/jenkins/.m2/repository/org/glassfish/grizzly/grizzly-rcm/2.1.1/grizzly-rcm-2.1.1.jar;
error in opening zip file
[ERROR] error: error reading /home/jenkins/.m2/repository/org/glassfish/grizzly/grizzly-framework/2.1.1/grizzly-framework-2.1.1-tests.jar;
error in opening zip file
[INFO] 3 errors 
[INFO] -------------------------------------------------------------
[INFO] ------------------------------------------------------------------------
[INFO] Reactor Summary:
[INFO] 
[INFO] Apache Hadoop Main ................................ SUCCESS [1.157s]
[INFO] Apache Hadoop Project POM ......................... SUCCESS [0.349s]
[INFO] Apache Hadoop Annotations ......................... SUCCESS [1.242s]
[INFO] Apache Hadoop Project Dist POM .................... SUCCESS [0.380s]
[INFO] Apache Hadoop Assemblies .......................... SUCCESS [0.138s]
[INFO] Apache Hadoop Maven Plugins ....................... SUCCESS [1.396s]
[INFO] Apache Hadoop Auth ................................ SUCCESS [1.248s]
[INFO] Apache Hadoop Auth Examples ....................... SUCCESS [0.570s]
[INFO] Apache Hadoop Common .............................. SUCCESS [25.065s]
[INFO] Apache Hadoop Common Project ...................... SUCCESS [0.026s]
[INFO] Apache Hadoop HDFS ................................ SUCCESS [22.068s]
[INFO] Apache Hadoop HttpFS .............................. SUCCESS [3.086s]
[INFO] Apache Hadoop HDFS BookKeeper Journal ............. SUCCESS [0.649s]
[INFO] Apache Hadoop HDFS Project ........................ SUCCESS [0.027s]
[INFO] hadoop-yarn ....................................... SUCCESS [0.103s]
[INFO] hadoop-yarn-api ................................... FAILURE [0.250s]
[INFO] hadoop-yarn-common ................................ SKIPPED
[INFO] hadoop-yarn-server ................................ SKIPPED
[INFO] hadoop-yarn-server-common ......................... SKIPPED
[INFO] hadoop-yarn-server-nodemanager .................... SKIPPED
[INFO] hadoop-yarn-server-web-proxy ...................... SKIPPED
[INFO] hadoop-yarn-server-resourcemanager ................ SKIPPED
[INFO] hadoop-yarn-server-tests .......................... SKIPPED
[INFO] hadoop-yarn-client ................................ SKIPPED
[INFO] hadoop-yarn-applications .......................... SKIPPED
[INFO] hadoop-yarn-applications-distributedshell ......... SKIPPED
[INFO] hadoop-mapreduce-client ........................... SKIPPED
[INFO] hadoop-mapreduce-client-core ...................... SKIPPED
[INFO] hadoop-yarn-applications-unmanaged-am-launcher .... SKIPPED
[INFO] hadoop-yarn-site .................................. SKIPPED
[INFO] hadoop-yarn-project ............................... SKIPPED
[INFO] hadoop-mapreduce-client-common .................... SKIPPED
[INFO] hadoop-mapreduce-client-shuffle ................... SKIPPED
[INFO] hadoop-mapreduce-client-app ....................... SKIPPED
[INFO] hadoop-mapreduce-client-hs ........................ SKIPPED
[INFO] hadoop-mapreduce-client-jobclient ................. SKIPPED
[INFO] hadoop-mapreduce-client-hs-plugins ................ SKIPPED
[INFO] Apache Hadoop MapReduce Examples .................. SKIPPED
[INFO] hadoop-mapreduce .................................. SKIPPED
[INFO] Apache Hadoop MapReduce Streaming ................. SKIPPED
[INFO] Apache Hadoop Distributed Copy .................... SKIPPED
[INFO] Apache Hadoop Archives ............................ SKIPPED
[INFO] Apache Hadoop Rumen ............................... SKIPPED
[INFO] Apache Hadoop Gridmix ............................. SKIPPED
[INFO] Apache Hadoop Data Join ........................... SKIPPED
[INFO] Apache Hadoop Extras .............................. SKIPPED
[INFO] Apache Hadoop Pipes ............................... SKIPPED
[INFO] Apache Hadoop Tools Dist .......................... SKIPPED
[INFO] Apache Hadoop Tools ............................... SKIPPED
[INFO] Apache Hadoop Distribution ........................ SKIPPED
[INFO] Apache Hadoop Client .............................. SKIPPED
[INFO] Apache Hadoop Mini-Cluster ........................ SKIPPED
[INFO] ------------------------------------------------------------------------
[INFO] BUILD FAILURE
[INFO] ------------------------------------------------------------------------
[INFO] Total time: 59.268s
[INFO] Finished at: Thu Jan 24 10:32:35 UTC 2013
[INFO] Final Memory: 46M/790M
[INFO] ------------------------------------------------------------------------
[ERROR] Failed to execute goal org.apache.maven.plugins:maven-compiler-plugin:2.5.1:compile
(default-compile) on project hadoop-yarn-api: Compilation failure: Compilation failure:
[ERROR] error: error reading /home/jenkins/.m2/repository/org/glassfish/grizzly/grizzly-framework/2.1.1/grizzly-framework-2.1.1.jar;
error in opening zip file
[ERROR] error: error reading /home/jenkins/.m2/repository/org/glassfish/grizzly/grizzly-rcm/2.1.1/grizzly-rcm-2.1.1.jar;
error in opening zip file
[ERROR] error: error reading /home/jenkins/.m2/repository/org/glassfish/grizzly/grizzly-framework/2.1.1/grizzly-framework-2.1.1-tests.jar;
error in opening zip file
[ERROR] -> [Help 1]
[ERROR] 
[ERROR] To see the full stack trace of the errors, re-run Maven with the -e switch.
[ERROR] Re-run Maven using the -X switch to enable full debug logging.
[ERROR] 
[ERROR] For more information about the errors and possible solutions, please read the following
articles:
[ERROR] [Help 1] http://cwiki.apache.org/confluence/display/MAVEN/MojoFailureException
[ERROR] 
[ERROR] After correcting the problems, you can resume the build with the command
[ERROR]   mvn <goals> -rf :hadoop-yarn-api
+ cd hadoop-yarn-project
+ /home/jenkins/tools/maven/latest/bin/mvn clean verify checkstyle:checkstyle findbugs:findbugs
-Pdist -Pnative -Dtar
[INFO] Scanning for projects...
[INFO] ------------------------------------------------------------------------
[INFO] Reactor Build Order:
[INFO] 
[INFO] hadoop-yarn
[INFO] hadoop-yarn-api
[INFO] hadoop-yarn-common
[INFO] hadoop-yarn-server
[INFO] hadoop-yarn-server-common
[INFO] hadoop-yarn-server-nodemanager
[INFO] hadoop-yarn-server-web-proxy
[INFO] hadoop-yarn-server-resourcemanager
[INFO] hadoop-yarn-server-tests
[INFO] hadoop-yarn-client
[INFO] hadoop-yarn-applications
[INFO] hadoop-yarn-applications-distributedshell
[INFO] hadoop-yarn-applications-unmanaged-am-launcher
[INFO] hadoop-yarn-site
[INFO] hadoop-yarn-project
Downloading: http://repo1.maven.org/maven2/org/eclipse/m2e/lifecycle-mapping/1.0.0/lifecycle-mapping-1.0.0.pom

[WARNING] The POM for org.eclipse.m2e:lifecycle-mapping:jar:1.0.0 is missing, no dependency
information available
[WARNING] Failed to retrieve plugin descriptor for org.eclipse.m2e:lifecycle-mapping:1.0.0:
Plugin org.eclipse.m2e:lifecycle-mapping:1.0.0 or one of its dependencies could not be resolved:
Failed to read artifact descriptor for org.eclipse.m2e:lifecycle-mapping:jar:1.0.0
[INFO]                                                                         
[INFO] ------------------------------------------------------------------------
[INFO] Building hadoop-yarn 3.0.0-SNAPSHOT
[INFO] ------------------------------------------------------------------------
[WARNING] The POM for org.eclipse.m2e:lifecycle-mapping:jar:1.0.0 is missing, no dependency
information available
[WARNING] Failed to retrieve plugin descriptor for org.eclipse.m2e:lifecycle-mapping:1.0.0:
Plugin org.eclipse.m2e:lifecycle-mapping:1.0.0 or one of its dependencies could not be resolved:
Failed to read artifact descriptor for org.eclipse.m2e:lifecycle-mapping:jar:1.0.0
[WARNING] The POM for org.glassfish.grizzly:grizzly-framework:jar:2.1.1 is invalid, transitive
dependencies (if any) will not be available, enable debug logging for more details
[WARNING] The POM for org.glassfish.grizzly:grizzly-rcm:jar:2.1.1 is invalid, transitive dependencies
(if any) will not be available, enable debug logging for more details
[WARNING] The POM for org.glassfish.grizzly:grizzly-framework:jar:tests:2.1.1 is invalid,
transitive dependencies (if any) will not be available, enable debug logging for more details
[INFO] 
[INFO] --- maven-clean-plugin:2.4.1:clean (default-clean) @ hadoop-yarn ---
[INFO] Deleting <https://builds.apache.org/job/Hadoop-Yarn-trunk/ws/trunk/hadoop-yarn-project/hadoop-yarn/target>
[INFO] 
[INFO] --- maven-antrun-plugin:1.6:run (create-testdirs) @ hadoop-yarn ---
[INFO] Executing tasks

main:
    [mkdir] Created dir: <https://builds.apache.org/job/Hadoop-Yarn-trunk/ws/trunk/hadoop-yarn-project/hadoop-yarn/target/test-dir>
[INFO] Executed tasks
[INFO] 
[INFO] --- maven-source-plugin:2.1.2:jar-no-fork (hadoop-java-sources) @ hadoop-yarn ---
[INFO] 
[INFO] --- maven-enforcer-plugin:1.0:enforce (dist-enforce) @ hadoop-yarn ---
[INFO] 
[INFO] --- maven-site-plugin:3.0:attach-descriptor (attach-descriptor) @ hadoop-yarn ---
[INFO] 
[INFO] --- maven-javadoc-plugin:2.8.1:jar (module-javadocs) @ hadoop-yarn ---
[INFO] Not executing Javadoc as the project is not a Java classpath-capable package
[INFO] 
[INFO] --- maven-checkstyle-plugin:2.6:checkstyle (default-cli) @ hadoop-yarn ---
[INFO] 
[INFO] --- findbugs-maven-plugin:2.3.2:findbugs (default-cli) @ hadoop-yarn ---
[INFO] ****** FindBugsMojo execute *******
[INFO] canGenerate is false
[INFO]                                                                         
[INFO] ------------------------------------------------------------------------
[INFO] Building hadoop-yarn-api 3.0.0-SNAPSHOT
[INFO] ------------------------------------------------------------------------
[WARNING] The POM for org.eclipse.m2e:lifecycle-mapping:jar:1.0.0 is missing, no dependency
information available
[WARNING] Failed to retrieve plugin descriptor for org.eclipse.m2e:lifecycle-mapping:1.0.0:
Plugin org.eclipse.m2e:lifecycle-mapping:1.0.0 or one of its dependencies could not be resolved:
Failed to read artifact descriptor for org.eclipse.m2e:lifecycle-mapping:jar:1.0.0
[INFO] 
[INFO] --- maven-clean-plugin:2.4.1:clean (default-clean) @ hadoop-yarn-api ---
[INFO] Deleting <https://builds.apache.org/job/Hadoop-Yarn-trunk/ws/trunk/hadoop-yarn-project/hadoop-yarn/hadoop-yarn-api/target>
[INFO] 
[INFO] --- maven-antrun-plugin:1.6:run (create-testdirs) @ hadoop-yarn-api ---
[INFO] Executing tasks

main:
    [mkdir] Created dir: <https://builds.apache.org/job/Hadoop-Yarn-trunk/ws/trunk/hadoop-yarn-project/hadoop-yarn/hadoop-yarn-api/target/test-dir>
[INFO] Executed tasks
[INFO] 
[INFO] --- maven-antrun-plugin:1.6:run (create-protobuf-generated-sources-directory) @ hadoop-yarn-api
---
[INFO] Executing tasks

main:
    [mkdir] Created dir: <https://builds.apache.org/job/Hadoop-Yarn-trunk/ws/trunk/hadoop-yarn-project/hadoop-yarn/hadoop-yarn-api/target/generated-sources/proto>
[INFO] Executed tasks
[INFO] 
[INFO] --- exec-maven-plugin:1.2:exec (generate-sources) @ hadoop-yarn-api ---
[INFO] 
[INFO] --- build-helper-maven-plugin:1.5:add-source (add-source) @ hadoop-yarn-api ---
[INFO] Source directory: <https://builds.apache.org/job/Hadoop-Yarn-trunk/ws/trunk/hadoop-yarn-project/hadoop-yarn/hadoop-yarn-api/target/generated-sources/proto>
added.
[INFO] 
[INFO] --- maven-resources-plugin:2.2:resources (default-resources) @ hadoop-yarn-api ---
[INFO] Using default encoding to copy filtered resources.
[INFO] 
[INFO] --- maven-compiler-plugin:2.5.1:compile (default-compile) @ hadoop-yarn-api ---
[INFO] Compiling 188 source files to <https://builds.apache.org/job/Hadoop-Yarn-trunk/ws/trunk/hadoop-yarn-project/hadoop-yarn/hadoop-yarn-api/target/classes>
[INFO] -------------------------------------------------------------
[ERROR] COMPILATION ERROR : 
[INFO] -------------------------------------------------------------
[ERROR] error: error reading /home/jenkins/.m2/repository/org/glassfish/grizzly/grizzly-framework/2.1.1/grizzly-framework-2.1.1.jar;
error in opening zip file
[ERROR] error: error reading /home/jenkins/.m2/repository/org/glassfish/grizzly/grizzly-rcm/2.1.1/grizzly-rcm-2.1.1.jar;
error in opening zip file
[ERROR] error: error reading /home/jenkins/.m2/repository/org/glassfish/grizzly/grizzly-framework/2.1.1/grizzly-framework-2.1.1-tests.jar;
error in opening zip file
[INFO] 3 errors 
[INFO] -------------------------------------------------------------
[INFO] ------------------------------------------------------------------------
[INFO] Reactor Summary:
[INFO] 
[INFO] hadoop-yarn ....................................... SUCCESS [2.776s]
[INFO] hadoop-yarn-api ................................... FAILURE [1.129s]
[INFO] hadoop-yarn-common ................................ SKIPPED
[INFO] hadoop-yarn-server ................................ SKIPPED
[INFO] hadoop-yarn-server-common ......................... SKIPPED
[INFO] hadoop-yarn-server-nodemanager .................... SKIPPED
[INFO] hadoop-yarn-server-web-proxy ...................... SKIPPED
[INFO] hadoop-yarn-server-resourcemanager ................ SKIPPED
[INFO] hadoop-yarn-server-tests .......................... SKIPPED
[INFO] hadoop-yarn-client ................................ SKIPPED
[INFO] hadoop-yarn-applications .......................... SKIPPED
[INFO] hadoop-yarn-applications-distributedshell ......... SKIPPED
[INFO] hadoop-yarn-applications-unmanaged-am-launcher .... SKIPPED
[INFO] hadoop-yarn-site .................................. SKIPPED
[INFO] hadoop-yarn-project ............................... SKIPPED
[INFO] ------------------------------------------------------------------------
[INFO] BUILD FAILURE
[INFO] ------------------------------------------------------------------------
[INFO] Total time: 5.271s
[INFO] Finished at: Thu Jan 24 10:32:42 UTC 2013
[INFO] Final Memory: 30M/257M
[INFO] ------------------------------------------------------------------------
[ERROR] Failed to execute goal org.apache.maven.plugins:maven-compiler-plugin:2.5.1:compile
(default-compile) on project hadoop-yarn-api: Compilation failure: Compilation failure:
[ERROR] error: error reading /home/jenkins/.m2/repository/org/glassfish/grizzly/grizzly-framework/2.1.1/grizzly-framework-2.1.1.jar;
error in opening zip file
[ERROR] error: error reading /home/jenkins/.m2/repository/org/glassfish/grizzly/grizzly-rcm/2.1.1/grizzly-rcm-2.1.1.jar;
error in opening zip file
[ERROR] error: error reading /home/jenkins/.m2/repository/org/glassfish/grizzly/grizzly-framework/2.1.1/grizzly-framework-2.1.1-tests.jar;
error in opening zip file
[ERROR] -> [Help 1]
[ERROR] 
[ERROR] To see the full stack trace of the errors, re-run Maven with the -e switch.
[ERROR] Re-run Maven using the -X switch to enable full debug logging.
[ERROR] 
[ERROR] For more information about the errors and possible solutions, please read the following
articles:
[ERROR] [Help 1] http://cwiki.apache.org/confluence/display/MAVEN/MojoFailureException
[ERROR] 
[ERROR] After correcting the problems, you can resume the build with the command
[ERROR]   mvn <goals> -rf :hadoop-yarn-api
Build step 'Execute shell' marked build as failure
Archiving artifacts
Updating YARN-354
Updating HDFS-4426
Updating YARN-319

Mime
View raw message