hadoop-yarn-dev mailing list archives

Site index · List index
Message view « Date » · « Thread »
Top « Date » · « Thread »
From Apache Jenkins Server <jenk...@builds.apache.org>
Subject Build failed in Jenkins: Hadoop-Yarn-trunk #110
Date Mon, 28 Jan 2013 10:39:24 GMT
See <https://builds.apache.org/job/Hadoop-Yarn-trunk/110/changes>

Changes:

[harsh] HADOOP-9241. DU refresh interval is not configurable. Contributed by Harsh J. (harsh)

[harsh] HDFS-4259. Improve pipeline DN replacement failure message. Contributed by Harsh J.
(harsh)

------------------------------------------
[...truncated 11942 lines...]
	at java.util.regex.Pattern.matches(Pattern.java:928)
	at java.lang.String.matches(String.java:2090)
	at org.apache.hadoop.yarn.webapp.WebServicesTestUtils.checkStringMatch(WebServicesTestUtils.java:77)
	at org.apache.hadoop.yarn.server.nodemanager.webapp.TestNMWebServices.verifyNodeInfoGeneric(TestNMWebServices.java:346)
	at org.apache.hadoop.yarn.server.nodemanager.webapp.TestNMWebServices.verifyNodeInfo(TestNMWebServices.java:314)
	at org.apache.hadoop.yarn.server.nodemanager.webapp.TestNMWebServices.testNodeInfo(TestNMWebServices.java:244)
	at sun.reflect.NativeMethodAccessorImpl.invoke0(Native Method)
	at sun.reflect.NativeMethodAccessorImpl.invoke(NativeMethodAccessorImpl.java:39)
	at sun.reflect.DelegatingMethodAccessorImpl.invoke(DelegatingMethodAccessorImpl.java:25)
	at java.lang.reflect.Method.invoke(Method.java:597)
	at org.junit.runners.model.FrameworkMethod$1.runReflectiveCall(FrameworkMethod.java:44)
	at org.junit.internal.runners.model.ReflectiveCallable.run(ReflectiveCallable.java:15)
	at org.junit.runners.model.FrameworkMethod.invokeExplosively(FrameworkMethod.java:41)
	at org.junit.internal.runners.statements.InvokeMethod.evaluate(InvokeMethod.java:20)
	at org.junit.internal.runners.statements.RunBefores.evaluate(RunBefores.java:28)
	at org.junit.internal.runners.statements.RunAfters.evaluate(RunAfters.java:31)
	at org.junit.runners.BlockJUnit4ClassRunner.runNotIgnored(BlockJUnit4ClassRunner.java:79)
	at org.junit.runners.BlockJUnit4ClassRunner.runChild(BlockJUnit4ClassRunner.java:71)
	at org.junit.runners.BlockJUnit4ClassRunner.runChild(BlockJUnit4ClassRunner.java:49)
	at org.junit.runners.ParentRunner$3.run(ParentRunner.java:193)
	at org.junit.runners.ParentRunner$1.schedule(ParentRunner.java:52)
	at org.junit.runners.ParentRunner.runChildren(ParentRunner.java:191)
	at org.junit.runners.ParentRunner.access$000(ParentRunner.java:42)
	at org.junit.runners.ParentRunner$2.evaluate(ParentRunner.java:184)
	at org.junit.internal.runners.statements.RunAfters.evaluate(RunAfters.java:31)
	at org.junit.runners.ParentRunner.run(ParentRunner.java:236)
	at org.apache.maven.surefire.junit4.JUnit4Provider.execute(JUnit4Provider.java:252)
	at org.apache.maven.surefire.junit4.JUnit4Provider.executeTestSet(JUnit4Provider.java:141)
	at org.apache.maven.surefire.junit4.JUnit4Provider.invoke(JUnit4Provider.java:112)
	at sun.reflect.NativeMethodAccessorImpl.invoke0(Native Method)
	at sun.reflect.NativeMethodAccessorImpl.invoke(NativeMethodAccessorImpl.java:39)
	at sun.reflect.DelegatingMethodAccessorImpl.invoke(DelegatingMethodAccessorImpl.java:25)
	at java.lang.reflect.Method.invoke(Method.java:597)
	at org.apache.maven.surefire.util.ReflectionUtils.invokeMethodWithArray(ReflectionUtils.java:189)
	at org.apache.maven.surefire.booter.ProviderFactory$ProviderProxy.invoke(ProviderFactory.java:165)
	at org.apache.maven.surefire.booter.ProviderFactory.invokeProvider(ProviderFactory.java:85)
	at org.apache.maven.surefire.booter.ForkedBooter.runSuitesInProcess(ForkedBooter.java:115)
	at org.apache.maven.surefire.booter.ForkedBooter.main(ForkedBooter.java:75)

testNodeInfoSlash(org.apache.hadoop.yarn.server.nodemanager.webapp.TestNMWebServices)  Time
elapsed: 315 sec  <<< ERROR!
java.util.regex.PatternSyntaxException: Illegal repetition near index 0
${version-info.build.time}
^
	at java.util.regex.Pattern.error(Pattern.java:1713)
	at java.util.regex.Pattern.closure(Pattern.java:2775)
	at java.util.regex.Pattern.sequence(Pattern.java:1889)
	at java.util.regex.Pattern.expr(Pattern.java:1752)
	at java.util.regex.Pattern.compile(Pattern.java:1460)
	at java.util.regex.Pattern.<init>(Pattern.java:1133)
	at java.util.regex.Pattern.compile(Pattern.java:823)
	at java.util.regex.Pattern.matches(Pattern.java:928)
	at java.lang.String.matches(String.java:2090)
	at org.apache.hadoop.yarn.webapp.WebServicesTestUtils.checkStringMatch(WebServicesTestUtils.java:77)
	at org.apache.hadoop.yarn.server.nodemanager.webapp.TestNMWebServices.verifyNodeInfoGeneric(TestNMWebServices.java:346)
	at org.apache.hadoop.yarn.server.nodemanager.webapp.TestNMWebServices.verifyNodeInfo(TestNMWebServices.java:314)
	at org.apache.hadoop.yarn.server.nodemanager.webapp.TestNMWebServices.testNodeInfoSlash(TestNMWebServices.java:255)
	at sun.reflect.NativeMethodAccessorImpl.invoke0(Native Method)
	at sun.reflect.NativeMethodAccessorImpl.invoke(NativeMethodAccessorImpl.java:39)
	at sun.reflect.DelegatingMethodAccessorImpl.invoke(DelegatingMethodAccessorImpl.java:25)
	at java.lang.reflect.Method.invoke(Method.java:597)
	at org.junit.runners.model.FrameworkMethod$1.runReflectiveCall(FrameworkMethod.java:44)
	at org.junit.internal.runners.model.ReflectiveCallable.run(ReflectiveCallable.java:15)
	at org.junit.runners.model.FrameworkMethod.invokeExplosively(FrameworkMethod.java:41)
	at org.junit.internal.runners.statements.InvokeMethod.evaluate(InvokeMethod.java:20)
	at org.junit.internal.runners.statements.RunBefores.evaluate(RunBefores.java:28)
	at org.junit.internal.runners.statements.RunAfters.evaluate(RunAfters.java:31)
	at org.junit.runners.BlockJUnit4ClassRunner.runNotIgnored(BlockJUnit4ClassRunner.java:79)
	at org.junit.runners.BlockJUnit4ClassRunner.runChild(BlockJUnit4ClassRunner.java:71)
	at org.junit.runners.BlockJUnit4ClassRunner.runChild(BlockJUnit4ClassRunner.java:49)
	at org.junit.runners.ParentRunner$3.run(ParentRunner.java:193)
	at org.junit.runners.ParentRunner$1.schedule(ParentRunner.java:52)
	at org.junit.runners.ParentRunner.runChildren(ParentRunner.java:191)
	at org.junit.runners.ParentRunner.access$000(ParentRunner.java:42)
	at org.junit.runners.ParentRunner$2.evaluate(ParentRunner.java:184)
	at org.junit.internal.runners.statements.RunAfters.evaluate(RunAfters.java:31)
	at org.junit.runners.ParentRunner.run(ParentRunner.java:236)
	at org.apache.maven.surefire.junit4.JUnit4Provider.execute(JUnit4Provider.java:252)
	at org.apache.maven.surefire.junit4.JUnit4Provider.executeTestSet(JUnit4Provider.java:141)
	at org.apache.maven.surefire.junit4.JUnit4Provider.invoke(JUnit4Provider.java:112)
	at sun.reflect.NativeMethodAccessorImpl.invoke0(Native Method)
	at sun.reflect.NativeMethodAccessorImpl.invoke(NativeMethodAccessorImpl.java:39)
	at sun.reflect.DelegatingMethodAccessorImpl.invoke(DelegatingMethodAccessorImpl.java:25)
	at java.lang.reflect.Method.invoke(Method.java:597)
	at org.apache.maven.surefire.util.ReflectionUtils.invokeMethodWithArray(ReflectionUtils.java:189)
	at org.apache.maven.surefire.booter.ProviderFactory$ProviderProxy.invoke(ProviderFactory.java:165)
	at org.apache.maven.surefire.booter.ProviderFactory.invokeProvider(ProviderFactory.java:85)
	at org.apache.maven.surefire.booter.ForkedBooter.runSuitesInProcess(ForkedBooter.java:115)
	at org.apache.maven.surefire.booter.ForkedBooter.main(ForkedBooter.java:75)

testNodeInfoDefault(org.apache.hadoop.yarn.server.nodemanager.webapp.TestNMWebServices)  Time
elapsed: 272 sec  <<< ERROR!
java.util.regex.PatternSyntaxException: Illegal repetition near index 0
${version-info.build.time}
^
	at java.util.regex.Pattern.error(Pattern.java:1713)
	at java.util.regex.Pattern.closure(Pattern.java:2775)
	at java.util.regex.Pattern.sequence(Pattern.java:1889)
	at java.util.regex.Pattern.expr(Pattern.java:1752)
	at java.util.regex.Pattern.compile(Pattern.java:1460)
	at java.util.regex.Pattern.<init>(Pattern.java:1133)
	at java.util.regex.Pattern.compile(Pattern.java:823)
	at java.util.regex.Pattern.matches(Pattern.java:928)
	at java.lang.String.matches(String.java:2090)
	at org.apache.hadoop.yarn.webapp.WebServicesTestUtils.checkStringMatch(WebServicesTestUtils.java:77)
	at org.apache.hadoop.yarn.server.nodemanager.webapp.TestNMWebServices.verifyNodeInfoGeneric(TestNMWebServices.java:346)
	at org.apache.hadoop.yarn.server.nodemanager.webapp.TestNMWebServices.verifyNodeInfo(TestNMWebServices.java:314)
	at org.apache.hadoop.yarn.server.nodemanager.webapp.TestNMWebServices.testNodeInfoDefault(TestNMWebServices.java:266)
	at sun.reflect.NativeMethodAccessorImpl.invoke0(Native Method)
	at sun.reflect.NativeMethodAccessorImpl.invoke(NativeMethodAccessorImpl.java:39)
	at sun.reflect.DelegatingMethodAccessorImpl.invoke(DelegatingMethodAccessorImpl.java:25)
	at java.lang.reflect.Method.invoke(Method.java:597)
	at org.junit.runners.model.FrameworkMethod$1.runReflectiveCall(FrameworkMethod.java:44)
	at org.junit.internal.runners.model.ReflectiveCallable.run(ReflectiveCallable.java:15)
	at org.junit.runners.model.FrameworkMethod.invokeExplosively(FrameworkMethod.java:41)
	at org.junit.internal.runners.statements.InvokeMethod.evaluate(InvokeMethod.java:20)
	at org.junit.internal.runners.statements.RunBefores.evaluate(RunBefores.java:28)
	at org.junit.internal.runners.statements.RunAfters.evaluate(RunAfters.java:31)
	at org.junit.runners.BlockJUnit4ClassRunner.runNotIgnored(BlockJUnit4ClassRunner.java:79)
	at org.junit.runners.BlockJUnit4ClassRunner.runChild(BlockJUnit4ClassRunner.java:71)
	at org.junit.runners.BlockJUnit4ClassRunner.runChild(BlockJUnit4ClassRunner.java:49)
	at org.junit.runners.ParentRunner$3.run(ParentRunner.java:193)
	at org.junit.runners.ParentRunner$1.schedule(ParentRunner.java:52)
	at org.junit.runners.ParentRunner.runChildren(ParentRunner.java:191)
	at org.junit.runners.ParentRunner.access$000(ParentRunner.java:42)
	at org.junit.runners.ParentRunner$2.evaluate(ParentRunner.java:184)
	at org.junit.internal.runners.statements.RunAfters.evaluate(RunAfters.java:31)
	at org.junit.runners.ParentRunner.run(ParentRunner.java:236)
	at org.apache.maven.surefire.junit4.JUnit4Provider.execute(JUnit4Provider.java:252)
	at org.apache.maven.surefire.junit4.JUnit4Provider.executeTestSet(JUnit4Provider.java:141)
	at org.apache.maven.surefire.junit4.JUnit4Provider.invoke(JUnit4Provider.java:112)
	at sun.reflect.NativeMethodAccessorImpl.invoke0(Native Method)
	at sun.reflect.NativeMethodAccessorImpl.invoke(NativeMethodAccessorImpl.java:39)
	at sun.reflect.DelegatingMethodAccessorImpl.invoke(DelegatingMethodAccessorImpl.java:25)
	at java.lang.reflect.Method.invoke(Method.java:597)
	at org.apache.maven.surefire.util.ReflectionUtils.invokeMethodWithArray(ReflectionUtils.java:189)
	at org.apache.maven.surefire.booter.ProviderFactory$ProviderProxy.invoke(ProviderFactory.java:165)
	at org.apache.maven.surefire.booter.ProviderFactory.invokeProvider(ProviderFactory.java:85)
	at org.apache.maven.surefire.booter.ForkedBooter.runSuitesInProcess(ForkedBooter.java:115)
	at org.apache.maven.surefire.booter.ForkedBooter.main(ForkedBooter.java:75)

testSingleNodesXML(org.apache.hadoop.yarn.server.nodemanager.webapp.TestNMWebServices)  Time
elapsed: 273 sec  <<< ERROR!
java.util.regex.PatternSyntaxException: Illegal repetition near index 0
${version-info.build.time}
^
	at java.util.regex.Pattern.error(Pattern.java:1713)
	at java.util.regex.Pattern.closure(Pattern.java:2775)
	at java.util.regex.Pattern.sequence(Pattern.java:1889)
	at java.util.regex.Pattern.expr(Pattern.java:1752)
	at java.util.regex.Pattern.compile(Pattern.java:1460)
	at java.util.regex.Pattern.<init>(Pattern.java:1133)
	at java.util.regex.Pattern.compile(Pattern.java:823)
	at java.util.regex.Pattern.matches(Pattern.java:928)
	at java.lang.String.matches(String.java:2090)
	at org.apache.hadoop.yarn.webapp.WebServicesTestUtils.checkStringMatch(WebServicesTestUtils.java:77)
	at org.apache.hadoop.yarn.server.nodemanager.webapp.TestNMWebServices.verifyNodeInfoGeneric(TestNMWebServices.java:346)
	at org.apache.hadoop.yarn.server.nodemanager.webapp.TestNMWebServices.verifyNodesXML(TestNMWebServices.java:291)
	at org.apache.hadoop.yarn.server.nodemanager.webapp.TestNMWebServices.testSingleNodesXML(TestNMWebServices.java:284)
	at sun.reflect.NativeMethodAccessorImpl.invoke0(Native Method)
	at sun.reflect.NativeMethodAccessorImpl.invoke(NativeMethodAccessorImpl.java:39)
	at sun.reflect.DelegatingMethodAccessorImpl.invoke(DelegatingMethodAccessorImpl.java:25)
	at java.lang.reflect.Method.invoke(Method.java:597)
	at org.junit.runners.model.FrameworkMethod$1.runReflectiveCall(FrameworkMethod.java:44)
	at org.junit.internal.runners.model.ReflectiveCallable.run(ReflectiveCallable.java:15)
	at org.junit.runners.model.FrameworkMethod.invokeExplosively(FrameworkMethod.java:41)
	at org.junit.internal.runners.statements.InvokeMethod.evaluate(InvokeMethod.java:20)
	at org.junit.internal.runners.statements.RunBefores.evaluate(RunBefores.java:28)
	at org.junit.internal.runners.statements.RunAfters.evaluate(RunAfters.java:31)
	at org.junit.runners.BlockJUnit4ClassRunner.runNotIgnored(BlockJUnit4ClassRunner.java:79)
	at org.junit.runners.BlockJUnit4ClassRunner.runChild(BlockJUnit4ClassRunner.java:71)
	at org.junit.runners.BlockJUnit4ClassRunner.runChild(BlockJUnit4ClassRunner.java:49)
	at org.junit.runners.ParentRunner$3.run(ParentRunner.java:193)
	at org.junit.runners.ParentRunner$1.schedule(ParentRunner.java:52)
	at org.junit.runners.ParentRunner.runChildren(ParentRunner.java:191)
	at org.junit.runners.ParentRunner.access$000(ParentRunner.java:42)
	at org.junit.runners.ParentRunner$2.evaluate(ParentRunner.java:184)
	at org.junit.internal.runners.statements.RunAfters.evaluate(RunAfters.java:31)
	at org.junit.runners.ParentRunner.run(ParentRunner.java:236)
	at org.apache.maven.surefire.junit4.JUnit4Provider.execute(JUnit4Provider.java:252)
	at org.apache.maven.surefire.junit4.JUnit4Provider.executeTestSet(JUnit4Provider.java:141)
	at org.apache.maven.surefire.junit4.JUnit4Provider.invoke(JUnit4Provider.java:112)
	at sun.reflect.NativeMethodAccessorImpl.invoke0(Native Method)
	at sun.reflect.NativeMethodAccessorImpl.invoke(NativeMethodAccessorImpl.java:39)
	at sun.reflect.DelegatingMethodAccessorImpl.invoke(DelegatingMethodAccessorImpl.java:25)
	at java.lang.reflect.Method.invoke(Method.java:597)
	at org.apache.maven.surefire.util.ReflectionUtils.invokeMethodWithArray(ReflectionUtils.java:189)
	at org.apache.maven.surefire.booter.ProviderFactory$ProviderProxy.invoke(ProviderFactory.java:165)
	at org.apache.maven.surefire.booter.ProviderFactory.invokeProvider(ProviderFactory.java:85)
	at org.apache.maven.surefire.booter.ForkedBooter.runSuitesInProcess(ForkedBooter.java:115)
	at org.apache.maven.surefire.booter.ForkedBooter.main(ForkedBooter.java:75)

Running org.apache.hadoop.yarn.server.nodemanager.webapp.TestContainerLogsPage
Tests run: 1, Failures: 0, Errors: 0, Skipped: 0, Time elapsed: 0.679 sec
Running org.apache.hadoop.yarn.server.nodemanager.webapp.TestNMWebServer
Tests run: 3, Failures: 0, Errors: 0, Skipped: 0, Time elapsed: 2.765 sec

Results :

Tests in error: 
  testNode(org.apache.hadoop.yarn.server.nodemanager.webapp.TestNMWebServices): Illegal repetition
near index 0(..)
  testNodeSlash(org.apache.hadoop.yarn.server.nodemanager.webapp.TestNMWebServices): Illegal
repetition near index 0(..)
  testNodeDefault(org.apache.hadoop.yarn.server.nodemanager.webapp.TestNMWebServices): Illegal
repetition near index 0(..)
  testNodeInfo(org.apache.hadoop.yarn.server.nodemanager.webapp.TestNMWebServices): Illegal
repetition near index 0(..)
  testNodeInfoSlash(org.apache.hadoop.yarn.server.nodemanager.webapp.TestNMWebServices): Illegal
repetition near index 0(..)
  testNodeInfoDefault(org.apache.hadoop.yarn.server.nodemanager.webapp.TestNMWebServices):
Illegal repetition near index 0(..)
  testSingleNodesXML(org.apache.hadoop.yarn.server.nodemanager.webapp.TestNMWebServices):
Illegal repetition near index 0(..)

Tests run: 151, Failures: 0, Errors: 7, Skipped: 0

[INFO] ------------------------------------------------------------------------
[INFO] Reactor Summary:
[INFO] 
[INFO] hadoop-yarn ....................................... SUCCESS [2.790s]
[INFO] hadoop-yarn-api ................................... SUCCESS [1:42.256s]
[INFO] hadoop-yarn-common ................................ SUCCESS [1:46.870s]
[INFO] hadoop-yarn-server ................................ SUCCESS [0.113s]
[INFO] hadoop-yarn-server-common ......................... SUCCESS [23.005s]
[INFO] hadoop-yarn-server-nodemanager .................... FAILURE [2:29.973s]
[INFO] hadoop-yarn-server-web-proxy ...................... SKIPPED
[INFO] hadoop-yarn-server-resourcemanager ................ SKIPPED
[INFO] hadoop-yarn-server-tests .......................... SKIPPED
[INFO] hadoop-yarn-client ................................ SKIPPED
[INFO] hadoop-yarn-applications .......................... SKIPPED
[INFO] hadoop-yarn-applications-distributedshell ......... SKIPPED
[INFO] hadoop-yarn-applications-unmanaged-am-launcher .... SKIPPED
[INFO] hadoop-yarn-site .................................. SKIPPED
[INFO] hadoop-yarn-project ............................... SKIPPED
[INFO] ------------------------------------------------------------------------
[INFO] BUILD FAILURE
[INFO] ------------------------------------------------------------------------
[INFO] Total time: 6:26.255s
[INFO] Finished at: Mon Jan 28 10:39:21 UTC 2013
[INFO] Final Memory: 45M/779M
[INFO] ------------------------------------------------------------------------
[ERROR] Failed to execute goal org.apache.maven.plugins:maven-surefire-plugin:2.12.3:test
(default-test) on project hadoop-yarn-server-nodemanager: There are test failures.
[ERROR] 
[ERROR] Please refer to <https://builds.apache.org/job/Hadoop-Yarn-trunk/ws/trunk/hadoop-yarn-project/hadoop-yarn/hadoop-yarn-server/hadoop-yarn-server-nodemanager/target/surefire-reports>
for the individual test results.
[ERROR] -> [Help 1]
[ERROR] 
[ERROR] To see the full stack trace of the errors, re-run Maven with the -e switch.
[ERROR] Re-run Maven using the -X switch to enable full debug logging.
[ERROR] 
[ERROR] For more information about the errors and possible solutions, please read the following
articles:
[ERROR] [Help 1] http://cwiki.apache.org/confluence/display/MAVEN/MojoFailureException
[ERROR] 
[ERROR] After correcting the problems, you can resume the build with the command
[ERROR]   mvn <goals> -rf :hadoop-yarn-server-nodemanager
Build step 'Execute shell' marked build as failure
Archiving artifacts
Updating HDFS-4259
Updating HADOOP-9241

Mime
View raw message