hadoop-yarn-dev mailing list archives

Site index · List index
Message view « Date » · « Thread »
Top « Date » · « Thread »
From Apache Jenkins Server <jenk...@builds.apache.org>
Subject Failed: YARN-50 PreCommit Build #273
Date Thu, 03 Jan 2013 21:55:08 GMT
Jira: https://issues.apache.org/jira/browse/YARN-50
Build: https://builds.apache.org/job/PreCommit-YARN-Build/273/

###################################################################################
########################## LAST 60 LINES OF THE CONSOLE ###########################
[...truncated 6225 lines...]
                  org.apache.hadoop.mapreduce.v2.hs.webapp.TestHsWebServicesJobsQuery
                  org.apache.hadoop.mapreduce.v2.TestNonExistentJob
                  org.apache.hadoop.mapreduce.v2.TestMROldApiJobs
                  org.apache.hadoop.mapred.TestSpecialCharactersInOutputPath
                  org.apache.hadoop.mapreduce.lib.output.TestJobOutputCommitter
                  org.apache.hadoop.mapred.TestClusterMapReduceTestCase
                  org.apache.hadoop.mapred.TestJobName
                  org.apache.hadoop.mapreduce.v2.TestMiniMRProxyUser
                  org.apache.hadoop.mapreduce.v2.TestRMNMInfo
                  org.apache.hadoop.mapreduce.v2.TestUberAM
                  org.apache.hadoop.mapreduce.TestChild
                  org.apache.hadoop.mapred.TestReduceFetchFromPartialMem
                  org.apache.hadoop.mapreduce.v2.TestMRJobs
                  org.apache.hadoop.mapreduce.v2.TestMRAppWithCombiner
                  org.apache.hadoop.mapreduce.v2.TestMRJobsWithHistoryService
                  org.apache.hadoop.mapreduce.security.TestMRCredentials
                  org.apache.hadoop.mapred.TestMiniMRBringup
                  org.apache.hadoop.mapreduce.TestMapReduceLazyOutput
                  org.apache.hadoop.mapred.TestJobCleanup
                  org.apache.hadoop.mapred.TestBlockLimits
                  org.apache.hadoop.mapreduce.security.ssl.TestEncryptedShuffle
                  org.apache.hadoop.mapreduce.v2.TestSpeculativeExecution
                  org.apache.hadoop.conf.TestNoDefaultsJobConf
                  org.apache.hadoop.mapred.TestMiniMRChildTask
                  org.apache.hadoop.ipc.TestSocketFactory
                  org.apache.hadoop.mapreduce.security.TestBinaryTokenFile

    {color:green}+1 contrib tests{color}.  The patch passed contrib unit tests.

Test results: https://builds.apache.org/job/PreCommit-YARN-Build/273//testReport/
Console output: https://builds.apache.org/job/PreCommit-YARN-Build/273//console

This message is automatically generated.


======================================================================
======================================================================
    Adding comment to Jira.
======================================================================
======================================================================


Comment added.
64758090cc3a23cea71e2ccfd79f7c53156e7bfc logged out


======================================================================
======================================================================
    Finished build.
======================================================================
======================================================================


Build step 'Execute shell' marked build as failure
Archiving artifacts
[description-setter] Could not determine description.
Recording test results
Email was triggered for: Failure
Sending email for trigger: Failure



###################################################################################
############################## FAILED TESTS (if any) ##############################
45 tests failed.
FAILED:  org.apache.hadoop.mapreduce.v2.app.webapp.TestAMWebServicesJobs.testJobAttemptsDefault

Error Message:
unable to create new native thread

Stack Trace:
java.lang.OutOfMemoryError: unable to create new native thread
	at java.lang.Thread.start0(Native Method)
	at java.lang.Thread.start(Thread.java:640)
	at org.glassfish.grizzly.threadpool.AbstractThreadPool.startWorker(AbstractThreadPool.java:192)
	at org.glassfish.grizzly.threadpool.FixedThreadPool.doStartWorker(FixedThreadPool.java:82)
	at org.glassfish.grizzly.threadpool.FixedThreadPool.<init>(FixedThreadPool.java:71)
	at org.glassfish.grizzly.threadpool.GrizzlyExecutorService.setImpl(GrizzlyExecutorService.java:100)
	at org.glassfish.grizzly.threadpool.GrizzlyExecutorService.<init>(GrizzlyExecutorService.java:82)
	at org.glassfish.grizzly.threadpool.GrizzlyExecutorService.createInstance(GrizzlyExecutorService.java:78)
	at org.glassfish.grizzly.nio.transport.TCPNIOTransport.start(TCPNIOTransport.java:248)
	at org.glassfish.grizzly.http.server.NetworkListener.start(NetworkListener.java:555)
	at org.glassfish.grizzly.http.server.HttpServer.start(HttpServer.java:254)
	at com.sun.jersey.api.container.grizzly2.GrizzlyServerFactory.createHttpServer(GrizzlyServerFactory.java:326)
	at com.sun.jersey.api.container.grizzly2.GrizzlyServerFactory.createHttpServer(GrizzlyServerFactory.java:343)
	at com.sun.jersey.test.framework.spi.container.grizzly2.web.GrizzlyWebTestContainerFactory$GrizzlyWebTestContainer.instantiateGrizzlyWebServer(GrizzlyWebTestContainerFactory.java:219)
	at com.sun.jersey.test.framework.spi.container.grizzly2.web.GrizzlyWebTestContainerFactory$GrizzlyWebTestContainer.<init>(GrizzlyWebTestContainerFactory.java:129)
	at com.sun.jersey.test.framework.spi.container.grizzly2.web.GrizzlyWebTestContainerFactory$GrizzlyWebTestContainer.<init>(GrizzlyWebTestContainerFactory.java:86)
	at com.sun.jersey.test.framework.spi.container.grizzly2.web.GrizzlyWebTestContainerFactory.create(GrizzlyWebTestContainerFactory.java:79)
	at com.sun.jersey.test.framework.JerseyTest.getContainer(JerseyTest.java:342)
	at com.sun.jersey.test.framework.JerseyTest.<init>(JerseyTest.java:217)
	at org.apache.hadoop.mapreduce.v2.app.webapp.TestAMWebServicesJobs.<init>(TestAMWebServicesJobs.java:190)
	at sun.reflect.GeneratedConstructorAccessor132.newInstance(Unknown Source)
	at sun.reflect.DelegatingConstructorAccessorImpl.newInstance(DelegatingConstructorAccessorImpl.java:27)
	at java.lang.reflect.Constructor.newInstance(Constructor.java:513)
	at org.junit.runners.BlockJUnit4ClassRunner.createTest(BlockJUnit4ClassRunner.java:209)
	at org.junit.runners.BlockJUnit4ClassRunner$1.runReflectiveCall(BlockJUnit4ClassRunner.java:258)
	at org.junit.internal.runners.model.ReflectiveCallable.run(ReflectiveCallable.java:15)
	at org.junit.runners.BlockJUnit4ClassRunner.methodBlock(BlockJUnit4ClassRunner.java:255)
	at org.junit.runners.BlockJUnit4ClassRunner.runNotIgnored(BlockJUnit4ClassRunner.java:79)
	at org.junit.runners.BlockJUnit4ClassRunner.runChild(BlockJUnit4ClassRunner.java:71)
	at org.junit.runners.BlockJUnit4ClassRunner.runChild(BlockJUnit4ClassRunner.java:49)
	at org.junit.runners.ParentRunner$3.run(ParentRunner.java:193)
	at org.junit.runners.ParentRunner$1.schedule(ParentRunner.java:52)
	at org.junit.runners.ParentRunner.runChildren(ParentRunner.java:191)
	at org.junit.runners.ParentRunner.access$000(ParentRunner.java:42)
	at org.junit.runners.ParentRunner$2.evaluate(ParentRunner.java:184)
	at org.junit.runners.ParentRunner.run(ParentRunner.java:236)
	at org.apache.maven.surefire.junit4.JUnit4Provider.execute(JUnit4Provider.java:252)
	at org.apache.maven.surefire.junit4.JUnit4Provider.executeTestSet(JUnit4Provider.java:141)
	at org.apache.maven.surefire.junit4.JUnit4Provider.invoke(JUnit4Provider.java:112)
	at sun.reflect.NativeMethodAccessorImpl.invoke0(Native Method)
	at sun.reflect.NativeMethodAccessorImpl.invoke(NativeMethodAccessorImpl.java:39)
	at sun.reflect.DelegatingMethodAccessorImpl.invoke(DelegatingMethodAccessorImpl.java:25)
	at java.lang.reflect.Method.invoke(Method.java:597)
	at org.apache.maven.surefire.util.ReflectionUtils.invokeMethodWithArray(ReflectionUtils.java:189)
	at org.apache.maven.surefire.booter.ProviderFactory$ProviderProxy.invoke(ProviderFactory.java:165)
	at org.apache.maven.surefire.booter.ProviderFactory.invokeProvider(ProviderFactory.java:85)
	at org.apache.maven.surefire.booter.ForkedBooter.runSuitesInProcess(ForkedBooter.java:115)
	at org.apache.maven.surefire.booter.ForkedBooter.main(ForkedBooter.java:75)


FAILED:  org.apache.hadoop.mapreduce.v2.app.webapp.TestAMWebServicesJobs.testJobAttemptsXML

Error Message:
unable to create new native thread

Stack Trace:
java.lang.OutOfMemoryError: unable to create new native thread
	at java.lang.Thread.start0(Native Method)
	at java.lang.Thread.start(Thread.java:640)
	at java.util.concurrent.ThreadPoolExecutor.addIfUnderMaximumPoolSize(ThreadPoolExecutor.java:727)
	at java.util.concurrent.ThreadPoolExecutor.execute(ThreadPoolExecutor.java:657)
	at org.glassfish.grizzly.utils.DelayedExecutor.start(DelayedExecutor.java:83)
	at org.glassfish.grizzly.http.server.HttpServer.start(HttpServer.java:249)
	at com.sun.jersey.api.container.grizzly2.GrizzlyServerFactory.createHttpServer(GrizzlyServerFactory.java:326)
	at com.sun.jersey.api.container.grizzly2.GrizzlyServerFactory.createHttpServer(GrizzlyServerFactory.java:343)
	at com.sun.jersey.test.framework.spi.container.grizzly2.web.GrizzlyWebTestContainerFactory$GrizzlyWebTestContainer.instantiateGrizzlyWebServer(GrizzlyWebTestContainerFactory.java:219)
	at com.sun.jersey.test.framework.spi.container.grizzly2.web.GrizzlyWebTestContainerFactory$GrizzlyWebTestContainer.<init>(GrizzlyWebTestContainerFactory.java:129)
	at com.sun.jersey.test.framework.spi.container.grizzly2.web.GrizzlyWebTestContainerFactory$GrizzlyWebTestContainer.<init>(GrizzlyWebTestContainerFactory.java:86)
	at com.sun.jersey.test.framework.spi.container.grizzly2.web.GrizzlyWebTestContainerFactory.create(GrizzlyWebTestContainerFactory.java:79)
	at com.sun.jersey.test.framework.JerseyTest.getContainer(JerseyTest.java:342)
	at com.sun.jersey.test.framework.JerseyTest.<init>(JerseyTest.java:217)
	at org.apache.hadoop.mapreduce.v2.app.webapp.TestAMWebServicesJobs.<init>(TestAMWebServicesJobs.java:190)
	at sun.reflect.GeneratedConstructorAccessor132.newInstance(Unknown Source)
	at sun.reflect.DelegatingConstructorAccessorImpl.newInstance(DelegatingConstructorAccessorImpl.java:27)
	at java.lang.reflect.Constructor.newInstance(Constructor.java:513)
	at org.junit.runners.BlockJUnit4ClassRunner.createTest(BlockJUnit4ClassRunner.java:209)
	at org.junit.runners.BlockJUnit4ClassRunner$1.runReflectiveCall(BlockJUnit4ClassRunner.java:258)
	at org.junit.internal.runners.model.ReflectiveCallable.run(ReflectiveCallable.java:15)
	at org.junit.runners.BlockJUnit4ClassRunner.methodBlock(BlockJUnit4ClassRunner.java:255)
	at org.junit.runners.BlockJUnit4ClassRunner.runNotIgnored(BlockJUnit4ClassRunner.java:79)
	at org.junit.runners.BlockJUnit4ClassRunner.runChild(BlockJUnit4ClassRunner.java:71)
	at org.junit.runners.BlockJUnit4ClassRunner.runChild(BlockJUnit4ClassRunner.java:49)
	at org.junit.runners.ParentRunner$3.run(ParentRunner.java:193)
	at org.junit.runners.ParentRunner$1.schedule(ParentRunner.java:52)
	at org.junit.runners.ParentRunner.runChildren(ParentRunner.java:191)
	at org.junit.runners.ParentRunner.access$000(ParentRunner.java:42)
	at org.junit.runners.ParentRunner$2.evaluate(ParentRunner.java:184)
	at org.junit.runners.ParentRunner.run(ParentRunner.java:236)
	at org.apache.maven.surefire.junit4.JUnit4Provider.execute(JUnit4Provider.java:252)
	at org.apache.maven.surefire.junit4.JUnit4Provider.executeTestSet(JUnit4Provider.java:141)
	at org.apache.maven.surefire.junit4.JUnit4Provider.invoke(JUnit4Provider.java:112)
	at sun.reflect.NativeMethodAccessorImpl.invoke0(Native Method)
	at sun.reflect.NativeMethodAccessorImpl.invoke(NativeMethodAccessorImpl.java:39)
	at sun.reflect.DelegatingMethodAccessorImpl.invoke(DelegatingMethodAccessorImpl.java:25)
	at java.lang.reflect.Method.invoke(Method.java:597)
	at org.apache.maven.surefire.util.ReflectionUtils.invokeMethodWithArray(ReflectionUtils.java:189)
	at org.apache.maven.surefire.booter.ProviderFactory$ProviderProxy.invoke(ProviderFactory.java:165)
	at org.apache.maven.surefire.booter.ProviderFactory.invokeProvider(ProviderFactory.java:85)
	at org.apache.maven.surefire.booter.ForkedBooter.runSuitesInProcess(ForkedBooter.java:115)
	at org.apache.maven.surefire.booter.ForkedBooter.main(ForkedBooter.java:75)


FAILED:  org.apache.hadoop.mapreduce.v2.app.webapp.TestAMWebServicesTasks.testJobTaskCountersXML

Error Message:
unable to create new native thread

Stack Trace:
java.lang.OutOfMemoryError: unable to create new native thread
	at java.lang.Thread.start0(Native Method)
	at java.lang.Thread.start(Thread.java:640)
	at org.glassfish.grizzly.threadpool.AbstractThreadPool.startWorker(AbstractThreadPool.java:192)
	at org.glassfish.grizzly.threadpool.FixedThreadPool.doStartWorker(FixedThreadPool.java:82)
	at org.glassfish.grizzly.threadpool.FixedThreadPool.<init>(FixedThreadPool.java:71)
	at org.glassfish.grizzly.threadpool.GrizzlyExecutorService.setImpl(GrizzlyExecutorService.java:100)
	at org.glassfish.grizzly.threadpool.GrizzlyExecutorService.<init>(GrizzlyExecutorService.java:82)
	at org.glassfish.grizzly.threadpool.GrizzlyExecutorService.createInstance(GrizzlyExecutorService.java:78)
	at org.glassfish.grizzly.nio.transport.TCPNIOTransport.start(TCPNIOTransport.java:248)
	at org.glassfish.grizzly.http.server.NetworkListener.start(NetworkListener.java:555)
	at org.glassfish.grizzly.http.server.HttpServer.start(HttpServer.java:254)
	at com.sun.jersey.api.container.grizzly2.GrizzlyServerFactory.createHttpServer(GrizzlyServerFactory.java:326)
	at com.sun.jersey.api.container.grizzly2.GrizzlyServerFactory.createHttpServer(GrizzlyServerFactory.java:343)
	at com.sun.jersey.test.framework.spi.container.grizzly2.web.GrizzlyWebTestContainerFactory$GrizzlyWebTestContainer.instantiateGrizzlyWebServer(GrizzlyWebTestContainerFactory.java:219)
	at com.sun.jersey.test.framework.spi.container.grizzly2.web.GrizzlyWebTestContainerFactory$GrizzlyWebTestContainer.<init>(GrizzlyWebTestContainerFactory.java:129)
	at com.sun.jersey.test.framework.spi.container.grizzly2.web.GrizzlyWebTestContainerFactory$GrizzlyWebTestContainer.<init>(GrizzlyWebTestContainerFactory.java:86)
	at com.sun.jersey.test.framework.spi.container.grizzly2.web.GrizzlyWebTestContainerFactory.create(GrizzlyWebTestContainerFactory.java:79)
	at com.sun.jersey.test.framework.JerseyTest.getContainer(JerseyTest.java:342)
	at com.sun.jersey.test.framework.JerseyTest.<init>(JerseyTest.java:217)
	at org.apache.hadoop.mapreduce.v2.app.webapp.TestAMWebServicesTasks.<init>(TestAMWebServicesTasks.java:184)
	at sun.reflect.GeneratedConstructorAccessor133.newInstance(Unknown Source)
	at sun.reflect.DelegatingConstructorAccessorImpl.newInstance(DelegatingConstructorAccessorImpl.java:27)
	at java.lang.reflect.Constructor.newInstance(Constructor.java:513)
	at org.junit.runners.BlockJUnit4ClassRunner.createTest(BlockJUnit4ClassRunner.java:209)
	at org.junit.runners.BlockJUnit4ClassRunner$1.runReflectiveCall(BlockJUnit4ClassRunner.java:258)
	at org.junit.internal.runners.model.ReflectiveCallable.run(ReflectiveCallable.java:15)
	at org.junit.runners.BlockJUnit4ClassRunner.methodBlock(BlockJUnit4ClassRunner.java:255)
	at org.junit.runners.BlockJUnit4ClassRunner.runNotIgnored(BlockJUnit4ClassRunner.java:79)
	at org.junit.runners.BlockJUnit4ClassRunner.runChild(BlockJUnit4ClassRunner.java:71)
	at org.junit.runners.BlockJUnit4ClassRunner.runChild(BlockJUnit4ClassRunner.java:49)
	at org.junit.runners.ParentRunner$3.run(ParentRunner.java:193)
	at org.junit.runners.ParentRunner$1.schedule(ParentRunner.java:52)
	at org.junit.runners.ParentRunner.runChildren(ParentRunner.java:191)
	at org.junit.runners.ParentRunner.access$000(ParentRunner.java:42)
	at org.junit.runners.ParentRunner$2.evaluate(ParentRunner.java:184)
	at org.junit.runners.ParentRunner.run(ParentRunner.java:236)
	at org.apache.maven.surefire.junit4.JUnit4Provider.execute(JUnit4Provider.java:252)
	at org.apache.maven.surefire.junit4.JUnit4Provider.executeTestSet(JUnit4Provider.java:141)
	at org.apache.maven.surefire.junit4.JUnit4Provider.invoke(JUnit4Provider.java:112)
	at sun.reflect.NativeMethodAccessorImpl.invoke0(Native Method)
	at sun.reflect.NativeMethodAccessorImpl.invoke(NativeMethodAccessorImpl.java:39)
	at sun.reflect.DelegatingMethodAccessorImpl.invoke(DelegatingMethodAccessorImpl.java:25)
	at java.lang.reflect.Method.invoke(Method.java:597)
	at org.apache.maven.surefire.util.ReflectionUtils.invokeMethodWithArray(ReflectionUtils.java:189)
	at org.apache.maven.surefire.booter.ProviderFactory$ProviderProxy.invoke(ProviderFactory.java:165)
	at org.apache.maven.surefire.booter.ProviderFactory.invokeProvider(ProviderFactory.java:85)
	at org.apache.maven.surefire.booter.ForkedBooter.runSuitesInProcess(ForkedBooter.java:115)
	at org.apache.maven.surefire.booter.ForkedBooter.main(ForkedBooter.java:75)


FAILED:  org.apache.hadoop.mapreduce.v2.hs.webapp.TestHsWebServicesJobs.testJobAttemptsSlash

Error Message:
unable to create new native thread

Stack Trace:
java.lang.OutOfMemoryError: unable to create new native thread
	at java.lang.Thread.start0(Native Method)
	at java.lang.Thread.start(Thread.java:640)
	at org.glassfish.grizzly.threadpool.AbstractThreadPool.startWorker(AbstractThreadPool.java:192)
	at org.glassfish.grizzly.threadpool.FixedThreadPool.doStartWorker(FixedThreadPool.java:82)
	at org.glassfish.grizzly.threadpool.FixedThreadPool.<init>(FixedThreadPool.java:71)
	at org.glassfish.grizzly.threadpool.GrizzlyExecutorService.setImpl(GrizzlyExecutorService.java:100)
	at org.glassfish.grizzly.threadpool.GrizzlyExecutorService.<init>(GrizzlyExecutorService.java:82)
	at org.glassfish.grizzly.threadpool.GrizzlyExecutorService.createInstance(GrizzlyExecutorService.java:78)
	at org.glassfish.grizzly.nio.transport.TCPNIOTransport.start(TCPNIOTransport.java:248)
	at org.glassfish.grizzly.http.server.NetworkListener.start(NetworkListener.java:555)
	at org.glassfish.grizzly.http.server.HttpServer.start(HttpServer.java:254)
	at com.sun.jersey.api.container.grizzly2.GrizzlyServerFactory.createHttpServer(GrizzlyServerFactory.java:326)
	at com.sun.jersey.api.container.grizzly2.GrizzlyServerFactory.createHttpServer(GrizzlyServerFactory.java:343)
	at com.sun.jersey.test.framework.spi.container.grizzly2.web.GrizzlyWebTestContainerFactory$GrizzlyWebTestContainer.instantiateGrizzlyWebServer(GrizzlyWebTestContainerFactory.java:219)
	at com.sun.jersey.test.framework.spi.container.grizzly2.web.GrizzlyWebTestContainerFactory$GrizzlyWebTestContainer.<init>(GrizzlyWebTestContainerFactory.java:129)
	at com.sun.jersey.test.framework.spi.container.grizzly2.web.GrizzlyWebTestContainerFactory$GrizzlyWebTestContainer.<init>(GrizzlyWebTestContainerFactory.java:86)
	at com.sun.jersey.test.framework.spi.container.grizzly2.web.GrizzlyWebTestContainerFactory.create(GrizzlyWebTestContainerFactory.java:79)
	at com.sun.jersey.test.framework.JerseyTest.getContainer(JerseyTest.java:342)
	at com.sun.jersey.test.framework.JerseyTest.<init>(JerseyTest.java:217)
	at org.apache.hadoop.mapreduce.v2.hs.webapp.TestHsWebServicesJobs.<init>(TestHsWebServicesJobs.java:234)
	at sun.reflect.GeneratedConstructorAccessor145.newInstance(Unknown Source)
	at sun.reflect.DelegatingConstructorAccessorImpl.newInstance(DelegatingConstructorAccessorImpl.java:27)
	at java.lang.reflect.Constructor.newInstance(Constructor.java:513)
	at org.junit.runners.BlockJUnit4ClassRunner.createTest(BlockJUnit4ClassRunner.java:209)
	at org.junit.runners.BlockJUnit4ClassRunner$1.runReflectiveCall(BlockJUnit4ClassRunner.java:258)
	at org.junit.internal.runners.model.ReflectiveCallable.run(ReflectiveCallable.java:15)
	at org.junit.runners.BlockJUnit4ClassRunner.methodBlock(BlockJUnit4ClassRunner.java:255)
	at org.junit.runners.BlockJUnit4ClassRunner.runNotIgnored(BlockJUnit4ClassRunner.java:79)
	at org.junit.runners.BlockJUnit4ClassRunner.runChild(BlockJUnit4ClassRunner.java:71)
	at org.junit.runners.BlockJUnit4ClassRunner.runChild(BlockJUnit4ClassRunner.java:49)
	at org.junit.runners.ParentRunner$3.run(ParentRunner.java:193)
	at org.junit.runners.ParentRunner$1.schedule(ParentRunner.java:52)
	at org.junit.runners.ParentRunner.runChildren(ParentRunner.java:191)
	at org.junit.runners.ParentRunner.access$000(ParentRunner.java:42)
	at org.junit.runners.ParentRunner$2.evaluate(ParentRunner.java:184)
	at org.junit.runners.ParentRunner.run(ParentRunner.java:236)
	at org.apache.maven.surefire.junit4.JUnit4Provider.execute(JUnit4Provider.java:252)
	at org.apache.maven.surefire.junit4.JUnit4Provider.executeTestSet(JUnit4Provider.java:141)
	at org.apache.maven.surefire.junit4.JUnit4Provider.invoke(JUnit4Provider.java:112)
	at sun.reflect.NativeMethodAccessorImpl.invoke0(Native Method)
	at sun.reflect.NativeMethodAccessorImpl.invoke(NativeMethodAccessorImpl.java:39)
	at sun.reflect.DelegatingMethodAccessorImpl.invoke(DelegatingMethodAccessorImpl.java:25)
	at java.lang.reflect.Method.invoke(Method.java:597)
	at org.apache.maven.surefire.util.ReflectionUtils.invokeMethodWithArray(ReflectionUtils.java:189)
	at org.apache.maven.surefire.booter.ProviderFactory$ProviderProxy.invoke(ProviderFactory.java:165)
	at org.apache.maven.surefire.booter.ProviderFactory.invokeProvider(ProviderFactory.java:85)
	at org.apache.maven.surefire.booter.ForkedBooter.runSuitesInProcess(ForkedBooter.java:115)
	at org.apache.maven.surefire.booter.ForkedBooter.main(ForkedBooter.java:75)


FAILED:  org.apache.hadoop.mapreduce.v2.hs.webapp.TestHsWebServicesJobs.testJobAttemptsDefault

Error Message:
unable to create new native thread

Stack Trace:
java.lang.OutOfMemoryError: unable to create new native thread
	at java.lang.Thread.start0(Native Method)
	at java.lang.Thread.start(Thread.java:640)
	at java.util.concurrent.ThreadPoolExecutor.addIfUnderMaximumPoolSize(ThreadPoolExecutor.java:727)
	at java.util.concurrent.ThreadPoolExecutor.execute(ThreadPoolExecutor.java:657)
	at org.glassfish.grizzly.utils.DelayedExecutor.start(DelayedExecutor.java:83)
	at org.glassfish.grizzly.http.server.HttpServer.start(HttpServer.java:249)
	at com.sun.jersey.api.container.grizzly2.GrizzlyServerFactory.createHttpServer(GrizzlyServerFactory.java:326)
	at com.sun.jersey.api.container.grizzly2.GrizzlyServerFactory.createHttpServer(GrizzlyServerFactory.java:343)
	at com.sun.jersey.test.framework.spi.container.grizzly2.web.GrizzlyWebTestContainerFactory$GrizzlyWebTestContainer.instantiateGrizzlyWebServer(GrizzlyWebTestContainerFactory.java:219)
	at com.sun.jersey.test.framework.spi.container.grizzly2.web.GrizzlyWebTestContainerFactory$GrizzlyWebTestContainer.<init>(GrizzlyWebTestContainerFactory.java:129)
	at com.sun.jersey.test.framework.spi.container.grizzly2.web.GrizzlyWebTestContainerFactory$GrizzlyWebTestContainer.<init>(GrizzlyWebTestContainerFactory.java:86)
	at com.sun.jersey.test.framework.spi.container.grizzly2.web.GrizzlyWebTestContainerFactory.create(GrizzlyWebTestContainerFactory.java:79)
	at com.sun.jersey.test.framework.JerseyTest.getContainer(JerseyTest.java:342)
	at com.sun.jersey.test.framework.JerseyTest.<init>(JerseyTest.java:217)
	at org.apache.hadoop.mapreduce.v2.hs.webapp.TestHsWebServicesJobs.<init>(TestHsWebServicesJobs.java:234)
	at sun.reflect.GeneratedConstructorAccessor145.newInstance(Unknown Source)
	at sun.reflect.DelegatingConstructorAccessorImpl.newInstance(DelegatingConstructorAccessorImpl.java:27)
	at java.lang.reflect.Constructor.newInstance(Constructor.java:513)
	at org.junit.runners.BlockJUnit4ClassRunner.createTest(BlockJUnit4ClassRunner.java:209)
	at org.junit.runners.BlockJUnit4ClassRunner$1.runReflectiveCall(BlockJUnit4ClassRunner.java:258)
	at org.junit.internal.runners.model.ReflectiveCallable.run(ReflectiveCallable.java:15)
	at org.junit.runners.BlockJUnit4ClassRunner.methodBlock(BlockJUnit4ClassRunner.java:255)
	at org.junit.runners.BlockJUnit4ClassRunner.runNotIgnored(BlockJUnit4ClassRunner.java:79)
	at org.junit.runners.BlockJUnit4ClassRunner.runChild(BlockJUnit4ClassRunner.java:71)
	at org.junit.runners.BlockJUnit4ClassRunner.runChild(BlockJUnit4ClassRunner.java:49)
	at org.junit.runners.ParentRunner$3.run(ParentRunner.java:193)
	at org.junit.runners.ParentRunner$1.schedule(ParentRunner.java:52)
	at org.junit.runners.ParentRunner.runChildren(ParentRunner.java:191)
	at org.junit.runners.ParentRunner.access$000(ParentRunner.java:42)
	at org.junit.runners.ParentRunner$2.evaluate(ParentRunner.java:184)
	at org.junit.runners.ParentRunner.run(ParentRunner.java:236)
	at org.apache.maven.surefire.junit4.JUnit4Provider.execute(JUnit4Provider.java:252)
	at org.apache.maven.surefire.junit4.JUnit4Provider.executeTestSet(JUnit4Provider.java:141)
	at org.apache.maven.surefire.junit4.JUnit4Provider.invoke(JUnit4Provider.java:112)
	at sun.reflect.NativeMethodAccessorImpl.invoke0(Native Method)
	at sun.reflect.NativeMethodAccessorImpl.invoke(NativeMethodAccessorImpl.java:39)
	at sun.reflect.DelegatingMethodAccessorImpl.invoke(DelegatingMethodAccessorImpl.java:25)
	at java.lang.reflect.Method.invoke(Method.java:597)
	at org.apache.maven.surefire.util.ReflectionUtils.invokeMethodWithArray(ReflectionUtils.java:189)
	at org.apache.maven.surefire.booter.ProviderFactory$ProviderProxy.invoke(ProviderFactory.java:165)
	at org.apache.maven.surefire.booter.ProviderFactory.invokeProvider(ProviderFactory.java:85)
	at org.apache.maven.surefire.booter.ForkedBooter.runSuitesInProcess(ForkedBooter.java:115)
	at org.apache.maven.surefire.booter.ForkedBooter.main(ForkedBooter.java:75)


FAILED:  org.apache.hadoop.mapreduce.v2.hs.webapp.TestHsWebServicesJobs.testJobAttemptsXML

Error Message:
unable to create new native thread

Stack Trace:
java.lang.OutOfMemoryError: unable to create new native thread
	at java.lang.Thread.start0(Native Method)
	at java.lang.Thread.start(Thread.java:640)
	at java.util.concurrent.ThreadPoolExecutor.addIfUnderMaximumPoolSize(ThreadPoolExecutor.java:727)
	at java.util.concurrent.ThreadPoolExecutor.execute(ThreadPoolExecutor.java:657)
	at org.glassfish.grizzly.utils.DelayedExecutor.start(DelayedExecutor.java:83)
	at org.glassfish.grizzly.http.server.HttpServer.start(HttpServer.java:249)
	at com.sun.jersey.api.container.grizzly2.GrizzlyServerFactory.createHttpServer(GrizzlyServerFactory.java:326)
	at com.sun.jersey.api.container.grizzly2.GrizzlyServerFactory.createHttpServer(GrizzlyServerFactory.java:343)
	at com.sun.jersey.test.framework.spi.container.grizzly2.web.GrizzlyWebTestContainerFactory$GrizzlyWebTestContainer.instantiateGrizzlyWebServer(GrizzlyWebTestContainerFactory.java:219)
	at com.sun.jersey.test.framework.spi.container.grizzly2.web.GrizzlyWebTestContainerFactory$GrizzlyWebTestContainer.<init>(GrizzlyWebTestContainerFactory.java:129)
	at com.sun.jersey.test.framework.spi.container.grizzly2.web.GrizzlyWebTestContainerFactory$GrizzlyWebTestContainer.<init>(GrizzlyWebTestContainerFactory.java:86)
	at com.sun.jersey.test.framework.spi.container.grizzly2.web.GrizzlyWebTestContainerFactory.create(GrizzlyWebTestContainerFactory.java:79)
	at com.sun.jersey.test.framework.JerseyTest.getContainer(JerseyTest.java:342)
	at com.sun.jersey.test.framework.JerseyTest.<init>(JerseyTest.java:217)
	at org.apache.hadoop.mapreduce.v2.hs.webapp.TestHsWebServicesJobs.<init>(TestHsWebServicesJobs.java:234)
	at sun.reflect.GeneratedConstructorAccessor145.newInstance(Unknown Source)
	at sun.reflect.DelegatingConstructorAccessorImpl.newInstance(DelegatingConstructorAccessorImpl.java:27)
	at java.lang.reflect.Constructor.newInstance(Constructor.java:513)
	at org.junit.runners.BlockJUnit4ClassRunner.createTest(BlockJUnit4ClassRunner.java:209)
	at org.junit.runners.BlockJUnit4ClassRunner$1.runReflectiveCall(BlockJUnit4ClassRunner.java:258)
	at org.junit.internal.runners.model.ReflectiveCallable.run(ReflectiveCallable.java:15)
	at org.junit.runners.BlockJUnit4ClassRunner.methodBlock(BlockJUnit4ClassRunner.java:255)
	at org.junit.runners.BlockJUnit4ClassRunner.runNotIgnored(BlockJUnit4ClassRunner.java:79)
	at org.junit.runners.BlockJUnit4ClassRunner.runChild(BlockJUnit4ClassRunner.java:71)
	at org.junit.runners.BlockJUnit4ClassRunner.runChild(BlockJUnit4ClassRunner.java:49)
	at org.junit.runners.ParentRunner$3.run(ParentRunner.java:193)
	at org.junit.runners.ParentRunner$1.schedule(ParentRunner.java:52)
	at org.junit.runners.ParentRunner.runChildren(ParentRunner.java:191)
	at org.junit.runners.ParentRunner.access$000(ParentRunner.java:42)
	at org.junit.runners.ParentRunner$2.evaluate(ParentRunner.java:184)
	at org.junit.runners.ParentRunner.run(ParentRunner.java:236)
	at org.apache.maven.surefire.junit4.JUnit4Provider.execute(JUnit4Provider.java:252)
	at org.apache.maven.surefire.junit4.JUnit4Provider.executeTestSet(JUnit4Provider.java:141)
	at org.apache.maven.surefire.junit4.JUnit4Provider.invoke(JUnit4Provider.java:112)
	at sun.reflect.NativeMethodAccessorImpl.invoke0(Native Method)
	at sun.reflect.NativeMethodAccessorImpl.invoke(NativeMethodAccessorImpl.java:39)
	at sun.reflect.DelegatingMethodAccessorImpl.invoke(DelegatingMethodAccessorImpl.java:25)
	at java.lang.reflect.Method.invoke(Method.java:597)
	at org.apache.maven.surefire.util.ReflectionUtils.invokeMethodWithArray(ReflectionUtils.java:189)
	at org.apache.maven.surefire.booter.ProviderFactory$ProviderProxy.invoke(ProviderFactory.java:165)
	at org.apache.maven.surefire.booter.ProviderFactory.invokeProvider(ProviderFactory.java:85)
	at org.apache.maven.surefire.booter.ForkedBooter.runSuitesInProcess(ForkedBooter.java:115)
	at org.apache.maven.surefire.booter.ForkedBooter.main(ForkedBooter.java:75)


FAILED:  org.apache.hadoop.mapreduce.v2.hs.webapp.TestHsWebServicesJobsQuery.testJobsQueryFinishTimeBeginEndInvalid

Error Message:
unable to create new native thread

Stack Trace:
java.lang.OutOfMemoryError: unable to create new native thread
	at java.lang.Thread.start0(Native Method)
	at java.lang.Thread.start(Thread.java:640)
	at org.glassfish.grizzly.threadpool.AbstractThreadPool.startWorker(AbstractThreadPool.java:192)
	at org.glassfish.grizzly.threadpool.FixedThreadPool.doStartWorker(FixedThreadPool.java:82)
	at org.glassfish.grizzly.threadpool.FixedThreadPool.<init>(FixedThreadPool.java:71)
	at org.glassfish.grizzly.threadpool.GrizzlyExecutorService.setImpl(GrizzlyExecutorService.java:100)
	at org.glassfish.grizzly.threadpool.GrizzlyExecutorService.<init>(GrizzlyExecutorService.java:82)
	at org.glassfish.grizzly.threadpool.GrizzlyExecutorService.createInstance(GrizzlyExecutorService.java:78)
	at org.glassfish.grizzly.nio.transport.TCPNIOTransport.start(TCPNIOTransport.java:248)
	at org.glassfish.grizzly.http.server.NetworkListener.start(NetworkListener.java:555)
	at org.glassfish.grizzly.http.server.HttpServer.start(HttpServer.java:254)
	at com.sun.jersey.api.container.grizzly2.GrizzlyServerFactory.createHttpServer(GrizzlyServerFactory.java:326)
	at com.sun.jersey.api.container.grizzly2.GrizzlyServerFactory.createHttpServer(GrizzlyServerFactory.java:343)
	at com.sun.jersey.test.framework.spi.container.grizzly2.web.GrizzlyWebTestContainerFactory$GrizzlyWebTestContainer.instantiateGrizzlyWebServer(GrizzlyWebTestContainerFactory.java:219)
	at com.sun.jersey.test.framework.spi.container.grizzly2.web.GrizzlyWebTestContainerFactory$GrizzlyWebTestContainer.<init>(GrizzlyWebTestContainerFactory.java:129)
	at com.sun.jersey.test.framework.spi.container.grizzly2.web.GrizzlyWebTestContainerFactory$GrizzlyWebTestContainer.<init>(GrizzlyWebTestContainerFactory.java:86)
	at com.sun.jersey.test.framework.spi.container.grizzly2.web.GrizzlyWebTestContainerFactory.create(GrizzlyWebTestContainerFactory.java:79)
	at com.sun.jersey.test.framework.JerseyTest.getContainer(JerseyTest.java:342)
	at com.sun.jersey.test.framework.JerseyTest.<init>(JerseyTest.java:217)
	at org.apache.hadoop.mapreduce.v2.hs.webapp.TestHsWebServicesJobsQuery.<init>(TestHsWebServicesJobsQuery.java:211)
	at sun.reflect.GeneratedConstructorAccessor145.newInstance(Unknown Source)
	at sun.reflect.DelegatingConstructorAccessorImpl.newInstance(DelegatingConstructorAccessorImpl.java:27)
	at java.lang.reflect.Constructor.newInstance(Constructor.java:513)
	at org.junit.runners.BlockJUnit4ClassRunner.createTest(BlockJUnit4ClassRunner.java:209)
	at org.junit.runners.BlockJUnit4ClassRunner$1.runReflectiveCall(BlockJUnit4ClassRunner.java:258)
	at org.junit.internal.runners.model.ReflectiveCallable.run(ReflectiveCallable.java:15)
	at org.junit.runners.BlockJUnit4ClassRunner.methodBlock(BlockJUnit4ClassRunner.java:255)
	at org.junit.runners.BlockJUnit4ClassRunner.runNotIgnored(BlockJUnit4ClassRunner.java:79)
	at org.junit.runners.BlockJUnit4ClassRunner.runChild(BlockJUnit4ClassRunner.java:71)
	at org.junit.runners.BlockJUnit4ClassRunner.runChild(BlockJUnit4ClassRunner.java:49)
	at org.junit.runners.ParentRunner$3.run(ParentRunner.java:193)
	at org.junit.runners.ParentRunner$1.schedule(ParentRunner.java:52)
	at org.junit.runners.ParentRunner.runChildren(ParentRunner.java:191)
	at org.junit.runners.ParentRunner.access$000(ParentRunner.java:42)
	at org.junit.runners.ParentRunner$2.evaluate(ParentRunner.java:184)
	at org.junit.runners.ParentRunner.run(ParentRunner.java:236)
	at org.apache.maven.surefire.junit4.JUnit4Provider.execute(JUnit4Provider.java:252)
	at org.apache.maven.surefire.junit4.JUnit4Provider.executeTestSet(JUnit4Provider.java:141)
	at org.apache.maven.surefire.junit4.JUnit4Provider.invoke(JUnit4Provider.java:112)
	at sun.reflect.NativeMethodAccessorImpl.invoke0(Native Method)
	at sun.reflect.NativeMethodAccessorImpl.invoke(NativeMethodAccessorImpl.java:39)
	at sun.reflect.DelegatingMethodAccessorImpl.invoke(DelegatingMethodAccessorImpl.java:25)
	at java.lang.reflect.Method.invoke(Method.java:597)
	at org.apache.maven.surefire.util.ReflectionUtils.invokeMethodWithArray(ReflectionUtils.java:189)
	at org.apache.maven.surefire.booter.ProviderFactory$ProviderProxy.invoke(ProviderFactory.java:165)
	at org.apache.maven.surefire.booter.ProviderFactory.invokeProvider(ProviderFactory.java:85)
	at org.apache.maven.surefire.booter.ForkedBooter.runSuitesInProcess(ForkedBooter.java:115)
	at org.apache.maven.surefire.booter.ForkedBooter.main(ForkedBooter.java:75)


FAILED:  org.apache.hadoop.mapreduce.v2.hs.webapp.TestHsWebServicesJobsQuery.testJobsQueryFinishTimeInvalidformat

Error Message:
unable to create new native thread

Stack Trace:
java.lang.OutOfMemoryError: unable to create new native thread
	at java.lang.Thread.start0(Native Method)
	at java.lang.Thread.start(Thread.java:640)
	at java.util.concurrent.ThreadPoolExecutor.addIfUnderMaximumPoolSize(ThreadPoolExecutor.java:727)
	at java.util.concurrent.ThreadPoolExecutor.execute(ThreadPoolExecutor.java:657)
	at org.glassfish.grizzly.utils.DelayedExecutor.start(DelayedExecutor.java:83)
	at org.glassfish.grizzly.http.server.HttpServer.start(HttpServer.java:249)
	at com.sun.jersey.api.container.grizzly2.GrizzlyServerFactory.createHttpServer(GrizzlyServerFactory.java:326)
	at com.sun.jersey.api.container.grizzly2.GrizzlyServerFactory.createHttpServer(GrizzlyServerFactory.java:343)
	at com.sun.jersey.test.framework.spi.container.grizzly2.web.GrizzlyWebTestContainerFactory$GrizzlyWebTestContainer.instantiateGrizzlyWebServer(GrizzlyWebTestContainerFactory.java:219)
	at com.sun.jersey.test.framework.spi.container.grizzly2.web.GrizzlyWebTestContainerFactory$GrizzlyWebTestContainer.<init>(GrizzlyWebTestContainerFactory.java:129)
	at com.sun.jersey.test.framework.spi.container.grizzly2.web.GrizzlyWebTestContainerFactory$GrizzlyWebTestContainer.<init>(GrizzlyWebTestContainerFactory.java:86)
	at com.sun.jersey.test.framework.spi.container.grizzly2.web.GrizzlyWebTestContainerFactory.create(GrizzlyWebTestContainerFactory.java:79)
	at com.sun.jersey.test.framework.JerseyTest.getContainer(JerseyTest.java:342)
	at com.sun.jersey.test.framework.JerseyTest.<init>(JerseyTest.java:217)
	at org.apache.hadoop.mapreduce.v2.hs.webapp.TestHsWebServicesJobsQuery.<init>(TestHsWebServicesJobsQuery.java:211)
	at sun.reflect.GeneratedConstructorAccessor145.newInstance(Unknown Source)
	at sun.reflect.DelegatingConstructorAccessorImpl.newInstance(DelegatingConstructorAccessorImpl.java:27)
	at java.lang.reflect.Constructor.newInstance(Constructor.java:513)
	at org.junit.runners.BlockJUnit4ClassRunner.createTest(BlockJUnit4ClassRunner.java:209)
	at org.junit.runners.BlockJUnit4ClassRunner$1.runReflectiveCall(BlockJUnit4ClassRunner.java:258)
	at org.junit.internal.runners.model.ReflectiveCallable.run(ReflectiveCallable.java:15)
	at org.junit.runners.BlockJUnit4ClassRunner.methodBlock(BlockJUnit4ClassRunner.java:255)
	at org.junit.runners.BlockJUnit4ClassRunner.runNotIgnored(BlockJUnit4ClassRunner.java:79)
	at org.junit.runners.BlockJUnit4ClassRunner.runChild(BlockJUnit4ClassRunner.java:71)
	at org.junit.runners.BlockJUnit4ClassRunner.runChild(BlockJUnit4ClassRunner.java:49)
	at org.junit.runners.ParentRunner$3.run(ParentRunner.java:193)
	at org.junit.runners.ParentRunner$1.schedule(ParentRunner.java:52)
	at org.junit.runners.ParentRunner.runChildren(ParentRunner.java:191)
	at org.junit.runners.ParentRunner.access$000(ParentRunner.java:42)
	at org.junit.runners.ParentRunner$2.evaluate(ParentRunner.java:184)
	at org.junit.runners.ParentRunner.run(ParentRunner.java:236)
	at org.apache.maven.surefire.junit4.JUnit4Provider.execute(JUnit4Provider.java:252)
	at org.apache.maven.surefire.junit4.JUnit4Provider.executeTestSet(JUnit4Provider.java:141)
	at org.apache.maven.surefire.junit4.JUnit4Provider.invoke(JUnit4Provider.java:112)
	at sun.reflect.NativeMethodAccessorImpl.invoke0(Native Method)
	at sun.reflect.NativeMethodAccessorImpl.invoke(NativeMethodAccessorImpl.java:39)
	at sun.reflect.DelegatingMethodAccessorImpl.invoke(DelegatingMethodAccessorImpl.java:25)
	at java.lang.reflect.Method.invoke(Method.java:597)
	at org.apache.maven.surefire.util.ReflectionUtils.invokeMethodWithArray(ReflectionUtils.java:189)
	at org.apache.maven.surefire.booter.ProviderFactory$ProviderProxy.invoke(ProviderFactory.java:165)
	at org.apache.maven.surefire.booter.ProviderFactory.invokeProvider(ProviderFactory.java:85)
	at org.apache.maven.surefire.booter.ForkedBooter.runSuitesInProcess(ForkedBooter.java:115)
	at org.apache.maven.surefire.booter.ForkedBooter.main(ForkedBooter.java:75)


FAILED:  org.apache.hadoop.mapreduce.v2.hs.webapp.TestHsWebServicesJobsQuery.testJobsQueryFinishTimeEndInvalidformat

Error Message:
unable to create new native thread

Stack Trace:
java.lang.OutOfMemoryError: unable to create new native thread
	at java.lang.Thread.start0(Native Method)
	at java.lang.Thread.start(Thread.java:640)
	at java.util.concurrent.ThreadPoolExecutor.addIfUnderMaximumPoolSize(ThreadPoolExecutor.java:727)
	at java.util.concurrent.ThreadPoolExecutor.execute(ThreadPoolExecutor.java:657)
	at org.glassfish.grizzly.utils.DelayedExecutor.start(DelayedExecutor.java:83)
	at org.glassfish.grizzly.http.server.HttpServer.start(HttpServer.java:249)
	at com.sun.jersey.api.container.grizzly2.GrizzlyServerFactory.createHttpServer(GrizzlyServerFactory.java:326)
	at com.sun.jersey.api.container.grizzly2.GrizzlyServerFactory.createHttpServer(GrizzlyServerFactory.java:343)
	at com.sun.jersey.test.framework.spi.container.grizzly2.web.GrizzlyWebTestContainerFactory$GrizzlyWebTestContainer.instantiateGrizzlyWebServer(GrizzlyWebTestContainerFactory.java:219)
	at com.sun.jersey.test.framework.spi.container.grizzly2.web.GrizzlyWebTestContainerFactory$GrizzlyWebTestContainer.<init>(GrizzlyWebTestContainerFactory.java:129)
	at com.sun.jersey.test.framework.spi.container.grizzly2.web.GrizzlyWebTestContainerFactory$GrizzlyWebTestContainer.<init>(GrizzlyWebTestContainerFactory.java:86)
	at com.sun.jersey.test.framework.spi.container.grizzly2.web.GrizzlyWebTestContainerFactory.create(GrizzlyWebTestContainerFactory.java:79)
	at com.sun.jersey.test.framework.JerseyTest.getContainer(JerseyTest.java:342)
	at com.sun.jersey.test.framework.JerseyTest.<init>(JerseyTest.java:217)
	at org.apache.hadoop.mapreduce.v2.hs.webapp.TestHsWebServicesJobsQuery.<init>(TestHsWebServicesJobsQuery.java:211)
	at sun.reflect.GeneratedConstructorAccessor145.newInstance(Unknown Source)
	at sun.reflect.DelegatingConstructorAccessorImpl.newInstance(DelegatingConstructorAccessorImpl.java:27)
	at java.lang.reflect.Constructor.newInstance(Constructor.java:513)
	at org.junit.runners.BlockJUnit4ClassRunner.createTest(BlockJUnit4ClassRunner.java:209)
	at org.junit.runners.BlockJUnit4ClassRunner$1.runReflectiveCall(BlockJUnit4ClassRunner.java:258)
	at org.junit.internal.runners.model.ReflectiveCallable.run(ReflectiveCallable.java:15)
	at org.junit.runners.BlockJUnit4ClassRunner.methodBlock(BlockJUnit4ClassRunner.java:255)
	at org.junit.runners.BlockJUnit4ClassRunner.runNotIgnored(BlockJUnit4ClassRunner.java:79)
	at org.junit.runners.BlockJUnit4ClassRunner.runChild(BlockJUnit4ClassRunner.java:71)
	at org.junit.runners.BlockJUnit4ClassRunner.runChild(BlockJUnit4ClassRunner.java:49)
	at org.junit.runners.ParentRunner$3.run(ParentRunner.java:193)
	at org.junit.runners.ParentRunner$1.schedule(ParentRunner.java:52)
	at org.junit.runners.ParentRunner.runChildren(ParentRunner.java:191)
	at org.junit.runners.ParentRunner.access$000(ParentRunner.java:42)
	at org.junit.runners.ParentRunner$2.evaluate(ParentRunner.java:184)
	at org.junit.runners.ParentRunner.run(ParentRunner.java:236)
	at org.apache.maven.surefire.junit4.JUnit4Provider.execute(JUnit4Provider.java:252)
	at org.apache.maven.surefire.junit4.JUnit4Provider.executeTestSet(JUnit4Provider.java:141)
	at org.apache.maven.surefire.junit4.JUnit4Provider.invoke(JUnit4Provider.java:112)
	at sun.reflect.NativeMethodAccessorImpl.invoke0(Native Method)
	at sun.reflect.NativeMethodAccessorImpl.invoke(NativeMethodAccessorImpl.java:39)
	at sun.reflect.DelegatingMethodAccessorImpl.invoke(DelegatingMethodAccessorImpl.java:25)
	at java.lang.reflect.Method.invoke(Method.java:597)
	at org.apache.maven.surefire.util.ReflectionUtils.invokeMethodWithArray(ReflectionUtils.java:189)
	at org.apache.maven.surefire.booter.ProviderFactory$ProviderProxy.invoke(ProviderFactory.java:165)
	at org.apache.maven.surefire.booter.ProviderFactory.invokeProvider(ProviderFactory.java:85)
	at org.apache.maven.surefire.booter.ForkedBooter.runSuitesInProcess(ForkedBooter.java:115)
	at org.apache.maven.surefire.booter.ForkedBooter.main(ForkedBooter.java:75)


FAILED:  org.apache.hadoop.mapreduce.v2.hs.webapp.TestHsWebServicesJobsQuery.testJobsQueryFinishTimeBegin

Error Message:
unable to create new native thread

Stack Trace:
java.lang.OutOfMemoryError: unable to create new native thread
	at java.lang.Thread.start0(Native Method)
	at java.lang.Thread.start(Thread.java:640)
	at java.util.concurrent.ThreadPoolExecutor.addIfUnderMaximumPoolSize(ThreadPoolExecutor.java:727)
	at java.util.concurrent.ThreadPoolExecutor.execute(ThreadPoolExecutor.java:657)
	at org.glassfish.grizzly.utils.DelayedExecutor.start(DelayedExecutor.java:83)
	at org.glassfish.grizzly.http.server.HttpServer.start(HttpServer.java:249)
	at com.sun.jersey.api.container.grizzly2.GrizzlyServerFactory.createHttpServer(GrizzlyServerFactory.java:326)
	at com.sun.jersey.api.container.grizzly2.GrizzlyServerFactory.createHttpServer(GrizzlyServerFactory.java:343)
	at com.sun.jersey.test.framework.spi.container.grizzly2.web.GrizzlyWebTestContainerFactory$GrizzlyWebTestContainer.instantiateGrizzlyWebServer(GrizzlyWebTestContainerFactory.java:219)
	at com.sun.jersey.test.framework.spi.container.grizzly2.web.GrizzlyWebTestContainerFactory$GrizzlyWebTestContainer.<init>(GrizzlyWebTestContainerFactory.java:129)
	at com.sun.jersey.test.framework.spi.container.grizzly2.web.GrizzlyWebTestContainerFactory$GrizzlyWebTestContainer.<init>(GrizzlyWebTestContainerFactory.java:86)
	at com.sun.jersey.test.framework.spi.container.grizzly2.web.GrizzlyWebTestContainerFactory.create(GrizzlyWebTestContainerFactory.java:79)
	at com.sun.jersey.test.framework.JerseyTest.getContainer(JerseyTest.java:342)
	at com.sun.jersey.test.framework.JerseyTest.<init>(JerseyTest.java:217)
	at org.apache.hadoop.mapreduce.v2.hs.webapp.TestHsWebServicesJobsQuery.<init>(TestHsWebServicesJobsQuery.java:211)
	at sun.reflect.GeneratedConstructorAccessor145.newInstance(Unknown Source)
	at sun.reflect.DelegatingConstructorAccessorImpl.newInstance(DelegatingConstructorAccessorImpl.java:27)
	at java.lang.reflect.Constructor.newInstance(Constructor.java:513)
	at org.junit.runners.BlockJUnit4ClassRunner.createTest(BlockJUnit4ClassRunner.java:209)
	at org.junit.runners.BlockJUnit4ClassRunner$1.runReflectiveCall(BlockJUnit4ClassRunner.java:258)
	at org.junit.internal.runners.model.ReflectiveCallable.run(ReflectiveCallable.java:15)
	at org.junit.runners.BlockJUnit4ClassRunner.methodBlock(BlockJUnit4ClassRunner.java:255)
	at org.junit.runners.BlockJUnit4ClassRunner.runNotIgnored(BlockJUnit4ClassRunner.java:79)
	at org.junit.runners.BlockJUnit4ClassRunner.runChild(BlockJUnit4ClassRunner.java:71)
	at org.junit.runners.BlockJUnit4ClassRunner.runChild(BlockJUnit4ClassRunner.java:49)
	at org.junit.runners.ParentRunner$3.run(ParentRunner.java:193)
	at org.junit.runners.ParentRunner$1.schedule(ParentRunner.java:52)
	at org.junit.runners.ParentRunner.runChildren(ParentRunner.java:191)
	at org.junit.runners.ParentRunner.access$000(ParentRunner.java:42)
	at org.junit.runners.ParentRunner$2.evaluate(ParentRunner.java:184)
	at org.junit.runners.ParentRunner.run(ParentRunner.java:236)
	at org.apache.maven.surefire.junit4.JUnit4Provider.execute(JUnit4Provider.java:252)
	at org.apache.maven.surefire.junit4.JUnit4Provider.executeTestSet(JUnit4Provider.java:141)
	at org.apache.maven.surefire.junit4.JUnit4Provider.invoke(JUnit4Provider.java:112)
	at sun.reflect.NativeMethodAccessorImpl.invoke0(Native Method)
	at sun.reflect.NativeMethodAccessorImpl.invoke(NativeMethodAccessorImpl.java:39)
	at sun.reflect.DelegatingMethodAccessorImpl.invoke(DelegatingMethodAccessorImpl.java:25)
	at java.lang.reflect.Method.invoke(Method.java:597)
	at org.apache.maven.surefire.util.ReflectionUtils.invokeMethodWithArray(ReflectionUtils.java:189)
	at org.apache.maven.surefire.booter.ProviderFactory$ProviderProxy.invoke(ProviderFactory.java:165)
	at org.apache.maven.surefire.booter.ProviderFactory.invokeProvider(ProviderFactory.java:85)
	at org.apache.maven.surefire.booter.ForkedBooter.runSuitesInProcess(ForkedBooter.java:115)
	at org.apache.maven.surefire.booter.ForkedBooter.main(ForkedBooter.java:75)


FAILED:  org.apache.hadoop.mapreduce.v2.hs.webapp.TestHsWebServicesJobsQuery.testJobsQueryFinishTimeEnd

Error Message:
unable to create new native thread

Stack Trace:
java.lang.OutOfMemoryError: unable to create new native thread
	at java.lang.Thread.start0(Native Method)
	at java.lang.Thread.start(Thread.java:640)
	at java.util.concurrent.ThreadPoolExecutor.addIfUnderMaximumPoolSize(ThreadPoolExecutor.java:727)
	at java.util.concurrent.ThreadPoolExecutor.execute(ThreadPoolExecutor.java:657)
	at org.glassfish.grizzly.utils.DelayedExecutor.start(DelayedExecutor.java:83)
	at org.glassfish.grizzly.http.server.HttpServer.start(HttpServer.java:249)
	at com.sun.jersey.api.container.grizzly2.GrizzlyServerFactory.createHttpServer(GrizzlyServerFactory.java:326)
	at com.sun.jersey.api.container.grizzly2.GrizzlyServerFactory.createHttpServer(GrizzlyServerFactory.java:343)
	at com.sun.jersey.test.framework.spi.container.grizzly2.web.GrizzlyWebTestContainerFactory$GrizzlyWebTestContainer.instantiateGrizzlyWebServer(GrizzlyWebTestContainerFactory.java:219)
	at com.sun.jersey.test.framework.spi.container.grizzly2.web.GrizzlyWebTestContainerFactory$GrizzlyWebTestContainer.<init>(GrizzlyWebTestContainerFactory.java:129)
	at com.sun.jersey.test.framework.spi.container.grizzly2.web.GrizzlyWebTestContainerFactory$GrizzlyWebTestContainer.<init>(GrizzlyWebTestContainerFactory.java:86)
	at com.sun.jersey.test.framework.spi.container.grizzly2.web.GrizzlyWebTestContainerFactory.create(GrizzlyWebTestContainerFactory.java:79)
	at com.sun.jersey.test.framework.JerseyTest.getContainer(JerseyTest.java:342)
	at com.sun.jersey.test.framework.JerseyTest.<init>(JerseyTest.java:217)
	at org.apache.hadoop.mapreduce.v2.hs.webapp.TestHsWebServicesJobsQuery.<init>(TestHsWebServicesJobsQuery.java:211)
	at sun.reflect.GeneratedConstructorAccessor145.newInstance(Unknown Source)
	at sun.reflect.DelegatingConstructorAccessorImpl.newInstance(DelegatingConstructorAccessorImpl.java:27)
	at java.lang.reflect.Constructor.newInstance(Constructor.java:513)
	at org.junit.runners.BlockJUnit4ClassRunner.createTest(BlockJUnit4ClassRunner.java:209)
	at org.junit.runners.BlockJUnit4ClassRunner$1.runReflectiveCall(BlockJUnit4ClassRunner.java:258)
	at org.junit.internal.runners.model.ReflectiveCallable.run(ReflectiveCallable.java:15)
	at org.junit.runners.BlockJUnit4ClassRunner.methodBlock(BlockJUnit4ClassRunner.java:255)
	at org.junit.runners.BlockJUnit4ClassRunner.runNotIgnored(BlockJUnit4ClassRunner.java:79)
	at org.junit.runners.BlockJUnit4ClassRunner.runChild(BlockJUnit4ClassRunner.java:71)
	at org.junit.runners.BlockJUnit4ClassRunner.runChild(BlockJUnit4ClassRunner.java:49)
	at org.junit.runners.ParentRunner$3.run(ParentRunner.java:193)
	at org.junit.runners.ParentRunner$1.schedule(ParentRunner.java:52)
	at org.junit.runners.ParentRunner.runChildren(ParentRunner.java:191)
	at org.junit.runners.ParentRunner.access$000(ParentRunner.java:42)
	at org.junit.runners.ParentRunner$2.evaluate(ParentRunner.java:184)
	at org.junit.runners.ParentRunner.run(ParentRunner.java:236)
	at org.apache.maven.surefire.junit4.JUnit4Provider.execute(JUnit4Provider.java:252)
	at org.apache.maven.surefire.junit4.JUnit4Provider.executeTestSet(JUnit4Provider.java:141)
	at org.apache.maven.surefire.junit4.JUnit4Provider.invoke(JUnit4Provider.java:112)
	at sun.reflect.NativeMethodAccessorImpl.invoke0(Native Method)
	at sun.reflect.NativeMethodAccessorImpl.invoke(NativeMethodAccessorImpl.java:39)
	at sun.reflect.DelegatingMethodAccessorImpl.invoke(DelegatingMethodAccessorImpl.java:25)
	at java.lang.reflect.Method.invoke(Method.java:597)
	at org.apache.maven.surefire.util.ReflectionUtils.invokeMethodWithArray(ReflectionUtils.java:189)
	at org.apache.maven.surefire.booter.ProviderFactory$ProviderProxy.invoke(ProviderFactory.java:165)
	at org.apache.maven.surefire.booter.ProviderFactory.invokeProvider(ProviderFactory.java:85)
	at org.apache.maven.surefire.booter.ForkedBooter.runSuitesInProcess(ForkedBooter.java:115)
	at org.apache.maven.surefire.booter.ForkedBooter.main(ForkedBooter.java:75)


FAILED:  org.apache.hadoop.mapreduce.v2.hs.webapp.TestHsWebServicesJobsQuery.testJobsQueryFinishTimeBeginEnd

Error Message:
unable to create new native thread

Stack Trace:
java.lang.OutOfMemoryError: unable to create new native thread
	at java.lang.Thread.start0(Native Method)
	at java.lang.Thread.start(Thread.java:640)
	at java.util.concurrent.ThreadPoolExecutor.addIfUnderMaximumPoolSize(ThreadPoolExecutor.java:727)
	at java.util.concurrent.ThreadPoolExecutor.execute(ThreadPoolExecutor.java:657)
	at org.glassfish.grizzly.utils.DelayedExecutor.start(DelayedExecutor.java:83)
	at org.glassfish.grizzly.http.server.HttpServer.start(HttpServer.java:249)
	at com.sun.jersey.api.container.grizzly2.GrizzlyServerFactory.createHttpServer(GrizzlyServerFactory.java:326)
	at com.sun.jersey.api.container.grizzly2.GrizzlyServerFactory.createHttpServer(GrizzlyServerFactory.java:343)
	at com.sun.jersey.test.framework.spi.container.grizzly2.web.GrizzlyWebTestContainerFactory$GrizzlyWebTestContainer.instantiateGrizzlyWebServer(GrizzlyWebTestContainerFactory.java:219)
	at com.sun.jersey.test.framework.spi.container.grizzly2.web.GrizzlyWebTestContainerFactory$GrizzlyWebTestContainer.<init>(GrizzlyWebTestContainerFactory.java:129)
	at com.sun.jersey.test.framework.spi.container.grizzly2.web.GrizzlyWebTestContainerFactory$GrizzlyWebTestContainer.<init>(GrizzlyWebTestContainerFactory.java:86)
	at com.sun.jersey.test.framework.spi.container.grizzly2.web.GrizzlyWebTestContainerFactory.create(GrizzlyWebTestContainerFactory.java:79)
	at com.sun.jersey.test.framework.JerseyTest.getContainer(JerseyTest.java:342)
	at com.sun.jersey.test.framework.JerseyTest.<init>(JerseyTest.java:217)
	at org.apache.hadoop.mapreduce.v2.hs.webapp.TestHsWebServicesJobsQuery.<init>(TestHsWebServicesJobsQuery.java:211)
	at sun.reflect.GeneratedConstructorAccessor145.newInstance(Unknown Source)
	at sun.reflect.DelegatingConstructorAccessorImpl.newInstance(DelegatingConstructorAccessorImpl.java:27)
	at java.lang.reflect.Constructor.newInstance(Constructor.java:513)
	at org.junit.runners.BlockJUnit4ClassRunner.createTest(BlockJUnit4ClassRunner.java:209)
	at org.junit.runners.BlockJUnit4ClassRunner$1.runReflectiveCall(BlockJUnit4ClassRunner.java:258)
	at org.junit.internal.runners.model.ReflectiveCallable.run(ReflectiveCallable.java:15)
	at org.junit.runners.BlockJUnit4ClassRunner.methodBlock(BlockJUnit4ClassRunner.java:255)
	at org.junit.runners.BlockJUnit4ClassRunner.runNotIgnored(BlockJUnit4ClassRunner.java:79)
	at org.junit.runners.BlockJUnit4ClassRunner.runChild(BlockJUnit4ClassRunner.java:71)
	at org.junit.runners.BlockJUnit4ClassRunner.runChild(BlockJUnit4ClassRunner.java:49)
	at org.junit.runners.ParentRunner$3.run(ParentRunner.java:193)
	at org.junit.runners.ParentRunner$1.schedule(ParentRunner.java:52)
	at org.junit.runners.ParentRunner.runChildren(ParentRunner.java:191)
	at org.junit.runners.ParentRunner.access$000(ParentRunner.java:42)
	at org.junit.runners.ParentRunner$2.evaluate(ParentRunner.java:184)
	at org.junit.runners.ParentRunner.run(ParentRunner.java:236)
	at org.apache.maven.surefire.junit4.JUnit4Provider.execute(JUnit4Provider.java:252)
	at org.apache.maven.surefire.junit4.JUnit4Provider.executeTestSet(JUnit4Provider.java:141)
	at org.apache.maven.surefire.junit4.JUnit4Provider.invoke(JUnit4Provider.java:112)
	at sun.reflect.NativeMethodAccessorImpl.invoke0(Native Method)
	at sun.reflect.NativeMethodAccessorImpl.invoke(NativeMethodAccessorImpl.java:39)
	at sun.reflect.DelegatingMethodAccessorImpl.invoke(DelegatingMethodAccessorImpl.java:25)
	at java.lang.reflect.Method.invoke(Method.java:597)
	at org.apache.maven.surefire.util.ReflectionUtils.invokeMethodWithArray(ReflectionUtils.java:189)
	at org.apache.maven.surefire.booter.ProviderFactory$ProviderProxy.invoke(ProviderFactory.java:165)
	at org.apache.maven.surefire.booter.ProviderFactory.invokeProvider(ProviderFactory.java:85)
	at org.apache.maven.surefire.booter.ForkedBooter.runSuitesInProcess(ForkedBooter.java:115)
	at org.apache.maven.surefire.booter.ForkedBooter.main(ForkedBooter.java:75)


FAILED:  org.apache.hadoop.mapreduce.v2.hs.webapp.TestHsWebServicesTasks.testJobTaskCountersXML

Error Message:
unable to create new native thread

Stack Trace:
java.lang.OutOfMemoryError: unable to create new native thread
	at java.lang.Thread.start0(Native Method)
	at java.lang.Thread.start(Thread.java:640)
	at org.glassfish.grizzly.threadpool.AbstractThreadPool.startWorker(AbstractThreadPool.java:192)
	at org.glassfish.grizzly.threadpool.FixedThreadPool.doStartWorker(FixedThreadPool.java:82)
	at org.glassfish.grizzly.threadpool.FixedThreadPool.<init>(FixedThreadPool.java:71)
	at org.glassfish.grizzly.threadpool.GrizzlyExecutorService.setImpl(GrizzlyExecutorService.java:100)
	at org.glassfish.grizzly.threadpool.GrizzlyExecutorService.<init>(GrizzlyExecutorService.java:82)
	at org.glassfish.grizzly.threadpool.GrizzlyExecutorService.createInstance(GrizzlyExecutorService.java:78)
	at org.glassfish.grizzly.nio.transport.TCPNIOTransport.start(TCPNIOTransport.java:248)
	at org.glassfish.grizzly.http.server.NetworkListener.start(NetworkListener.java:555)
	at org.glassfish.grizzly.http.server.HttpServer.start(HttpServer.java:254)
	at com.sun.jersey.api.container.grizzly2.GrizzlyServerFactory.createHttpServer(GrizzlyServerFactory.java:326)
	at com.sun.jersey.api.container.grizzly2.GrizzlyServerFactory.createHttpServer(GrizzlyServerFactory.java:343)
	at com.sun.jersey.test.framework.spi.container.grizzly2.web.GrizzlyWebTestContainerFactory$GrizzlyWebTestContainer.instantiateGrizzlyWebServer(GrizzlyWebTestContainerFactory.java:219)
	at com.sun.jersey.test.framework.spi.container.grizzly2.web.GrizzlyWebTestContainerFactory$GrizzlyWebTestContainer.<init>(GrizzlyWebTestContainerFactory.java:129)
	at com.sun.jersey.test.framework.spi.container.grizzly2.web.GrizzlyWebTestContainerFactory$GrizzlyWebTestContainer.<init>(GrizzlyWebTestContainerFactory.java:86)
	at com.sun.jersey.test.framework.spi.container.grizzly2.web.GrizzlyWebTestContainerFactory.create(GrizzlyWebTestContainerFactory.java:79)
	at com.sun.jersey.test.framework.JerseyTest.getContainer(JerseyTest.java:342)
	at com.sun.jersey.test.framework.JerseyTest.<init>(JerseyTest.java:217)
	at org.apache.hadoop.mapreduce.v2.hs.webapp.TestHsWebServicesTasks.<init>(TestHsWebServicesTasks.java:209)
	at sun.reflect.GeneratedConstructorAccessor144.newInstance(Unknown Source)
	at sun.reflect.DelegatingConstructorAccessorImpl.newInstance(DelegatingConstructorAccessorImpl.java:27)
	at java.lang.reflect.Constructor.newInstance(Constructor.java:513)
	at org.junit.runners.BlockJUnit4ClassRunner.createTest(BlockJUnit4ClassRunner.java:209)
	at org.junit.runners.BlockJUnit4ClassRunner$1.runReflectiveCall(BlockJUnit4ClassRunner.java:258)
	at org.junit.internal.runners.model.ReflectiveCallable.run(ReflectiveCallable.java:15)
	at org.junit.runners.BlockJUnit4ClassRunner.methodBlock(BlockJUnit4ClassRunner.java:255)
	at org.junit.runners.BlockJUnit4ClassRunner.runNotIgnored(BlockJUnit4ClassRunner.java:79)
	at org.junit.runners.BlockJUnit4ClassRunner.runChild(BlockJUnit4ClassRunner.java:71)
	at org.junit.runners.BlockJUnit4ClassRunner.runChild(BlockJUnit4ClassRunner.java:49)
	at org.junit.runners.ParentRunner$3.run(ParentRunner.java:193)
	at org.junit.runners.ParentRunner$1.schedule(ParentRunner.java:52)
	at org.junit.runners.ParentRunner.runChildren(ParentRunner.java:191)
	at org.junit.runners.ParentRunner.access$000(ParentRunner.java:42)
	at org.junit.runners.ParentRunner$2.evaluate(ParentRunner.java:184)
	at org.junit.runners.ParentRunner.run(ParentRunner.java:236)
	at org.apache.maven.surefire.junit4.JUnit4Provider.execute(JUnit4Provider.java:252)
	at org.apache.maven.surefire.junit4.JUnit4Provider.executeTestSet(JUnit4Provider.java:141)
	at org.apache.maven.surefire.junit4.JUnit4Provider.invoke(JUnit4Provider.java:112)
	at sun.reflect.NativeMethodAccessorImpl.invoke0(Native Method)
	at sun.reflect.NativeMethodAccessorImpl.invoke(NativeMethodAccessorImpl.java:39)
	at sun.reflect.DelegatingMethodAccessorImpl.invoke(DelegatingMethodAccessorImpl.java:25)
	at java.lang.reflect.Method.invoke(Method.java:597)
	at org.apache.maven.surefire.util.ReflectionUtils.invokeMethodWithArray(ReflectionUtils.java:189)
	at org.apache.maven.surefire.booter.ProviderFactory$ProviderProxy.invoke(ProviderFactory.java:165)
	at org.apache.maven.surefire.booter.ProviderFactory.invokeProvider(ProviderFactory.java:85)
	at org.apache.maven.surefire.booter.ForkedBooter.runSuitesInProcess(ForkedBooter.java:115)
	at org.apache.maven.surefire.booter.ForkedBooter.main(ForkedBooter.java:75)


FAILED:  org.apache.hadoop.conf.TestNoDefaultsJobConf.testNoDefaults

Error Message:
Failed to Start org.apache.hadoop.mapred.MiniMRCluster

Stack Trace:
org.apache.hadoop.yarn.YarnException: Failed to Start org.apache.hadoop.mapred.MiniMRCluster
	at org.apache.hadoop.yarn.service.CompositeService.start(CompositeService.java:78)
	at org.apache.hadoop.mapred.MiniMRClientClusterFactory.create(MiniMRClientClusterFactory.java:75)
	at org.apache.hadoop.mapred.MiniMRCluster.<init>(MiniMRCluster.java:180)
	at org.apache.hadoop.mapred.MiniMRCluster.<init>(MiniMRCluster.java:170)
	at org.apache.hadoop.mapred.MiniMRCluster.<init>(MiniMRCluster.java:162)
	at org.apache.hadoop.mapred.MiniMRCluster.<init>(MiniMRCluster.java:154)
	at org.apache.hadoop.mapred.MiniMRCluster.<init>(MiniMRCluster.java:147)
	at org.apache.hadoop.mapred.MiniMRCluster.<init>(MiniMRCluster.java:140)
	at org.apache.hadoop.mapred.MiniMRCluster.<init>(MiniMRCluster.java:133)
	at org.apache.hadoop.mapred.MiniMRCluster.<init>(MiniMRCluster.java:128)
	at org.apache.hadoop.mapred.HadoopTestCase.setUp(HadoopTestCase.java:156)
	at junit.framework.TestCase.runBare(TestCase.java:132)
	at junit.framework.TestResult$1.protect(TestResult.java:110)
	at junit.framework.TestResult.runProtected(TestResult.java:128)
	at junit.framework.TestResult.run(TestResult.java:113)
	at junit.framework.TestCase.run(TestCase.java:124)
	at junit.framework.TestSuite.runTest(TestSuite.java:243)
	at junit.framework.TestSuite.run(TestSuite.java:238)
	at org.junit.internal.runners.JUnit38ClassRunner.run(JUnit38ClassRunner.java:83)
	at org.apache.maven.surefire.junit4.JUnit4Provider.execute(JUnit4Provider.java:252)
	at org.apache.maven.surefire.junit4.JUnit4Provider.executeTestSet(JUnit4Provider.java:141)
	at org.apache.maven.surefire.junit4.JUnit4Provider.invoke(JUnit4Provider.java:112)
	at sun.reflect.NativeMethodAccessorImpl.invoke0(Native Method)
	at sun.reflect.NativeMethodAccessorImpl.invoke(NativeMethodAccessorImpl.java:39)
	at sun.reflect.DelegatingMethodAccessorImpl.invoke(DelegatingMethodAccessorImpl.java:25)
	at java.lang.reflect.Method.invoke(Method.java:597)
	at org.apache.maven.surefire.util.ReflectionUtils.invokeMethodWithArray(ReflectionUtils.java:189)
	at org.apache.maven.surefire.booter.ProviderFactory$ProviderProxy.invoke(ProviderFactory.java:165)
	at org.apache.maven.surefire.booter.ProviderFactory.invokeProvider(ProviderFactory.java:85)
	at org.apache.maven.surefire.booter.ForkedBooter.runSuitesInProcess(ForkedBooter.java:115)
	at org.apache.maven.surefire.booter.ForkedBooter.main(ForkedBooter.java:75)
Caused by: org.apache.hadoop.yarn.YarnException: java.io.IOException: ResourceManager failed to start. Final state is INITED
	at org.apache.hadoop.yarn.server.MiniYARNCluster$ResourceManagerWrapper.start(MiniYARNCluster.java:181)
	at org.apache.hadoop.yarn.service.CompositeService.start(CompositeService.java:68)
	... 30 more
Caused by: java.io.IOException: ResourceManager failed to start. Final state is INITED
	at org.apache.hadoop.yarn.server.MiniYARNCluster$ResourceManagerWrapper.start(MiniYARNCluster.java:175)
	... 31 more


FAILED:  org.apache.hadoop.ipc.TestSocketFactory.testSocketFactory

Error Message:
Failed to Start org.apache.hadoop.ipc.TestSocketFactory

Stack Trace:
org.apache.hadoop.yarn.YarnException: Failed to Start org.apache.hadoop.ipc.TestSocketFactory
	at org.apache.hadoop.yarn.service.CompositeService.start(CompositeService.java:78)
	at org.apache.hadoop.ipc.TestSocketFactory.initAndStartMiniMRYarnCluster(TestSocketFactory.java:112)
	at org.apache.hadoop.ipc.TestSocketFactory.testSocketFactory(TestSocketFactory.java:85)
	at sun.reflect.NativeMethodAccessorImpl.invoke0(Native Method)
	at sun.reflect.NativeMethodAccessorImpl.invoke(NativeMethodAccessorImpl.java:39)
	at sun.reflect.DelegatingMethodAccessorImpl.invoke(DelegatingMethodAccessorImpl.java:25)
	at java.lang.reflect.Method.invoke(Method.java:597)
	at org.junit.runners.model.FrameworkMethod$1.runReflectiveCall(FrameworkMethod.java:44)
	at org.junit.internal.runners.model.ReflectiveCallable.run(ReflectiveCallable.java:15)
	at org.junit.runners.model.FrameworkMethod.invokeExplosively(FrameworkMethod.java:41)
	at org.junit.internal.runners.statements.InvokeMethod.evaluate(InvokeMethod.java:20)
	at org.junit.runners.BlockJUnit4ClassRunner.runNotIgnored(BlockJUnit4ClassRunner.java:79)
	at org.junit.runners.BlockJUnit4ClassRunner.runChild(BlockJUnit4ClassRunner.java:71)
	at org.junit.runners.BlockJUnit4ClassRunner.runChild(BlockJUnit4ClassRunner.java:49)
	at org.junit.runners.ParentRunner$3.run(ParentRunner.java:193)
	at org.junit.runners.ParentRunner$1.schedule(ParentRunner.java:52)
	at org.junit.runners.ParentRunner.runChildren(ParentRunner.java:191)
	at org.junit.runners.ParentRunner.access$000(ParentRunner.java:42)
	at org.junit.runners.ParentRunner$2.evaluate(ParentRunner.java:184)
	at org.junit.runners.ParentRunner.run(ParentRunner.java:236)
	at org.apache.maven.surefire.junit4.JUnit4Provider.execute(JUnit4Provider.java:252)
	at org.apache.maven.surefire.junit4.JUnit4Provider.executeTestSet(JUnit4Provider.java:141)
	at org.apache.maven.surefire.junit4.JUnit4Provider.invoke(JUnit4Provider.java:112)
	at sun.reflect.NativeMethodAccessorImpl.invoke0(Native Method)
	at sun.reflect.NativeMethodAccessorImpl.invoke(NativeMethodAccessorImpl.java:39)
	at sun.reflect.DelegatingMethodAccessorImpl.invoke(DelegatingMethodAccessorImpl.java:25)
	at java.lang.reflect.Method.invoke(Method.java:597)
	at org.apache.maven.surefire.util.ReflectionUtils.invokeMethodWithArray(ReflectionUtils.java:189)
	at org.apache.maven.surefire.booter.ProviderFactory$ProviderProxy.invoke(ProviderFactory.java:165)
	at org.apache.maven.surefire.booter.ProviderFactory.invokeProvider(ProviderFactory.java:85)
	at org.apache.maven.surefire.booter.ForkedBooter.runSuitesInProcess(ForkedBooter.java:115)
	at org.apache.maven.surefire.booter.ForkedBooter.main(ForkedBooter.java:75)
Caused by: org.apache.hadoop.yarn.YarnException: java.io.IOException: ResourceManager failed to start. Final state is INITED
	at org.apache.hadoop.yarn.server.MiniYARNCluster$ResourceManagerWrapper.start(MiniYARNCluster.java:181)
	at org.apache.hadoop.yarn.service.CompositeService.start(CompositeService.java:68)
	... 31 more
Caused by: java.io.IOException: ResourceManager failed to start. Final state is INITED
	at org.apache.hadoop.yarn.server.MiniYARNCluster$ResourceManagerWrapper.start(MiniYARNCluster.java:175)
	... 32 more


FAILED:  org.apache.hadoop.mapred.TestBlockLimits.testWithLimits

Error Message:
Failed to Start org.apache.hadoop.mapred.TestBlockLimits

Stack Trace:
org.apache.hadoop.yarn.YarnException: Failed to Start org.apache.hadoop.mapred.TestBlockLimits
	at org.apache.hadoop.yarn.service.CompositeService.start(CompositeService.java:78)
	at org.apache.hadoop.mapred.MiniMRClientClusterFactory.create(MiniMRClientClusterFactory.java:75)
	at org.apache.hadoop.mapred.TestBlockLimits.testWithLimits(TestBlockLimits.java:51)
	at sun.reflect.NativeMethodAccessorImpl.invoke0(Native Method)
	at sun.reflect.NativeMethodAccessorImpl.invoke(NativeMethodAccessorImpl.java:39)
	at sun.reflect.DelegatingMethodAccessorImpl.invoke(DelegatingMethodAccessorImpl.java:25)
	at java.lang.reflect.Method.invoke(Method.java:597)
	at junit.framework.TestCase.runTest(TestCase.java:168)
	at junit.framework.TestCase.runBare(TestCase.java:134)
	at junit.framework.TestResult$1.protect(TestResult.java:110)
	at junit.framework.TestResult.runProtected(TestResult.java:128)
	at junit.framework.TestResult.run(TestResult.java:113)
	at junit.framework.TestCase.run(TestCase.java:124)
	at junit.framework.TestSuite.runTest(TestSuite.java:243)
	at junit.framework.TestSuite.run(TestSuite.java:238)
	at org.junit.internal.runners.JUnit38ClassRunner.run(JUnit38ClassRunner.java:83)
	at org.apache.maven.surefire.junit4.JUnit4Provider.execute(JUnit4Provider.java:252)
	at org.apache.maven.surefire.junit4.JUnit4Provider.executeTestSet(JUnit4Provider.java:141)
	at org.apache.maven.surefire.junit4.JUnit4Provider.invoke(JUnit4Provider.java:112)
	at sun.reflect.NativeMethodAccessorImpl.invoke0(Native Method)
	at sun.reflect.NativeMethodAccessorImpl.invoke(NativeMethodAccessorImpl.java:39)
	at sun.reflect.DelegatingMethodAccessorImpl.invoke(DelegatingMethodAccessorImpl.java:25)
	at java.lang.reflect.Method.invoke(Method.java:597)
	at org.apache.maven.surefire.util.ReflectionUtils.invokeMethodWithArray(ReflectionUtils.java:189)
	at org.apache.maven.surefire.booter.ProviderFactory$ProviderProxy.invoke(ProviderFactory.java:165)
	at org.apache.maven.surefire.booter.ProviderFactory.invokeProvider(ProviderFactory.java:85)
	at org.apache.maven.surefire.booter.ForkedBooter.runSuitesInProcess(ForkedBooter.java:115)
	at org.apache.maven.surefire.booter.ForkedBooter.main(ForkedBooter.java:75)
Caused by: org.apache.hadoop.yarn.YarnException: java.io.IOException: ResourceManager failed to start. Final state is INITED
	at org.apache.hadoop.yarn.server.MiniYARNCluster$ResourceManagerWrapper.start(MiniYARNCluster.java:181)
	at org.apache.hadoop.yarn.service.CompositeService.start(CompositeService.java:68)
	... 27 more
Caused by: java.io.IOException: ResourceManager failed to start. Final state is INITED
	at org.apache.hadoop.yarn.server.MiniYARNCluster$ResourceManagerWrapper.start(MiniYARNCluster.java:175)
	... 28 more


FAILED:  org.apache.hadoop.mapred.TestClusterMapReduceTestCase.testMapReduce

Error Message:
Failed to Start org.apache.hadoop.mapred.ClusterMapReduceTestCaseConfigurableMiniMRCluster

Stack Trace:
org.apache.hadoop.yarn.YarnException: Failed to Start org.apache.hadoop.mapred.ClusterMapReduceTestCaseConfigurableMiniMRCluster
	at org.apache.hadoop.yarn.service.CompositeService.start(CompositeService.java:78)
	at org.apache.hadoop.mapred.MiniMRClientClusterFactory.create(MiniMRClientClusterFactory.java:75)
	at org.apache.hadoop.mapred.MiniMRCluster.<init>(MiniMRCluster.java:180)
	at org.apache.hadoop.mapred.MiniMRCluster.<init>(MiniMRCluster.java:170)
	at org.apache.hadoop.mapred.MiniMRCluster.<init>(MiniMRCluster.java:162)
	at org.apache.hadoop.mapred.ClusterMapReduceTestCase$ConfigurableMiniMRCluster.<init>(ClusterMapReduceTestCase.java:101)
	at org.apache.hadoop.mapred.ClusterMapReduceTestCase.startCluster(ClusterMapReduceTestCase.java:86)
	at org.apache.hadoop.mapred.ClusterMapReduceTestCase.setUp(ClusterMapReduceTestCase.java:56)
	at junit.framework.TestCase.runBare(TestCase.java:132)
	at junit.framework.TestResult$1.protect(TestResult.java:110)
	at junit.framework.TestResult.runProtected(TestResult.java:128)
	at junit.framework.TestResult.run(TestResult.java:113)
	at junit.framework.TestCase.run(TestCase.java:124)
	at junit.framework.TestSuite.runTest(TestSuite.java:243)
	at junit.framework.TestSuite.run(TestSuite.java:238)
	at org.junit.internal.runners.JUnit38ClassRunner.run(JUnit38ClassRunner.java:83)
	at org.apache.maven.surefire.junit4.JUnit4Provider.execute(JUnit4Provider.java:252)
	at org.apache.maven.surefire.junit4.JUnit4Provider.executeTestSet(JUnit4Provider.java:141)
	at org.apache.maven.surefire.junit4.JUnit4Provider.invoke(JUnit4Provider.java:112)
	at sun.reflect.NativeMethodAccessorImpl.invoke0(Native Method)
	at sun.reflect.NativeMethodAccessorImpl.invoke(NativeMethodAccessorImpl.java:39)
	at sun.reflect.DelegatingMethodAccessorImpl.invoke(DelegatingMethodAccessorImpl.java:25)
	at java.lang.reflect.Method.invoke(Method.java:597)
	at org.apache.maven.surefire.util.ReflectionUtils.invokeMethodWithArray(ReflectionUtils.java:189)
	at org.apache.maven.surefire.booter.ProviderFactory$ProviderProxy.invoke(ProviderFactory.java:165)
	at org.apache.maven.surefire.booter.ProviderFactory.invokeProvider(ProviderFactory.java:85)
	at org.apache.maven.surefire.booter.ForkedBooter.runSuitesInProcess(ForkedBooter.java:115)
	at org.apache.maven.surefire.booter.ForkedBooter.main(ForkedBooter.java:75)
Caused by: org.apache.hadoop.yarn.YarnException: java.io.IOException: ResourceManager failed to start. Final state is INITED
	at org.apache.hadoop.yarn.server.MiniYARNCluster$ResourceManagerWrapper.start(MiniYARNCluster.java:181)
	at org.apache.hadoop.yarn.service.CompositeService.start(CompositeService.java:68)
	... 27 more
Caused by: java.io.IOException: ResourceManager failed to start. Final state is INITED
	at org.apache.hadoop.yarn.server.MiniYARNCluster$ResourceManagerWrapper.start(MiniYARNCluster.java:175)
	... 28 more


FAILED:  org.apache.hadoop.mapred.TestClusterMapReduceTestCase.testMapReduceRestarting

Error Message:
Failed to Start org.apache.hadoop.mapred.ClusterMapReduceTestCaseConfigurableMiniMRCluster

Stack Trace:
org.apache.hadoop.yarn.YarnException: Failed to Start org.apache.hadoop.mapred.ClusterMapReduceTestCaseConfigurableMiniMRCluster
	at org.apache.hadoop.yarn.service.CompositeService.start(CompositeService.java:78)
	at org.apache.hadoop.mapred.MiniMRClientClusterFactory.create(MiniMRClientClusterFactory.java:75)
	at org.apache.hadoop.mapred.MiniMRCluster.<init>(MiniMRCluster.java:180)
	at org.apache.hadoop.mapred.MiniMRCluster.<init>(MiniMRCluster.java:170)
	at org.apache.hadoop.mapred.MiniMRCluster.<init>(MiniMRCluster.java:162)
	at org.apache.hadoop.mapred.ClusterMapReduceTestCase$ConfigurableMiniMRCluster.<init>(ClusterMapReduceTestCase.java:101)
	at org.apache.hadoop.mapred.ClusterMapReduceTestCase.startCluster(ClusterMapReduceTestCase.java:86)
	at org.apache.hadoop.mapred.ClusterMapReduceTestCase.setUp(ClusterMapReduceTestCase.java:56)
	at junit.framework.TestCase.runBare(TestCase.java:132)
	at junit.framework.TestResult$1.protect(TestResult.java:110)
	at junit.framework.TestResult.runProtected(TestResult.java:128)
	at junit.framework.TestResult.run(TestResult.java:113)
	at junit.framework.TestCase.run(TestCase.java:124)
	at junit.framework.TestSuite.runTest(TestSuite.java:243)
	at junit.framework.TestSuite.run(TestSuite.java:238)
	at org.junit.internal.runners.JUnit38ClassRunner.run(JUnit38ClassRunner.java:83)
	at org.apache.maven.surefire.junit4.JUnit4Provider.execute(JUnit4Provider.java:252)
	at org.apache.maven.surefire.junit4.JUnit4Provider.executeTestSet(JUnit4Provider.java:141)
	at org.apache.maven.surefire.junit4.JUnit4Provider.invoke(JUnit4Provider.java:112)
	at sun.reflect.NativeMethodAccessorImpl.invoke0(Native Method)
	at sun.reflect.NativeMethodAccessorImpl.invoke(NativeMethodAccessorImpl.java:39)
	at sun.reflect.DelegatingMethodAccessorImpl.invoke(DelegatingMethodAccessorImpl.java:25)
	at java.lang.reflect.Method.invoke(Method.java:597)
	at org.apache.maven.surefire.util.ReflectionUtils.invokeMethodWithArray(ReflectionUtils.java:189)
	at org.apache.maven.surefire.booter.ProviderFactory$ProviderProxy.invoke(ProviderFactory.java:165)
	at org.apache.maven.surefire.booter.ProviderFactory.invokeProvider(ProviderFactory.java:85)
	at org.apache.maven.surefire.booter.ForkedBooter.runSuitesInProcess(ForkedBooter.java:115)
	at org.apache.maven.surefire.booter.ForkedBooter.main(ForkedBooter.java:75)
Caused by: org.apache.hadoop.yarn.YarnException: java.io.IOException: ResourceManager failed to start. Final state is INITED
	at org.apache.hadoop.yarn.server.MiniYARNCluster$ResourceManagerWrapper.start(MiniYARNCluster.java:181)
	at org.apache.hadoop.yarn.service.CompositeService.start(CompositeService.java:68)
	... 27 more
Caused by: java.io.IOException: ResourceManager failed to start. Final state is INITED
	at org.apache.hadoop.yarn.server.MiniYARNCluster$ResourceManagerWrapper.start(MiniYARNCluster.java:175)
	... 28 more


FAILED:  org.apache.hadoop.mapred.TestClusterMapReduceTestCase.testDFSRestart

Error Message:
unable to create new native thread

Stack Trace:
java.lang.OutOfMemoryError: unable to create new native thread
	at java.lang.Thread.start0(Native Method)
	at java.lang.Thread.start(Thread.java:640)
	at org.apache.hadoop.ipc.Server.start(Server.java:2090)
	at org.apache.hadoop.hdfs.server.datanode.DataNode.runDatanodeDaemon(DataNode.java:1530)
	at org.apache.hadoop.hdfs.MiniDFSCluster.startDataNodes(MiniDFSCluster.java:1206)
	at org.apache.hadoop.hdfs.MiniDFSCluster.initMiniDFSCluster(MiniDFSCluster.java:666)
	at org.apache.hadoop.hdfs.MiniDFSCluster.<init>(MiniDFSCluster.java:335)
	at org.apache.hadoop.hdfs.MiniDFSCluster$Builder.build(MiniDFSCluster.java:317)
	at org.apache.hadoop.mapred.ClusterMapReduceTestCase.startCluster(ClusterMapReduceTestCase.java:81)
	at org.apache.hadoop.mapred.ClusterMapReduceTestCase.setUp(ClusterMapReduceTestCase.java:56)
	at junit.framework.TestCase.runBare(TestCase.java:132)
	at junit.framework.TestResult$1.protect(TestResult.java:110)
	at junit.framework.TestResult.runProtected(TestResult.java:128)
	at junit.framework.TestResult.run(TestResult.java:113)
	at junit.framework.TestCase.run(TestCase.java:124)
	at junit.framework.TestSuite.runTest(TestSuite.java:243)
	at junit.framework.TestSuite.run(TestSuite.java:238)
	at org.junit.internal.runners.JUnit38ClassRunner.run(JUnit38ClassRunner.java:83)
	at org.apache.maven.surefire.junit4.JUnit4Provider.execute(JUnit4Provider.java:252)
	at org.apache.maven.surefire.junit4.JUnit4Provider.executeTestSet(JUnit4Provider.java:141)
	at org.apache.maven.surefire.junit4.JUnit4Provider.invoke(JUnit4Provider.java:112)
	at sun.reflect.NativeMethodAccessorImpl.invoke0(Native Method)
	at sun.reflect.NativeMethodAccessorImpl.invoke(NativeMethodAccessorImpl.java:39)
	at sun.reflect.DelegatingMethodAccessorImpl.invoke(DelegatingMethodAccessorImpl.java:25)
	at java.lang.reflect.Method.invoke(Method.java:597)
	at org.apache.maven.surefire.util.ReflectionUtils.invokeMethodWithArray(ReflectionUtils.java:189)
	at org.apache.maven.surefire.booter.ProviderFactory$ProviderProxy.invoke(ProviderFactory.java:165)
	at org.apache.maven.surefire.booter.ProviderFactory.invokeProvider(ProviderFactory.java:85)
	at org.apache.maven.surefire.booter.ForkedBooter.runSuitesInProcess(ForkedBooter.java:115)
	at org.apache.maven.surefire.booter.ForkedBooter.main(ForkedBooter.java:75)


FAILED:  org.apache.hadoop.mapred.TestClusterMapReduceTestCase.testMRConfig

Error Message:
unable to create new native thread

Stack Trace:
java.lang.OutOfMemoryError: unable to create new native thread
	at java.lang.Thread.start0(Native Method)
	at java.lang.Thread.start(Thread.java:640)
	at org.apache.hadoop.hdfs.server.namenode.FSImage.saveFSImageInAllDirs(FSImage.java:897)
	at org.apache.hadoop.hdfs.server.namenode.FSImage.saveFSImageInAllDirs(FSImage.java:873)
	at org.apache.hadoop.hdfs.server.namenode.FSImage.format(FSImage.java:145)
	at org.apache.hadoop.hdfs.server.namenode.NameNode.format(NameNode.java:757)
	at org.apache.hadoop.hdfs.server.namenode.NameNode.format(NameNode.java:258)
	at org.apache.hadoop.hdfs.DFSTestUtil.formatNameNode(DFSTestUtil.java:145)
	at org.apache.hadoop.hdfs.MiniDFSCluster.createNameNodesAndSetConf(MiniDFSCluster.java:778)
	at org.apache.hadoop.hdfs.MiniDFSCluster.initMiniDFSCluster(MiniDFSCluster.java:645)
	at org.apache.hadoop.hdfs.MiniDFSCluster.<init>(MiniDFSCluster.java:335)
	at org.apache.hadoop.hdfs.MiniDFSCluster$Builder.build(MiniDFSCluster.java:317)
	at org.apache.hadoop.mapred.ClusterMapReduceTestCase.startCluster(ClusterMapReduceTestCase.java:81)
	at org.apache.hadoop.mapred.ClusterMapReduceTestCase.setUp(ClusterMapReduceTestCase.java:56)
	at junit.framework.TestCase.runBare(TestCase.java:132)
	at junit.framework.TestResult$1.protect(TestResult.java:110)
	at junit.framework.TestResult.runProtected(TestResult.java:128)
	at junit.framework.TestResult.run(TestResult.java:113)
	at junit.framework.TestCase.run(TestCase.java:124)
	at junit.framework.TestSuite.runTest(TestSuite.java:243)
	at junit.framework.TestSuite.run(TestSuite.java:238)
	at org.junit.internal.runners.JUnit38ClassRunner.run(JUnit38ClassRunner.java:83)
	at org.apache.maven.surefire.junit4.JUnit4Provider.execute(JUnit4Provider.java:252)
	at org.apache.maven.surefire.junit4.JUnit4Provider.executeTestSet(JUnit4Provider.java:141)
	at org.apache.maven.surefire.junit4.JUnit4Provider.invoke(JUnit4Provider.java:112)
	at sun.reflect.NativeMethodAccessorImpl.invoke0(Native Method)
	at sun.reflect.NativeMethodAccessorImpl.invoke(NativeMethodAccessorImpl.java:39)
	at sun.reflect.DelegatingMethodAccessorImpl.invoke(DelegatingMethodAccessorImpl.java:25)
	at java.lang.reflect.Method.invoke(Method.java:597)
	at org.apache.maven.surefire.util.ReflectionUtils.invokeMethodWithArray(ReflectionUtils.java:189)
	at org.apache.maven.surefire.booter.ProviderFactory$ProviderProxy.invoke(ProviderFactory.java:165)
	at org.apache.maven.surefire.booter.ProviderFactory.invokeProvider(ProviderFactory.java:85)
	at org.apache.maven.surefire.booter.ForkedBooter.runSuitesInProcess(ForkedBooter.java:115)
	at org.apache.maven.surefire.booter.ForkedBooter.main(ForkedBooter.java:75)


FAILED:  org.apache.hadoop.mapred.TestJobCleanup.org.apache.hadoop.mapred.TestJobCleanup

Error Message:
Failed to Start org.apache.hadoop.mapred.MiniMRCluster

Stack Trace:
org.apache.hadoop.yarn.YarnException: Failed to Start org.apache.hadoop.mapred.MiniMRCluster
	at org.apache.hadoop.yarn.service.CompositeService.start(CompositeService.java:78)
	at org.apache.hadoop.mapred.MiniMRClientClusterFactory.create(MiniMRClientClusterFactory.java:75)
	at org.apache.hadoop.mapred.MiniMRCluster.<init>(MiniMRCluster.java:180)
	at org.apache.hadoop.mapred.MiniMRCluster.<init>(MiniMRCluster.java:170)
	at org.apache.hadoop.mapred.MiniMRCluster.<init>(MiniMRCluster.java:162)
	at org.apache.hadoop.mapred.MiniMRCluster.<init>(MiniMRCluster.java:123)
	at org.apache.hadoop.mapred.TestJobCleanup.setUp(TestJobCleanup.java:73)
	at sun.reflect.NativeMethodAccessorImpl.invoke0(Native Method)
	at sun.reflect.NativeMethodAccessorImpl.invoke(NativeMethodAccessorImpl.java:39)
	at sun.reflect.DelegatingMethodAccessorImpl.invoke(DelegatingMethodAccessorImpl.java:25)
	at java.lang.reflect.Method.invoke(Method.java:597)
	at org.junit.runners.model.FrameworkMethod$1.runReflectiveCall(FrameworkMethod.java:44)
	at org.junit.internal.runners.model.ReflectiveCallable.run(ReflectiveCallable.java:15)
	at org.junit.runners.model.FrameworkMethod.invokeExplosively(FrameworkMethod.java:41)
	at org.junit.internal.runners.statements.RunBefores.evaluate(RunBefores.java:27)
	at org.junit.internal.runners.statements.RunAfters.evaluate(RunAfters.java:31)
	at org.junit.runners.ParentRunner.run(ParentRunner.java:236)
	at org.apache.maven.surefire.junit4.JUnit4Provider.execute(JUnit4Provider.java:252)
	at org.apache.maven.surefire.junit4.JUnit4Provider.executeTestSet(JUnit4Provider.java:141)
	at org.apache.maven.surefire.junit4.JUnit4Provider.invoke(JUnit4Provider.java:112)
	at sun.reflect.NativeMethodAccessorImpl.invoke0(Native Method)
	at sun.reflect.NativeMethodAccessorImpl.invoke(NativeMethodAccessorImpl.java:39)
	at sun.reflect.DelegatingMethodAccessorImpl.invoke(DelegatingMethodAccessorImpl.java:25)
	at java.lang.reflect.Method.invoke(Method.java:597)
	at org.apache.maven.surefire.util.ReflectionUtils.invokeMethodWithArray(ReflectionUtils.java:189)
	at org.apache.maven.surefire.booter.ProviderFactory$ProviderProxy.invoke(ProviderFactory.java:165)
	at org.apache.maven.surefire.booter.ProviderFactory.invokeProvider(ProviderFactory.java:85)
	at org.apache.maven.surefire.booter.ForkedBooter.runSuitesInProcess(ForkedBooter.java:115)
	at org.apache.maven.surefire.booter.ForkedBooter.main(ForkedBooter.java:75)
Caused by: org.apache.hadoop.yarn.YarnException: java.io.IOException: ResourceManager failed to start. Final state is INITED
	at org.apache.hadoop.yarn.server.MiniYARNCluster$ResourceManagerWrapper.start(MiniYARNCluster.java:181)
	at org.apache.hadoop.yarn.service.CompositeService.start(CompositeService.java:68)
	... 28 more
Caused by: java.io.IOException: ResourceManager failed to start. Final state is INITED
	at org.apache.hadoop.yarn.server.MiniYARNCluster$ResourceManagerWrapper.start(MiniYARNCluster.java:175)
	... 29 more


FAILED:  org.apache.hadoop.mapred.TestJobName.testComplexName

Error Message:
Failed to Start org.apache.hadoop.mapred.ClusterMapReduceTestCaseConfigurableMiniMRCluster

Stack Trace:
org.apache.hadoop.yarn.YarnException: Failed to Start org.apache.hadoop.mapred.ClusterMapReduceTestCaseConfigurableMiniMRCluster
	at org.apache.hadoop.yarn.service.CompositeService.start(CompositeService.java:78)
	at org.apache.hadoop.mapred.MiniMRClientClusterFactory.create(MiniMRClientClusterFactory.java:75)
	at org.apache.hadoop.mapred.MiniMRCluster.<init>(MiniMRCluster.java:180)
	at org.apache.hadoop.mapred.MiniMRCluster.<init>(MiniMRCluster.java:170)
	at org.apache.hadoop.mapred.MiniMRCluster.<init>(MiniMRCluster.java:162)
	at org.apache.hadoop.mapred.ClusterMapReduceTestCase$ConfigurableMiniMRCluster.<init>(ClusterMapReduceTestCase.java:101)
	at org.apache.hadoop.mapred.ClusterMapReduceTestCase.startCluster(ClusterMapReduceTestCase.java:86)
	at org.apache.hadoop.mapred.ClusterMapReduceTestCase.setUp(ClusterMapReduceTestCase.java:56)
	at junit.framework.TestCase.runBare(TestCase.java:132)
	at junit.framework.TestResult$1.protect(TestResult.java:110)
	at junit.framework.TestResult.runProtected(TestResult.java:128)
	at junit.framework.TestResult.run(TestResult.java:113)
	at junit.framework.TestCase.run(TestCase.java:124)
	at junit.framework.TestSuite.runTest(TestSuite.java:243)
	at junit.framework.TestSuite.run(TestSuite.java:238)
	at org.junit.internal.runners.JUnit38ClassRunner.run(JUnit38ClassRunner.java:83)
	at org.apache.maven.surefire.junit4.JUnit4Provider.execute(JUnit4Provider.java:252)
	at org.apache.maven.surefire.junit4.JUnit4Provider.executeTestSet(JUnit4Provider.java:141)
	at org.apache.maven.surefire.junit4.JUnit4Provider.invoke(JUnit4Provider.java:112)
	at sun.reflect.NativeMethodAccessorImpl.invoke0(Native Method)
	at sun.reflect.NativeMethodAccessorImpl.invoke(NativeMethodAccessorImpl.java:39)
	at sun.reflect.DelegatingMethodAccessorImpl.invoke(DelegatingMethodAccessorImpl.java:25)
	at java.lang.reflect.Method.invoke(Method.java:597)
	at org.apache.maven.surefire.util.ReflectionUtils.invokeMethodWithArray(ReflectionUtils.java:189)
	at org.apache.maven.surefire.booter.ProviderFactory$ProviderProxy.invoke(ProviderFactory.java:165)
	at org.apache.maven.surefire.booter.ProviderFactory.invokeProvider(ProviderFactory.java:85)
	at org.apache.maven.surefire.booter.ForkedBooter.runSuitesInProcess(ForkedBooter.java:115)
	at org.apache.maven.surefire.booter.ForkedBooter.main(ForkedBooter.java:75)
Caused by: org.apache.hadoop.yarn.YarnException: java.io.IOException: ResourceManager failed to start. Final state is INITED
	at org.apache.hadoop.yarn.server.MiniYARNCluster$ResourceManagerWrapper.start(MiniYARNCluster.java:181)
	at org.apache.hadoop.yarn.service.CompositeService.start(CompositeService.java:68)
	... 27 more
Caused by: java.io.IOException: ResourceManager failed to start. Final state is INITED
	at org.apache.hadoop.yarn.server.MiniYARNCluster$ResourceManagerWrapper.start(MiniYARNCluster.java:175)
	... 28 more


FAILED:  org.apache.hadoop.mapred.TestJobName.testComplexNameWithRegex

Error Message:
Failed to Start org.apache.hadoop.mapred.ClusterMapReduceTestCaseConfigurableMiniMRCluster

Stack Trace:
org.apache.hadoop.yarn.YarnException: Failed to Start org.apache.hadoop.mapred.ClusterMapReduceTestCaseConfigurableMiniMRCluster
	at org.apache.hadoop.yarn.service.CompositeService.start(CompositeService.java:78)
	at org.apache.hadoop.mapred.MiniMRClientClusterFactory.create(MiniMRClientClusterFactory.java:75)
	at org.apache.hadoop.mapred.MiniMRCluster.<init>(MiniMRCluster.java:180)
	at org.apache.hadoop.mapred.MiniMRCluster.<init>(MiniMRCluster.java:170)
	at org.apache.hadoop.mapred.MiniMRCluster.<init>(MiniMRCluster.java:162)
	at org.apache.hadoop.mapred.ClusterMapReduceTestCase$ConfigurableMiniMRCluster.<init>(ClusterMapReduceTestCase.java:101)
	at org.apache.hadoop.mapred.ClusterMapReduceTestCase.startCluster(ClusterMapReduceTestCase.java:86)
	at org.apache.hadoop.mapred.ClusterMapReduceTestCase.setUp(ClusterMapReduceTestCase.java:56)
	at junit.framework.TestCase.runBare(TestCase.java:132)
	at junit.framework.TestResult$1.protect(TestResult.java:110)
	at junit.framework.TestResult.runProtected(TestResult.java:128)
	at junit.framework.TestResult.run(TestResult.java:113)
	at junit.framework.TestCase.run(TestCase.java:124)
	at junit.framework.TestSuite.runTest(TestSuite.java:243)
	at junit.framework.TestSuite.run(TestSuite.java:238)
	at org.junit.internal.runners.JUnit38ClassRunner.run(JUnit38ClassRunner.java:83)
	at org.apache.maven.surefire.junit4.JUnit4Provider.execute(JUnit4Provider.java:252)
	at org.apache.maven.surefire.junit4.JUnit4Provider.executeTestSet(JUnit4Provider.java:141)
	at org.apache.maven.surefire.junit4.JUnit4Provider.invoke(JUnit4Provider.java:112)
	at sun.reflect.NativeMethodAccessorImpl.invoke0(Native Method)
	at sun.reflect.NativeMethodAccessorImpl.invoke(NativeMethodAccessorImpl.java:39)
	at sun.reflect.DelegatingMethodAccessorImpl.invoke(DelegatingMethodAccessorImpl.java:25)
	at java.lang.reflect.Method.invoke(Method.java:597)
	at org.apache.maven.surefire.util.ReflectionUtils.invokeMethodWithArray(ReflectionUtils.java:189)
	at org.apache.maven.surefire.booter.ProviderFactory$ProviderProxy.invoke(ProviderFactory.java:165)
	at org.apache.maven.surefire.booter.ProviderFactory.invokeProvider(ProviderFactory.java:85)
	at org.apache.maven.surefire.booter.ForkedBooter.runSuitesInProcess(ForkedBooter.java:115)
	at org.apache.maven.surefire.booter.ForkedBooter.main(ForkedBooter.java:75)
Caused by: org.apache.hadoop.yarn.YarnException: java.io.IOException: ResourceManager failed to start. Final state is INITED
	at org.apache.hadoop.yarn.server.MiniYARNCluster$ResourceManagerWrapper.start(MiniYARNCluster.java:181)
	at org.apache.hadoop.yarn.service.CompositeService.start(CompositeService.java:68)
	... 27 more
Caused by: java.io.IOException: ResourceManager failed to start. Final state is INITED
	at org.apache.hadoop.yarn.server.MiniYARNCluster$ResourceManagerWrapper.start(MiniYARNCluster.java:175)
	... 28 more


FAILED:  org.apache.hadoop.mapred.TestMiniMRBringup.testBringUp

Error Message:
Failed to Start org.apache.hadoop.mapred.MiniMRCluster

Stack Trace:
org.apache.hadoop.yarn.YarnException: Failed to Start org.apache.hadoop.mapred.MiniMRCluster
	at org.apache.hadoop.yarn.service.CompositeService.start(CompositeService.java:78)
	at org.apache.hadoop.mapred.MiniMRClientClusterFactory.create(MiniMRClientClusterFactory.java:75)
	at org.apache.hadoop.mapred.MiniMRCluster.<init>(MiniMRCluster.java:180)
	at org.apache.hadoop.mapred.MiniMRCluster.<init>(MiniMRCluster.java:170)
	at org.apache.hadoop.mapred.MiniMRCluster.<init>(MiniMRCluster.java:162)
	at org.apache.hadoop.mapred.MiniMRCluster.<init>(MiniMRCluster.java:154)
	at org.apache.hadoop.mapred.MiniMRCluster.<init>(MiniMRCluster.java:147)
	at org.apache.hadoop.mapred.MiniMRCluster.<init>(MiniMRCluster.java:140)
	at org.apache.hadoop.mapred.MiniMRCluster.<init>(MiniMRCluster.java:133)
	at org.apache.hadoop.mapred.MiniMRCluster.<init>(MiniMRCluster.java:128)
	at org.apache.hadoop.mapred.TestMiniMRBringup.testBringUp(TestMiniMRBringup.java:32)
	at sun.reflect.NativeMethodAccessorImpl.invoke0(Native Method)
	at sun.reflect.NativeMethodAccessorImpl.invoke(NativeMethodAccessorImpl.java:39)
	at sun.reflect.DelegatingMethodAccessorImpl.invoke(DelegatingMethodAccessorImpl.java:25)
	at java.lang.reflect.Method.invoke(Method.java:597)
	at junit.framework.TestCase.runTest(TestCase.java:168)
	at junit.framework.TestCase.runBare(TestCase.java:134)
	at junit.framework.TestResult$1.protect(TestResult.java:110)
	at junit.framework.TestResult.runProtected(TestResult.java:128)
	at junit.framework.TestResult.run(TestResult.java:113)
	at junit.framework.TestCase.run(TestCase.java:124)
	at junit.framework.TestSuite.runTest(TestSuite.java:243)
	at junit.framework.TestSuite.run(TestSuite.java:238)
	at org.junit.internal.runners.JUnit38ClassRunner.run(JUnit38ClassRunner.java:83)
	at org.apache.maven.surefire.junit4.JUnit4Provider.execute(JUnit4Provider.java:252)
	at org.apache.maven.surefire.junit4.JUnit4Provider.executeTestSet(JUnit4Provider.java:141)
	at org.apache.maven.surefire.junit4.JUnit4Provider.invoke(JUnit4Provider.java:112)
	at sun.reflect.NativeMethodAccessorImpl.invoke0(Native Method)
	at sun.reflect.NativeMethodAccessorImpl.invoke(NativeMethodAccessorImpl.java:39)
	at sun.reflect.DelegatingMethodAccessorImpl.invoke(DelegatingMethodAccessorImpl.java:25)
	at java.lang.reflect.Method.invoke(Method.java:597)
	at org.apache.maven.surefire.util.ReflectionUtils.invokeMethodWithArray(ReflectionUtils.java:189)
	at org.apache.maven.surefire.booter.ProviderFactory$ProviderProxy.invoke(ProviderFactory.java:165)
	at org.apache.maven.surefire.booter.ProviderFactory.invokeProvider(ProviderFactory.java:85)
	at org.apache.maven.surefire.booter.ForkedBooter.runSuitesInProcess(ForkedBooter.java:115)
	at org.apache.maven.surefire.booter.ForkedBooter.main(ForkedBooter.java:75)
Caused by: org.apache.hadoop.yarn.YarnException: java.io.IOException: ResourceManager failed to start. Final state is INITED
	at org.apache.hadoop.yarn.server.MiniYARNCluster$ResourceManagerWrapper.start(MiniYARNCluster.java:181)
	at org.apache.hadoop.yarn.service.CompositeService.start(CompositeService.java:68)
	... 35 more
Caused by: java.io.IOException: ResourceManager failed to start. Final state is INITED
	at org.apache.hadoop.yarn.server.MiniYARNCluster$ResourceManagerWrapper.start(MiniYARNCluster.java:175)
	... 36 more


FAILED:  org.apache.hadoop.mapred.TestMiniMRChildTask.org.apache.hadoop.mapred.TestMiniMRChildTask

Error Message:
Failed to Start org.apache.hadoop.mapred.TestMiniMRChildTask

Stack Trace:
org.apache.hadoop.yarn.YarnException: Failed to Start org.apache.hadoop.mapred.TestMiniMRChildTask
	at org.apache.hadoop.yarn.service.CompositeService.start(CompositeService.java:78)
	at org.apache.hadoop.mapred.TestMiniMRChildTask.setup(TestMiniMRChildTask.java:314)
	at sun.reflect.NativeMethodAccessorImpl.invoke0(Native Method)
	at sun.reflect.NativeMethodAccessorImpl.invoke(NativeMethodAccessorImpl.java:39)
	at sun.reflect.DelegatingMethodAccessorImpl.invoke(DelegatingMethodAccessorImpl.java:25)
	at java.lang.reflect.Method.invoke(Method.java:597)
	at org.junit.runners.model.FrameworkMethod$1.runReflectiveCall(FrameworkMethod.java:44)
	at org.junit.internal.runners.model.ReflectiveCallable.run(ReflectiveCallable.java:15)
	at org.junit.runners.model.FrameworkMethod.invokeExplosively(FrameworkMethod.java:41)
	at org.junit.internal.runners.statements.RunBefores.evaluate(RunBefores.java:27)
	at org.junit.internal.runners.statements.RunAfters.evaluate(RunAfters.java:31)
	at org.junit.runners.ParentRunner.run(ParentRunner.java:236)
	at org.apache.maven.surefire.junit4.JUnit4Provider.execute(JUnit4Provider.java:252)
	at org.apache.maven.surefire.junit4.JUnit4Provider.executeTestSet(JUnit4Provider.java:141)
	at org.apache.maven.surefire.junit4.JUnit4Provider.invoke(JUnit4Provider.java:112)
	at sun.reflect.NativeMethodAccessorImpl.invoke0(Native Method)
	at sun.reflect.NativeMethodAccessorImpl.invoke(NativeMethodAccessorImpl.java:39)
	at sun.reflect.DelegatingMethodAccessorImpl.invoke(DelegatingMethodAccessorImpl.java:25)
	at java.lang.reflect.Method.invoke(Method.java:597)
	at org.apache.maven.surefire.util.ReflectionUtils.invokeMethodWithArray(ReflectionUtils.java:189)
	at org.apache.maven.surefire.booter.ProviderFactory$ProviderProxy.invoke(ProviderFactory.java:165)
	at org.apache.maven.surefire.booter.ProviderFactory.invokeProvider(ProviderFactory.java:85)
	at org.apache.maven.surefire.booter.ForkedBooter.runSuitesInProcess(ForkedBooter.java:115)
	at org.apache.maven.surefire.booter.ForkedBooter.main(ForkedBooter.java:75)
Caused by: org.apache.hadoop.yarn.YarnException: java.io.IOException: ResourceManager failed to start. Final state is INITED
	at org.apache.hadoop.yarn.server.MiniYARNCluster$ResourceManagerWrapper.start(MiniYARNCluster.java:181)
	at org.apache.hadoop.yarn.service.CompositeService.start(CompositeService.java:68)
	... 23 more
Caused by: java.io.IOException: ResourceManager failed to start. Final state is INITED
	at org.apache.hadoop.yarn.server.MiniYARNCluster$ResourceManagerWrapper.start(MiniYARNCluster.java:175)
	... 24 more


FAILED:  org.apache.hadoop.mapred.TestReduceFetchFromPartialMem$1.org.apache.hadoop.mapred.TestReduceFetchFromPartialMem

Error Message:
Failed to Start org.apache.hadoop.mapred.MiniMRCluster

Stack Trace:
org.apache.hadoop.yarn.YarnException: Failed to Start org.apache.hadoop.mapred.MiniMRCluster
	at org.apache.hadoop.yarn.service.CompositeService.start(CompositeService.java:78)
	at org.apache.hadoop.mapred.MiniMRClientClusterFactory.create(MiniMRClientClusterFactory.java:75)
	at org.apache.hadoop.mapred.MiniMRCluster.<init>(MiniMRCluster.java:180)
	at org.apache.hadoop.mapred.MiniMRCluster.<init>(MiniMRCluster.java:170)
	at org.apache.hadoop.mapred.MiniMRCluster.<init>(MiniMRCluster.java:162)
	at org.apache.hadoop.mapred.MiniMRCluster.<init>(MiniMRCluster.java:154)
	at org.apache.hadoop.mapred.MiniMRCluster.<init>(MiniMRCluster.java:147)
	at org.apache.hadoop.mapred.MiniMRCluster.<init>(MiniMRCluster.java:140)
	at org.apache.hadoop.mapred.MiniMRCluster.<init>(MiniMRCluster.java:133)
	at org.apache.hadoop.mapred.MiniMRCluster.<init>(MiniMRCluster.java:128)
	at org.apache.hadoop.mapred.TestReduceFetchFromPartialMem$1.setUp(TestReduceFetchFromPartialMem.java:61)
	at junit.extensions.TestSetup$1.protect(TestSetup.java:22)
	at junit.framework.TestResult.runProtected(TestResult.java:128)
	at junit.extensions.TestSetup.run(TestSetup.java:27)
	at org.junit.internal.runners.JUnit38ClassRunner.run(JUnit38ClassRunner.java:83)
	at org.apache.maven.surefire.junit4.JUnit4Provider.execute(JUnit4Provider.java:252)
	at org.apache.maven.surefire.junit4.JUnit4Provider.executeTestSet(JUnit4Provider.java:141)
	at org.apache.maven.surefire.junit4.JUnit4Provider.invoke(JUnit4Provider.java:112)
	at sun.reflect.NativeMethodAccessorImpl.invoke0(Native Method)
	at sun.reflect.NativeMethodAccessorImpl.invoke(NativeMethodAccessorImpl.java:39)
	at sun.reflect.DelegatingMethodAccessorImpl.invoke(DelegatingMethodAccessorImpl.java:25)
	at java.lang.reflect.Method.invoke(Method.java:597)
	at org.apache.maven.surefire.util.ReflectionUtils.invokeMethodWithArray(ReflectionUtils.java:189)
	at org.apache.maven.surefire.booter.ProviderFactory$ProviderProxy.invoke(ProviderFactory.java:165)
	at org.apache.maven.surefire.booter.ProviderFactory.invokeProvider(ProviderFactory.java:85)
	at org.apache.maven.surefire.booter.ForkedBooter.runSuitesInProcess(ForkedBooter.java:115)
	at org.apache.maven.surefire.booter.ForkedBooter.main(ForkedBooter.java:75)
Caused by: org.apache.hadoop.yarn.YarnException: java.io.IOException: ResourceManager failed to start. Final state is INITED
	at org.apache.hadoop.yarn.server.MiniYARNCluster$ResourceManagerWrapper.start(MiniYARNCluster.java:181)
	at org.apache.hadoop.yarn.service.CompositeService.start(CompositeService.java:68)
	... 26 more
Caused by: java.io.IOException: ResourceManager failed to start. Final state is INITED
	at org.apache.hadoop.yarn.server.MiniYARNCluster$ResourceManagerWrapper.start(MiniYARNCluster.java:175)
	... 27 more


FAILED:  org.apache.hadoop.mapred.TestSpecialCharactersInOutputPath.testJobWithDFS

Error Message:
Failed to Start org.apache.hadoop.mapred.MiniMRCluster

Stack Trace:
org.apache.hadoop.yarn.YarnException: Failed to Start org.apache.hadoop.mapred.MiniMRCluster
	at org.apache.hadoop.yarn.service.CompositeService.start(CompositeService.java:78)
	at org.apache.hadoop.mapred.MiniMRClientClusterFactory.create(MiniMRClientClusterFactory.java:75)
	at org.apache.hadoop.mapred.MiniMRCluster.<init>(MiniMRCluster.java:180)
	at org.apache.hadoop.mapred.MiniMRCluster.<init>(MiniMRCluster.java:170)
	at org.apache.hadoop.mapred.MiniMRCluster.<init>(MiniMRCluster.java:162)
	at org.apache.hadoop.mapred.MiniMRCluster.<init>(MiniMRCluster.java:154)
	at org.apache.hadoop.mapred.MiniMRCluster.<init>(MiniMRCluster.java:147)
	at org.apache.hadoop.mapred.MiniMRCluster.<init>(MiniMRCluster.java:140)
	at org.apache.hadoop.mapred.MiniMRCluster.<init>(MiniMRCluster.java:133)
	at org.apache.hadoop.mapred.MiniMRCluster.<init>(MiniMRCluster.java:128)
	at org.apache.hadoop.mapred.TestSpecialCharactersInOutputPath.testJobWithDFS(TestSpecialCharactersInOutputPath.java:112)
	at sun.reflect.NativeMethodAccessorImpl.invoke0(Native Method)
	at sun.reflect.NativeMethodAccessorImpl.invoke(NativeMethodAccessorImpl.java:39)
	at sun.reflect.DelegatingMethodAccessorImpl.invoke(DelegatingMethodAccessorImpl.java:25)
	at java.lang.reflect.Method.invoke(Method.java:597)
	at junit.framework.TestCase.runTest(TestCase.java:168)
	at junit.framework.TestCase.runBare(TestCase.java:134)
	at junit.framework.TestResult$1.protect(TestResult.java:110)
	at junit.framework.TestResult.runProtected(TestResult.java:128)
	at junit.framework.TestResult.run(TestResult.java:113)
	at junit.framework.TestCase.run(TestCase.java:124)
	at junit.framework.TestSuite.runTest(TestSuite.java:243)
	at junit.framework.TestSuite.run(TestSuite.java:238)
	at org.junit.internal.runners.JUnit38ClassRunner.run(JUnit38ClassRunner.java:83)
	at org.apache.maven.surefire.junit4.JUnit4Provider.execute(JUnit4Provider.java:252)
	at org.apache.maven.surefire.junit4.JUnit4Provider.executeTestSet(JUnit4Provider.java:141)
	at org.apache.maven.surefire.junit4.JUnit4Provider.invoke(JUnit4Provider.java:112)
	at sun.reflect.NativeMethodAccessorImpl.invoke0(Native Method)
	at sun.reflect.NativeMethodAccessorImpl.invoke(NativeMethodAccessorImpl.java:39)
	at sun.reflect.DelegatingMethodAccessorImpl.invoke(DelegatingMethodAccessorImpl.java:25)
	at java.lang.reflect.Method.invoke(Method.java:597)
	at org.apache.maven.surefire.util.ReflectionUtils.invokeMethodWithArray(ReflectionUtils.java:189)
	at org.apache.maven.surefire.booter.ProviderFactory$ProviderProxy.invoke(ProviderFactory.java:165)
	at org.apache.maven.surefire.booter.ProviderFactory.invokeProvider(ProviderFactory.java:85)
	at org.apache.maven.surefire.booter.ForkedBooter.runSuitesInProcess(ForkedBooter.java:115)
	at org.apache.maven.surefire.booter.ForkedBooter.main(ForkedBooter.java:75)
Caused by: org.apache.hadoop.yarn.YarnException: java.io.IOException: ResourceManager failed to start. Final state is INITED
	at org.apache.hadoop.yarn.server.MiniYARNCluster$ResourceManagerWrapper.start(MiniYARNCluster.java:181)
	at org.apache.hadoop.yarn.service.CompositeService.start(CompositeService.java:68)
	... 35 more
Caused by: java.io.IOException: ResourceManager failed to start. Final state is INITED
	at org.apache.hadoop.yarn.server.MiniYARNCluster$ResourceManagerWrapper.start(MiniYARNCluster.java:175)
	... 36 more


FAILED:  org.apache.hadoop.mapreduce.TestChild.testChild

Error Message:
Failed to Start org.apache.hadoop.mapred.MiniMRCluster

Stack Trace:
org.apache.hadoop.yarn.YarnException: Failed to Start org.apache.hadoop.mapred.MiniMRCluster
	at org.apache.hadoop.yarn.service.CompositeService.start(CompositeService.java:78)
	at org.apache.hadoop.mapred.MiniMRClientClusterFactory.create(MiniMRClientClusterFactory.java:75)
	at org.apache.hadoop.mapred.MiniMRCluster.<init>(MiniMRCluster.java:180)
	at org.apache.hadoop.mapred.MiniMRCluster.<init>(MiniMRCluster.java:170)
	at org.apache.hadoop.mapred.MiniMRCluster.<init>(MiniMRCluster.java:162)
	at org.apache.hadoop.mapred.MiniMRCluster.<init>(MiniMRCluster.java:154)
	at org.apache.hadoop.mapred.MiniMRCluster.<init>(MiniMRCluster.java:147)
	at org.apache.hadoop.mapred.MiniMRCluster.<init>(MiniMRCluster.java:140)
	at org.apache.hadoop.mapred.MiniMRCluster.<init>(MiniMRCluster.java:133)
	at org.apache.hadoop.mapred.MiniMRCluster.<init>(MiniMRCluster.java:128)
	at org.apache.hadoop.mapred.HadoopTestCase.setUp(HadoopTestCase.java:156)
	at junit.framework.TestCase.runBare(TestCase.java:132)
	at junit.framework.TestResult$1.protect(TestResult.java:110)
	at junit.framework.TestResult.runProtected(TestResult.java:128)
	at junit.framework.TestResult.run(TestResult.java:113)
	at junit.framework.TestCase.run(TestCase.java:124)
	at junit.framework.TestSuite.runTest(TestSuite.java:243)
	at junit.framework.TestSuite.run(TestSuite.java:238)
	at org.junit.internal.runners.JUnit38ClassRunner.run(JUnit38ClassRunner.java:83)
	at org.apache.maven.surefire.junit4.JUnit4Provider.execute(JUnit4Provider.java:252)
	at org.apache.maven.surefire.junit4.JUnit4Provider.executeTestSet(JUnit4Provider.java:141)
	at org.apache.maven.surefire.junit4.JUnit4Provider.invoke(JUnit4Provider.java:112)
	at sun.reflect.NativeMethodAccessorImpl.invoke0(Native Method)
	at sun.reflect.NativeMethodAccessorImpl.invoke(NativeMethodAccessorImpl.java:39)
	at sun.reflect.DelegatingMethodAccessorImpl.invoke(DelegatingMethodAccessorImpl.java:25)
	at java.lang.reflect.Method.invoke(Method.java:597)
	at org.apache.maven.surefire.util.ReflectionUtils.invokeMethodWithArray(ReflectionUtils.java:189)
	at org.apache.maven.surefire.booter.ProviderFactory$ProviderProxy.invoke(ProviderFactory.java:165)
	at org.apache.maven.surefire.booter.ProviderFactory.invokeProvider(ProviderFactory.java:85)
	at org.apache.maven.surefire.booter.ForkedBooter.runSuitesInProcess(ForkedBooter.java:115)
	at org.apache.maven.surefire.booter.ForkedBooter.main(ForkedBooter.java:75)
Caused by: org.apache.hadoop.yarn.YarnException: java.io.IOException: ResourceManager failed to start. Final state is INITED
	at org.apache.hadoop.yarn.server.MiniYARNCluster$ResourceManagerWrapper.start(MiniYARNCluster.java:181)
	at org.apache.hadoop.yarn.service.CompositeService.start(CompositeService.java:68)
	... 30 more
Caused by: java.io.IOException: ResourceManager failed to start. Final state is INITED
	at org.apache.hadoop.yarn.server.MiniYARNCluster$ResourceManagerWrapper.start(MiniYARNCluster.java:175)
	... 31 more


FAILED:  org.apache.hadoop.mapreduce.TestMapReduceLazyOutput.testLazyOutput

Error Message:
Failed to Start org.apache.hadoop.mapred.MiniMRCluster

Stack Trace:
org.apache.hadoop.yarn.YarnException: Failed to Start org.apache.hadoop.mapred.MiniMRCluster
	at org.apache.hadoop.yarn.service.CompositeService.start(CompositeService.java:78)
	at org.apache.hadoop.mapred.MiniMRClientClusterFactory.create(MiniMRClientClusterFactory.java:75)
	at org.apache.hadoop.mapred.MiniMRCluster.<init>(MiniMRCluster.java:180)
	at org.apache.hadoop.mapred.MiniMRCluster.<init>(MiniMRCluster.java:170)
	at org.apache.hadoop.mapred.MiniMRCluster.<init>(MiniMRCluster.java:162)
	at org.apache.hadoop.mapred.MiniMRCluster.<init>(MiniMRCluster.java:154)
	at org.apache.hadoop.mapred.MiniMRCluster.<init>(MiniMRCluster.java:147)
	at org.apache.hadoop.mapred.MiniMRCluster.<init>(MiniMRCluster.java:140)
	at org.apache.hadoop.mapred.MiniMRCluster.<init>(MiniMRCluster.java:133)
	at org.apache.hadoop.mapred.MiniMRCluster.<init>(MiniMRCluster.java:128)
	at org.apache.hadoop.mapreduce.TestMapReduceLazyOutput.testLazyOutput(TestMapReduceLazyOutput.java:136)
	at sun.reflect.NativeMethodAccessorImpl.invoke0(Native Method)
	at sun.reflect.NativeMethodAccessorImpl.invoke(NativeMethodAccessorImpl.java:39)
	at sun.reflect.DelegatingMethodAccessorImpl.invoke(DelegatingMethodAccessorImpl.java:25)
	at java.lang.reflect.Method.invoke(Method.java:597)
	at junit.framework.TestCase.runTest(TestCase.java:168)
	at junit.framework.TestCase.runBare(TestCase.java:134)
	at junit.framework.TestResult$1.protect(TestResult.java:110)
	at junit.framework.TestResult.runProtected(TestResult.java:128)
	at junit.framework.TestResult.run(TestResult.java:113)
	at junit.framework.TestCase.run(TestCase.java:124)
	at junit.framework.TestSuite.runTest(TestSuite.java:243)
	at junit.framework.TestSuite.run(TestSuite.java:238)
	at org.junit.internal.runners.JUnit38ClassRunner.run(JUnit38ClassRunner.java:83)
	at org.apache.maven.surefire.junit4.JUnit4Provider.execute(JUnit4Provider.java:252)
	at org.apache.maven.surefire.junit4.JUnit4Provider.executeTestSet(JUnit4Provider.java:141)
	at org.apache.maven.surefire.junit4.JUnit4Provider.invoke(JUnit4Provider.java:112)
	at sun.reflect.NativeMethodAccessorImpl.invoke0(Native Method)
	at sun.reflect.NativeMethodAccessorImpl.invoke(NativeMethodAccessorImpl.java:39)
	at sun.reflect.DelegatingMethodAccessorImpl.invoke(DelegatingMethodAccessorImpl.java:25)
	at java.lang.reflect.Method.invoke(Method.java:597)
	at org.apache.maven.surefire.util.ReflectionUtils.invokeMethodWithArray(ReflectionUtils.java:189)
	at org.apache.maven.surefire.booter.ProviderFactory$ProviderProxy.invoke(ProviderFactory.java:165)
	at org.apache.maven.surefire.booter.ProviderFactory.invokeProvider(ProviderFactory.java:85)
	at org.apache.maven.surefire.booter.ForkedBooter.runSuitesInProcess(ForkedBooter.java:115)
	at org.apache.maven.surefire.booter.ForkedBooter.main(ForkedBooter.java:75)
Caused by: org.apache.hadoop.yarn.YarnException: java.io.IOException: ResourceManager failed to start. Final state is INITED
	at org.apache.hadoop.yarn.server.MiniYARNCluster$ResourceManagerWrapper.start(MiniYARNCluster.java:181)
	at org.apache.hadoop.yarn.service.CompositeService.start(CompositeService.java:68)
	... 35 more
Caused by: java.io.IOException: ResourceManager failed to start. Final state is INITED
	at org.apache.hadoop.yarn.server.MiniYARNCluster$ResourceManagerWrapper.start(MiniYARNCluster.java:175)
	... 36 more


FAILED:  org.apache.hadoop.mapreduce.lib.output.TestJobOutputCommitter.testDefaultCleanupAndAbort

Error Message:
Failed to Start org.apache.hadoop.mapred.MiniMRCluster

Stack Trace:
org.apache.hadoop.yarn.YarnException: Failed to Start org.apache.hadoop.mapred.MiniMRCluster
	at org.apache.hadoop.yarn.service.CompositeService.start(CompositeService.java:78)
	at org.apache.hadoop.mapred.MiniMRClientClusterFactory.create(MiniMRClientClusterFactory.java:75)
	at org.apache.hadoop.mapred.MiniMRCluster.<init>(MiniMRCluster.java:180)
	at org.apache.hadoop.mapred.MiniMRCluster.<init>(MiniMRCluster.java:170)
	at org.apache.hadoop.mapred.MiniMRCluster.<init>(MiniMRCluster.java:162)
	at org.apache.hadoop.mapred.MiniMRCluster.<init>(MiniMRCluster.java:154)
	at org.apache.hadoop.mapred.MiniMRCluster.<init>(MiniMRCluster.java:147)
	at org.apache.hadoop.mapred.MiniMRCluster.<init>(MiniMRCluster.java:140)
	at org.apache.hadoop.mapred.MiniMRCluster.<init>(MiniMRCluster.java:133)
	at org.apache.hadoop.mapred.MiniMRCluster.<init>(MiniMRCluster.java:128)
	at org.apache.hadoop.mapred.HadoopTestCase.setUp(HadoopTestCase.java:156)
	at org.apache.hadoop.mapreduce.lib.output.TestJobOutputCommitter.setUp(TestJobOutputCommitter.java:59)
	at junit.framework.TestCase.runBare(TestCase.java:132)
	at junit.framework.TestResult$1.protect(TestResult.java:110)
	at junit.framework.TestResult.runProtected(TestResult.java:128)
	at junit.framework.TestResult.run(TestResult.java:113)
	at junit.framework.TestCase.run(TestCase.java:124)
	at junit.framework.TestSuite.runTest(TestSuite.java:243)
	at junit.framework.TestSuite.run(TestSuite.java:238)
	at org.junit.internal.runners.JUnit38ClassRunner.run(JUnit38ClassRunner.java:83)
	at org.apache.maven.surefire.junit4.JUnit4Provider.execute(JUnit4Provider.java:252)
	at org.apache.maven.surefire.junit4.JUnit4Provider.executeTestSet(JUnit4Provider.java:141)
	at org.apache.maven.surefire.junit4.JUnit4Provider.invoke(JUnit4Provider.java:112)
	at sun.reflect.NativeMethodAccessorImpl.invoke0(Native Method)
	at sun.reflect.NativeMethodAccessorImpl.invoke(NativeMethodAccessorImpl.java:39)
	at sun.reflect.DelegatingMethodAccessorImpl.invoke(DelegatingMethodAccessorImpl.java:25)
	at java.lang.reflect.Method.invoke(Method.java:597)
	at org.apache.maven.surefire.util.ReflectionUtils.invokeMethodWithArray(ReflectionUtils.java:189)
	at org.apache.maven.surefire.booter.ProviderFactory$ProviderProxy.invoke(ProviderFactory.java:165)
	at org.apache.maven.surefire.booter.ProviderFactory.invokeProvider(ProviderFactory.java:85)
	at org.apache.maven.surefire.booter.ForkedBooter.runSuitesInProcess(ForkedBooter.java:115)
	at org.apache.maven.surefire.booter.ForkedBooter.main(ForkedBooter.java:75)
Caused by: org.apache.hadoop.yarn.YarnException: java.io.IOException: ResourceManager failed to start. Final state is INITED
	at org.apache.hadoop.yarn.server.MiniYARNCluster$ResourceManagerWrapper.start(MiniYARNCluster.java:181)
	at org.apache.hadoop.yarn.service.CompositeService.start(CompositeService.java:68)
	... 31 more
Caused by: java.io.IOException: ResourceManager failed to start. Final state is INITED
	at org.apache.hadoop.yarn.server.MiniYARNCluster$ResourceManagerWrapper.start(MiniYARNCluster.java:175)
	... 32 more


FAILED:  org.apache.hadoop.mapreduce.lib.output.TestJobOutputCommitter.testCustomAbort

Error Message:
Failed to Start org.apache.hadoop.mapred.MiniMRCluster

Stack Trace:
org.apache.hadoop.yarn.YarnException: Failed to Start org.apache.hadoop.mapred.MiniMRCluster
	at org.apache.hadoop.yarn.service.CompositeService.start(CompositeService.java:78)
	at org.apache.hadoop.mapred.MiniMRClientClusterFactory.create(MiniMRClientClusterFactory.java:75)
	at org.apache.hadoop.mapred.MiniMRCluster.<init>(MiniMRCluster.java:180)
	at org.apache.hadoop.mapred.MiniMRCluster.<init>(MiniMRCluster.java:170)
	at org.apache.hadoop.mapred.MiniMRCluster.<init>(MiniMRCluster.java:162)
	at org.apache.hadoop.mapred.MiniMRCluster.<init>(MiniMRCluster.java:154)
	at org.apache.hadoop.mapred.MiniMRCluster.<init>(MiniMRCluster.java:147)
	at org.apache.hadoop.mapred.MiniMRCluster.<init>(MiniMRCluster.java:140)
	at org.apache.hadoop.mapred.MiniMRCluster.<init>(MiniMRCluster.java:133)
	at org.apache.hadoop.mapred.MiniMRCluster.<init>(MiniMRCluster.java:128)
	at org.apache.hadoop.mapred.HadoopTestCase.setUp(HadoopTestCase.java:156)
	at org.apache.hadoop.mapreduce.lib.output.TestJobOutputCommitter.setUp(TestJobOutputCommitter.java:59)
	at junit.framework.TestCase.runBare(TestCase.java:132)
	at junit.framework.TestResult$1.protect(TestResult.java:110)
	at junit.framework.TestResult.runProtected(TestResult.java:128)
	at junit.framework.TestResult.run(TestResult.java:113)
	at junit.framework.TestCase.run(TestCase.java:124)
	at junit.framework.TestSuite.runTest(TestSuite.java:243)
	at junit.framework.TestSuite.run(TestSuite.java:238)
	at org.junit.internal.runners.JUnit38ClassRunner.run(JUnit38ClassRunner.java:83)
	at org.apache.maven.surefire.junit4.JUnit4Provider.execute(JUnit4Provider.java:252)
	at org.apache.maven.surefire.junit4.JUnit4Provider.executeTestSet(JUnit4Provider.java:141)
	at org.apache.maven.surefire.junit4.JUnit4Provider.invoke(JUnit4Provider.java:112)
	at sun.reflect.NativeMethodAccessorImpl.invoke0(Native Method)
	at sun.reflect.NativeMethodAccessorImpl.invoke(NativeMethodAccessorImpl.java:39)
	at sun.reflect.DelegatingMethodAccessorImpl.invoke(DelegatingMethodAccessorImpl.java:25)
	at java.lang.reflect.Method.invoke(Method.java:597)
	at org.apache.maven.surefire.util.ReflectionUtils.invokeMethodWithArray(ReflectionUtils.java:189)
	at org.apache.maven.surefire.booter.ProviderFactory$ProviderProxy.invoke(ProviderFactory.java:165)
	at org.apache.maven.surefire.booter.ProviderFactory.invokeProvider(ProviderFactory.java:85)
	at org.apache.maven.surefire.booter.ForkedBooter.runSuitesInProcess(ForkedBooter.java:115)
	at org.apache.maven.surefire.booter.ForkedBooter.main(ForkedBooter.java:75)
Caused by: org.apache.hadoop.yarn.YarnException: java.io.IOException: ResourceManager failed to start. Final state is INITED
	at org.apache.hadoop.yarn.server.MiniYARNCluster$ResourceManagerWrapper.start(MiniYARNCluster.java:181)
	at org.apache.hadoop.yarn.service.CompositeService.start(CompositeService.java:68)
	... 31 more
Caused by: java.io.IOException: ResourceManager failed to start. Final state is INITED
	at org.apache.hadoop.yarn.server.MiniYARNCluster$ResourceManagerWrapper.start(MiniYARNCluster.java:175)
	... 32 more


FAILED:  org.apache.hadoop.mapreduce.lib.output.TestJobOutputCommitter.testCustomCleanup

Error Message:
Failed to Start org.apache.hadoop.mapred.MiniMRCluster

Stack Trace:
org.apache.hadoop.yarn.YarnException: Failed to Start org.apache.hadoop.mapred.MiniMRCluster
	at org.apache.hadoop.yarn.service.CompositeService.start(CompositeService.java:78)
	at org.apache.hadoop.mapred.MiniMRClientClusterFactory.create(MiniMRClientClusterFactory.java:75)
	at org.apache.hadoop.mapred.MiniMRCluster.<init>(MiniMRCluster.java:180)
	at org.apache.hadoop.mapred.MiniMRCluster.<init>(MiniMRCluster.java:170)
	at org.apache.hadoop.mapred.MiniMRCluster.<init>(MiniMRCluster.java:162)
	at org.apache.hadoop.mapred.MiniMRCluster.<init>(MiniMRCluster.java:154)
	at org.apache.hadoop.mapred.MiniMRCluster.<init>(MiniMRCluster.java:147)
	at org.apache.hadoop.mapred.MiniMRCluster.<init>(MiniMRCluster.java:140)
	at org.apache.hadoop.mapred.MiniMRCluster.<init>(MiniMRCluster.java:133)
	at org.apache.hadoop.mapred.MiniMRCluster.<init>(MiniMRCluster.java:128)
	at org.apache.hadoop.mapred.HadoopTestCase.setUp(HadoopTestCase.java:156)
	at org.apache.hadoop.mapreduce.lib.output.TestJobOutputCommitter.setUp(TestJobOutputCommitter.java:59)
	at junit.framework.TestCase.runBare(TestCase.java:132)
	at junit.framework.TestResult$1.protect(TestResult.java:110)
	at junit.framework.TestResult.runProtected(TestResult.java:128)
	at junit.framework.TestResult.run(TestResult.java:113)
	at junit.framework.TestCase.run(TestCase.java:124)
	at junit.framework.TestSuite.runTest(TestSuite.java:243)
	at junit.framework.TestSuite.run(TestSuite.java:238)
	at org.junit.internal.runners.JUnit38ClassRunner.run(JUnit38ClassRunner.java:83)
	at org.apache.maven.surefire.junit4.JUnit4Provider.execute(JUnit4Provider.java:252)
	at org.apache.maven.surefire.junit4.JUnit4Provider.executeTestSet(JUnit4Provider.java:141)
	at org.apache.maven.surefire.junit4.JUnit4Provider.invoke(JUnit4Provider.java:112)
	at sun.reflect.NativeMethodAccessorImpl.invoke0(Native Method)
	at sun.reflect.NativeMethodAccessorImpl.invoke(NativeMethodAccessorImpl.java:39)
	at sun.reflect.DelegatingMethodAccessorImpl.invoke(DelegatingMethodAccessorImpl.java:25)
	at java.lang.reflect.Method.invoke(Method.java:597)
	at org.apache.maven.surefire.util.ReflectionUtils.invokeMethodWithArray(ReflectionUtils.java:189)
	at org.apache.maven.surefire.booter.ProviderFactory$ProviderProxy.invoke(ProviderFactory.java:165)
	at org.apache.maven.surefire.booter.ProviderFactory.invokeProvider(ProviderFactory.java:85)
	at org.apache.maven.surefire.booter.ForkedBooter.runSuitesInProcess(ForkedBooter.java:115)
	at org.apache.maven.surefire.booter.ForkedBooter.main(ForkedBooter.java:75)
Caused by: org.apache.hadoop.yarn.YarnException: java.io.IOException: ResourceManager failed to start. Final state is INITED
	at org.apache.hadoop.yarn.server.MiniYARNCluster$ResourceManagerWrapper.start(MiniYARNCluster.java:181)
	at org.apache.hadoop.yarn.service.CompositeService.start(CompositeService.java:68)
	... 31 more
Caused by: java.io.IOException: ResourceManager failed to start. Final state is INITED
	at org.apache.hadoop.yarn.server.MiniYARNCluster$ResourceManagerWrapper.start(MiniYARNCluster.java:175)
	... 32 more


FAILED:  org.apache.hadoop.mapreduce.security.TestBinaryTokenFile.org.apache.hadoop.mapreduce.security.TestBinaryTokenFile

Error Message:
Failed to Start org.apache.hadoop.mapreduce.security.TestBinaryTokenFile

Stack Trace:
org.apache.hadoop.yarn.YarnException: Failed to Start org.apache.hadoop.mapreduce.security.TestBinaryTokenFile
	at org.apache.hadoop.yarn.service.CompositeService.start(CompositeService.java:78)
	at org.apache.hadoop.mapreduce.security.TestBinaryTokenFile.setUp(TestBinaryTokenFile.java:208)
	at sun.reflect.NativeMethodAccessorImpl.invoke0(Native Method)
	at sun.reflect.NativeMethodAccessorImpl.invoke(NativeMethodAccessorImpl.java:39)
	at sun.reflect.DelegatingMethodAccessorImpl.invoke(DelegatingMethodAccessorImpl.java:25)
	at java.lang.reflect.Method.invoke(Method.java:597)
	at org.junit.runners.model.FrameworkMethod$1.runReflectiveCall(FrameworkMethod.java:44)
	at org.junit.internal.runners.model.ReflectiveCallable.run(ReflectiveCallable.java:15)
	at org.junit.runners.model.FrameworkMethod.invokeExplosively(FrameworkMethod.java:41)
	at org.junit.internal.runners.statements.RunBefores.evaluate(RunBefores.java:27)
	at org.junit.internal.runners.statements.RunAfters.evaluate(RunAfters.java:31)
	at org.junit.runners.ParentRunner.run(ParentRunner.java:236)
	at org.apache.maven.surefire.junit4.JUnit4Provider.execute(JUnit4Provider.java:252)
	at org.apache.maven.surefire.junit4.JUnit4Provider.executeTestSet(JUnit4Provider.java:141)
	at org.apache.maven.surefire.junit4.JUnit4Provider.invoke(JUnit4Provider.java:112)
	at sun.reflect.NativeMethodAccessorImpl.invoke0(Native Method)
	at sun.reflect.NativeMethodAccessorImpl.invoke(NativeMethodAccessorImpl.java:39)
	at sun.reflect.DelegatingMethodAccessorImpl.invoke(DelegatingMethodAccessorImpl.java:25)
	at java.lang.reflect.Method.invoke(Method.java:597)
	at org.apache.maven.surefire.util.ReflectionUtils.invokeMethodWithArray(ReflectionUtils.java:189)
	at org.apache.maven.surefire.booter.ProviderFactory$ProviderProxy.invoke(ProviderFactory.java:165)
	at org.apache.maven.surefire.booter.ProviderFactory.invokeProvider(ProviderFactory.java:85)
	at org.apache.maven.surefire.booter.ForkedBooter.runSuitesInProcess(ForkedBooter.java:115)
	at org.apache.maven.surefire.booter.ForkedBooter.main(ForkedBooter.java:75)
Caused by: org.apache.hadoop.yarn.YarnException: java.io.IOException: ResourceManager failed to start. Final state is INITED
	at org.apache.hadoop.yarn.server.MiniYARNCluster$ResourceManagerWrapper.start(MiniYARNCluster.java:181)
	at org.apache.hadoop.yarn.service.CompositeService.start(CompositeService.java:68)
	... 23 more
Caused by: java.io.IOException: ResourceManager failed to start. Final state is INITED
	at org.apache.hadoop.yarn.server.MiniYARNCluster$ResourceManagerWrapper.start(MiniYARNCluster.java:175)
	... 24 more


FAILED:  org.apache.hadoop.mapreduce.security.TestMRCredentials.org.apache.hadoop.mapreduce.security.TestMRCredentials

Error Message:
Failed to Start org.apache.hadoop.mapreduce.security.TestMRCredentials

Stack Trace:
org.apache.hadoop.yarn.YarnException: Failed to Start org.apache.hadoop.mapreduce.security.TestMRCredentials
	at org.apache.hadoop.yarn.service.CompositeService.start(CompositeService.java:78)
	at org.apache.hadoop.mapred.MiniMRClientClusterFactory.create(MiniMRClientClusterFactory.java:75)
	at org.apache.hadoop.mapreduce.security.TestMRCredentials.setUp(TestMRCredentials.java:64)
	at sun.reflect.NativeMethodAccessorImpl.invoke0(Native Method)
	at sun.reflect.NativeMethodAccessorImpl.invoke(NativeMethodAccessorImpl.java:39)
	at sun.reflect.DelegatingMethodAccessorImpl.invoke(DelegatingMethodAccessorImpl.java:25)
	at java.lang.reflect.Method.invoke(Method.java:597)
	at org.junit.runners.model.FrameworkMethod$1.runReflectiveCall(FrameworkMethod.java:44)
	at org.junit.internal.runners.model.ReflectiveCallable.run(ReflectiveCallable.java:15)
	at org.junit.runners.model.FrameworkMethod.invokeExplosively(FrameworkMethod.java:41)
	at org.junit.internal.runners.statements.RunBefores.evaluate(RunBefores.java:27)
	at org.junit.internal.runners.statements.RunAfters.evaluate(RunAfters.java:31)
	at org.junit.runners.ParentRunner.run(ParentRunner.java:236)
	at org.apache.maven.surefire.junit4.JUnit4Provider.execute(JUnit4Provider.java:252)
	at org.apache.maven.surefire.junit4.JUnit4Provider.executeTestSet(JUnit4Provider.java:141)
	at org.apache.maven.surefire.junit4.JUnit4Provider.invoke(JUnit4Provider.java:112)
	at sun.reflect.NativeMethodAccessorImpl.invoke0(Native Method)
	at sun.reflect.NativeMethodAccessorImpl.invoke(NativeMethodAccessorImpl.java:39)
	at sun.reflect.DelegatingMethodAccessorImpl.invoke(DelegatingMethodAccessorImpl.java:25)
	at java.lang.reflect.Method.invoke(Method.java:597)
	at org.apache.maven.surefire.util.ReflectionUtils.invokeMethodWithArray(ReflectionUtils.java:189)
	at org.apache.maven.surefire.booter.ProviderFactory$ProviderProxy.invoke(ProviderFactory.java:165)
	at org.apache.maven.surefire.booter.ProviderFactory.invokeProvider(ProviderFactory.java:85)
	at org.apache.maven.surefire.booter.ForkedBooter.runSuitesInProcess(ForkedBooter.java:115)
	at org.apache.maven.surefire.booter.ForkedBooter.main(ForkedBooter.java:75)
Caused by: org.apache.hadoop.yarn.YarnException: java.io.IOException: ResourceManager failed to start. Final state is INITED
	at org.apache.hadoop.yarn.server.MiniYARNCluster$ResourceManagerWrapper.start(MiniYARNCluster.java:181)
	at org.apache.hadoop.yarn.service.CompositeService.start(CompositeService.java:68)
	... 24 more
Caused by: java.io.IOException: ResourceManager failed to start. Final state is INITED
	at org.apache.hadoop.yarn.server.MiniYARNCluster$ResourceManagerWrapper.start(MiniYARNCluster.java:175)
	... 25 more


FAILED:  org.apache.hadoop.mapreduce.security.ssl.TestEncryptedShuffle.encryptedShuffleWithClientCerts

Error Message:
Failed to Start org.apache.hadoop.mapreduce.security.ssl.TestEncryptedShuffle

Stack Trace:
org.apache.hadoop.yarn.YarnException: Failed to Start org.apache.hadoop.mapreduce.security.ssl.TestEncryptedShuffle
	at org.apache.hadoop.yarn.service.CompositeService.start(CompositeService.java:78)
	at org.apache.hadoop.mapred.MiniMRClientClusterFactory.create(MiniMRClientClusterFactory.java:75)
	at org.apache.hadoop.mapreduce.security.ssl.TestEncryptedShuffle.startCluster(TestEncryptedShuffle.java:104)
	at org.apache.hadoop.mapreduce.security.ssl.TestEncryptedShuffle.encryptedShuffleWithCerts(TestEncryptedShuffle.java:135)
	at org.apache.hadoop.mapreduce.security.ssl.TestEncryptedShuffle.encryptedShuffleWithClientCerts(TestEncryptedShuffle.java:164)
	at sun.reflect.NativeMethodAccessorImpl.invoke0(Native Method)
	at sun.reflect.NativeMethodAccessorImpl.invoke(NativeMethodAccessorImpl.java:39)
	at sun.reflect.DelegatingMethodAccessorImpl.invoke(DelegatingMethodAccessorImpl.java:25)
	at java.lang.reflect.Method.invoke(Method.java:597)
	at org.junit.runners.model.FrameworkMethod$1.runReflectiveCall(FrameworkMethod.java:44)
	at org.junit.internal.runners.model.ReflectiveCallable.run(ReflectiveCallable.java:15)
	at org.junit.runners.model.FrameworkMethod.invokeExplosively(FrameworkMethod.java:41)
	at org.junit.internal.runners.statements.InvokeMethod.evaluate(InvokeMethod.java:20)
	at org.junit.internal.runners.statements.RunBefores.evaluate(RunBefores.java:28)
	at org.junit.internal.runners.statements.RunAfters.evaluate(RunAfters.java:31)
	at org.junit.runners.BlockJUnit4ClassRunner.runNotIgnored(BlockJUnit4ClassRunner.java:79)
	at org.junit.runners.BlockJUnit4ClassRunner.runChild(BlockJUnit4ClassRunner.java:71)
	at org.junit.runners.BlockJUnit4ClassRunner.runChild(BlockJUnit4ClassRunner.java:49)
	at org.junit.runners.ParentRunner$3.run(ParentRunner.java:193)
	at org.junit.runners.ParentRunner$1.schedule(ParentRunner.java:52)
	at org.junit.runners.ParentRunner.runChildren(ParentRunner.java:191)
	at org.junit.runners.ParentRunner.access$000(ParentRunner.java:42)
	at org.junit.runners.ParentRunner$2.evaluate(ParentRunner.java:184)
	at org.junit.internal.runners.statements.RunBefores.evaluate(RunBefores.java:28)
	at org.junit.runners.ParentRunner.run(ParentRunner.java:236)
	at org.apache.maven.surefire.junit4.JUnit4Provider.execute(JUnit4Provider.java:252)
	at org.apache.maven.surefire.junit4.JUnit4Provider.executeTestSet(JUnit4Provider.java:141)
	at org.apache.maven.surefire.junit4.JUnit4Provider.invoke(JUnit4Provider.java:112)
	at sun.reflect.NativeMethodAccessorImpl.invoke0(Native Method)
	at sun.reflect.NativeMethodAccessorImpl.invoke(NativeMethodAccessorImpl.java:39)
	at sun.reflect.DelegatingMethodAccessorImpl.invoke(DelegatingMethodAccessorImpl.java:25)
	at java.lang.reflect.Method.invoke(Method.java:597)
	at org.apache.maven.surefire.util.ReflectionUtils.invokeMethodWithArray(ReflectionUtils.java:189)
	at org.apache.maven.surefire.booter.ProviderFactory$ProviderProxy.invoke(ProviderFactory.java:165)
	at org.apache.maven.surefire.booter.ProviderFactory.invokeProvider(ProviderFactory.java:85)
	at org.apache.maven.surefire.booter.ForkedBooter.runSuitesInProcess(ForkedBooter.java:115)
	at org.apache.maven.surefire.booter.ForkedBooter.main(ForkedBooter.java:75)
Caused by: org.apache.hadoop.yarn.YarnException: java.io.IOException: ResourceManager failed to start. Final state is INITED
	at org.apache.hadoop.yarn.server.MiniYARNCluster$ResourceManagerWrapper.start(MiniYARNCluster.java:181)
	at org.apache.hadoop.yarn.service.CompositeService.start(CompositeService.java:68)
	... 36 more
Caused by: java.io.IOException: ResourceManager failed to start. Final state is INITED
	at org.apache.hadoop.yarn.server.MiniYARNCluster$ResourceManagerWrapper.start(MiniYARNCluster.java:175)
	... 37 more


FAILED:  org.apache.hadoop.mapreduce.security.ssl.TestEncryptedShuffle.encryptedShuffleWithoutClientCerts

Error Message:
Failed to Start org.apache.hadoop.mapreduce.security.ssl.TestEncryptedShuffle

Stack Trace:
org.apache.hadoop.yarn.YarnException: Failed to Start org.apache.hadoop.mapreduce.security.ssl.TestEncryptedShuffle
	at org.apache.hadoop.yarn.service.CompositeService.start(CompositeService.java:78)
	at org.apache.hadoop.mapred.MiniMRClientClusterFactory.create(MiniMRClientClusterFactory.java:75)
	at org.apache.hadoop.mapreduce.security.ssl.TestEncryptedShuffle.startCluster(TestEncryptedShuffle.java:104)
	at org.apache.hadoop.mapreduce.security.ssl.TestEncryptedShuffle.encryptedShuffleWithCerts(TestEncryptedShuffle.java:135)
	at org.apache.hadoop.mapreduce.security.ssl.TestEncryptedShuffle.encryptedShuffleWithoutClientCerts(TestEncryptedShuffle.java:169)
	at sun.reflect.NativeMethodAccessorImpl.invoke0(Native Method)
	at sun.reflect.NativeMethodAccessorImpl.invoke(NativeMethodAccessorImpl.java:39)
	at sun.reflect.DelegatingMethodAccessorImpl.invoke(DelegatingMethodAccessorImpl.java:25)
	at java.lang.reflect.Method.invoke(Method.java:597)
	at org.junit.runners.model.FrameworkMethod$1.runReflectiveCall(FrameworkMethod.java:44)
	at org.junit.internal.runners.model.ReflectiveCallable.run(ReflectiveCallable.java:15)
	at org.junit.runners.model.FrameworkMethod.invokeExplosively(FrameworkMethod.java:41)
	at org.junit.internal.runners.statements.InvokeMethod.evaluate(InvokeMethod.java:20)
	at org.junit.internal.runners.statements.RunBefores.evaluate(RunBefores.java:28)
	at org.junit.internal.runners.statements.RunAfters.evaluate(RunAfters.java:31)
	at org.junit.runners.BlockJUnit4ClassRunner.runNotIgnored(BlockJUnit4ClassRunner.java:79)
	at org.junit.runners.BlockJUnit4ClassRunner.runChild(BlockJUnit4ClassRunner.java:71)
	at org.junit.runners.BlockJUnit4ClassRunner.runChild(BlockJUnit4ClassRunner.java:49)
	at org.junit.runners.ParentRunner$3.run(ParentRunner.java:193)
	at org.junit.runners.ParentRunner$1.schedule(ParentRunner.java:52)
	at org.junit.runners.ParentRunner.runChildren(ParentRunner.java:191)
	at org.junit.runners.ParentRunner.access$000(ParentRunner.java:42)
	at org.junit.runners.ParentRunner$2.evaluate(ParentRunner.java:184)
	at org.junit.internal.runners.statements.RunBefores.evaluate(RunBefores.java:28)
	at org.junit.runners.ParentRunner.run(ParentRunner.java:236)
	at org.apache.maven.surefire.junit4.JUnit4Provider.execute(JUnit4Provider.java:252)
	at org.apache.maven.surefire.junit4.JUnit4Provider.executeTestSet(JUnit4Provider.java:141)
	at org.apache.maven.surefire.junit4.JUnit4Provider.invoke(JUnit4Provider.java:112)
	at sun.reflect.NativeMethodAccessorImpl.invoke0(Native Method)
	at sun.reflect.NativeMethodAccessorImpl.invoke(NativeMethodAccessorImpl.java:39)
	at sun.reflect.DelegatingMethodAccessorImpl.invoke(DelegatingMethodAccessorImpl.java:25)
	at java.lang.reflect.Method.invoke(Method.java:597)
	at org.apache.maven.surefire.util.ReflectionUtils.invokeMethodWithArray(ReflectionUtils.java:189)
	at org.apache.maven.surefire.booter.ProviderFactory$ProviderProxy.invoke(ProviderFactory.java:165)
	at org.apache.maven.surefire.booter.ProviderFactory.invokeProvider(ProviderFactory.java:85)
	at org.apache.maven.surefire.booter.ForkedBooter.runSuitesInProcess(ForkedBooter.java:115)
	at org.apache.maven.surefire.booter.ForkedBooter.main(ForkedBooter.java:75)
Caused by: org.apache.hadoop.yarn.YarnException: java.io.IOException: ResourceManager failed to start. Final state is INITED
	at org.apache.hadoop.yarn.server.MiniYARNCluster$ResourceManagerWrapper.start(MiniYARNCluster.java:181)
	at org.apache.hadoop.yarn.service.CompositeService.start(CompositeService.java:68)
	... 36 more
Caused by: java.io.IOException: ResourceManager failed to start. Final state is INITED
	at org.apache.hadoop.yarn.server.MiniYARNCluster$ResourceManagerWrapper.start(MiniYARNCluster.java:175)
	... 37 more


FAILED:  org.apache.hadoop.mapreduce.v2.TestMRAppWithCombiner.org.apache.hadoop.mapreduce.v2.TestMRAppWithCombiner

Error Message:
Failed to Start org.apache.hadoop.mapreduce.v2.TestMRJobs

Stack Trace:
org.apache.hadoop.yarn.YarnException: Failed to Start org.apache.hadoop.mapreduce.v2.TestMRJobs
	at org.apache.hadoop.yarn.service.CompositeService.start(CompositeService.java:78)
	at org.apache.hadoop.mapreduce.v2.TestMRAppWithCombiner.setup(TestMRAppWithCombiner.java:80)
	at sun.reflect.NativeMethodAccessorImpl.invoke0(Native Method)
	at sun.reflect.NativeMethodAccessorImpl.invoke(NativeMethodAccessorImpl.java:39)
	at sun.reflect.DelegatingMethodAccessorImpl.invoke(DelegatingMethodAccessorImpl.java:25)
	at java.lang.reflect.Method.invoke(Method.java:597)
	at org.junit.runners.model.FrameworkMethod$1.runReflectiveCall(FrameworkMethod.java:44)
	at org.junit.internal.runners.model.ReflectiveCallable.run(ReflectiveCallable.java:15)
	at org.junit.runners.model.FrameworkMethod.invokeExplosively(FrameworkMethod.java:41)
	at org.junit.internal.runners.statements.RunBefores.evaluate(RunBefores.java:27)
	at org.junit.internal.runners.statements.RunAfters.evaluate(RunAfters.java:31)
	at org.junit.runners.ParentRunner.run(ParentRunner.java:236)
	at org.apache.maven.surefire.junit4.JUnit4Provider.execute(JUnit4Provider.java:252)
	at org.apache.maven.surefire.junit4.JUnit4Provider.executeTestSet(JUnit4Provider.java:141)
	at org.apache.maven.surefire.junit4.JUnit4Provider.invoke(JUnit4Provider.java:112)
	at sun.reflect.NativeMethodAccessorImpl.invoke0(Native Method)
	at sun.reflect.NativeMethodAccessorImpl.invoke(NativeMethodAccessorImpl.java:39)
	at sun.reflect.DelegatingMethodAccessorImpl.invoke(DelegatingMethodAccessorImpl.java:25)
	at java.lang.reflect.Method.invoke(Method.java:597)
	at org.apache.maven.surefire.util.ReflectionUtils.invokeMethodWithArray(ReflectionUtils.java:189)
	at org.apache.maven.surefire.booter.ProviderFactory$ProviderProxy.invoke(ProviderFactory.java:165)
	at org.apache.maven.surefire.booter.ProviderFactory.invokeProvider(ProviderFactory.java:85)
	at org.apache.maven.surefire.booter.ForkedBooter.runSuitesInProcess(ForkedBooter.java:115)
	at org.apache.maven.surefire.booter.ForkedBooter.main(ForkedBooter.java:75)
Caused by: org.apache.hadoop.yarn.YarnException: java.io.IOException: ResourceManager failed to start. Final state is INITED
	at org.apache.hadoop.yarn.server.MiniYARNCluster$ResourceManagerWrapper.start(MiniYARNCluster.java:181)
	at org.apache.hadoop.yarn.service.CompositeService.start(CompositeService.java:68)
	... 23 more
Caused by: java.io.IOException: ResourceManager failed to start. Final state is INITED
	at org.apache.hadoop.yarn.server.MiniYARNCluster$ResourceManagerWrapper.start(MiniYARNCluster.java:175)
	... 24 more


FAILED:  org.apache.hadoop.mapreduce.v2.TestMRJobs.org.apache.hadoop.mapreduce.v2.TestMRJobs

Error Message:
Failed to Start org.apache.hadoop.mapreduce.v2.TestMRJobs

Stack Trace:
org.apache.hadoop.yarn.YarnException: Failed to Start org.apache.hadoop.mapreduce.v2.TestMRJobs
	at org.apache.hadoop.yarn.service.CompositeService.start(CompositeService.java:78)
	at org.apache.hadoop.mapreduce.v2.TestMRJobs.setup(TestMRJobs.java:122)
	at sun.reflect.NativeMethodAccessorImpl.invoke0(Native Method)
	at sun.reflect.NativeMethodAccessorImpl.invoke(NativeMethodAccessorImpl.java:39)
	at sun.reflect.DelegatingMethodAccessorImpl.invoke(DelegatingMethodAccessorImpl.java:25)
	at java.lang.reflect.Method.invoke(Method.java:597)
	at org.junit.runners.model.FrameworkMethod$1.runReflectiveCall(FrameworkMethod.java:44)
	at org.junit.internal.runners.model.ReflectiveCallable.run(ReflectiveCallable.java:15)
	at org.junit.runners.model.FrameworkMethod.invokeExplosively(FrameworkMethod.java:41)
	at org.junit.internal.runners.statements.RunBefores.evaluate(RunBefores.java:27)
	at org.junit.internal.runners.statements.RunAfters.evaluate(RunAfters.java:31)
	at org.junit.runners.ParentRunner.run(ParentRunner.java:236)
	at org.apache.maven.surefire.junit4.JUnit4Provider.execute(JUnit4Provider.java:252)
	at org.apache.maven.surefire.junit4.JUnit4Provider.executeTestSet(JUnit4Provider.java:141)
	at org.apache.maven.surefire.junit4.JUnit4Provider.invoke(JUnit4Provider.java:112)
	at sun.reflect.NativeMethodAccessorImpl.invoke0(Native Method)
	at sun.reflect.NativeMethodAccessorImpl.invoke(NativeMethodAccessorImpl.java:39)
	at sun.reflect.DelegatingMethodAccessorImpl.invoke(DelegatingMethodAccessorImpl.java:25)
	at java.lang.reflect.Method.invoke(Method.java:597)
	at org.apache.maven.surefire.util.ReflectionUtils.invokeMethodWithArray(ReflectionUtils.java:189)
	at org.apache.maven.surefire.booter.ProviderFactory$ProviderProxy.invoke(ProviderFactory.java:165)
	at org.apache.maven.surefire.booter.ProviderFactory.invokeProvider(ProviderFactory.java:85)
	at org.apache.maven.surefire.booter.ForkedBooter.runSuitesInProcess(ForkedBooter.java:115)
	at org.apache.maven.surefire.booter.ForkedBooter.main(ForkedBooter.java:75)
Caused by: org.apache.hadoop.yarn.YarnException: java.io.IOException: ResourceManager failed to start. Final state is INITED
	at org.apache.hadoop.yarn.server.MiniYARNCluster$ResourceManagerWrapper.start(MiniYARNCluster.java:181)
	at org.apache.hadoop.yarn.service.CompositeService.start(CompositeService.java:68)
	... 23 more
Caused by: java.io.IOException: ResourceManager failed to start. Final state is INITED
	at org.apache.hadoop.yarn.server.MiniYARNCluster$ResourceManagerWrapper.start(MiniYARNCluster.java:175)
	... 24 more


FAILED:  org.apache.hadoop.mapreduce.v2.TestMRJobsWithHistoryService.testJobHistoryData

Error Message:
Failed to Start org.apache.hadoop.mapreduce.v2.TestMRJobsWithHistoryService

Stack Trace:
org.apache.hadoop.yarn.YarnException: Failed to Start org.apache.hadoop.mapreduce.v2.TestMRJobsWithHistoryService
	at org.apache.hadoop.yarn.service.CompositeService.start(CompositeService.java:78)
	at org.apache.hadoop.mapreduce.v2.TestMRJobsWithHistoryService.setup(TestMRJobsWithHistoryService.java:89)
	at sun.reflect.NativeMethodAccessorImpl.invoke0(Native Method)
	at sun.reflect.NativeMethodAccessorImpl.invoke(NativeMethodAccessorImpl.java:39)
	at sun.reflect.DelegatingMethodAccessorImpl.invoke(DelegatingMethodAccessorImpl.java:25)
	at java.lang.reflect.Method.invoke(Method.java:597)
	at org.junit.runners.model.FrameworkMethod$1.runReflectiveCall(FrameworkMethod.java:44)
	at org.junit.internal.runners.model.ReflectiveCallable.run(ReflectiveCallable.java:15)
	at org.junit.runners.model.FrameworkMethod.invokeExplosively(FrameworkMethod.java:41)
	at org.junit.internal.runners.statements.RunBefores.evaluate(RunBefores.java:27)
	at org.junit.internal.runners.statements.RunAfters.evaluate(RunAfters.java:31)
	at org.junit.runners.BlockJUnit4ClassRunner.runNotIgnored(BlockJUnit4ClassRunner.java:79)
	at org.junit.runners.BlockJUnit4ClassRunner.runChild(BlockJUnit4ClassRunner.java:71)
	at org.junit.runners.BlockJUnit4ClassRunner.runChild(BlockJUnit4ClassRunner.java:49)
	at org.junit.runners.ParentRunner$3.run(ParentRunner.java:193)
	at org.junit.runners.ParentRunner$1.schedule(ParentRunner.java:52)
	at org.junit.runners.ParentRunner.runChildren(ParentRunner.java:191)
	at org.junit.runners.ParentRunner.access$000(ParentRunner.java:42)
	at org.junit.runners.ParentRunner$2.evaluate(ParentRunner.java:184)
	at org.junit.runners.ParentRunner.run(ParentRunner.java:236)
	at org.apache.maven.surefire.junit4.JUnit4Provider.execute(JUnit4Provider.java:252)
	at org.apache.maven.surefire.junit4.JUnit4Provider.executeTestSet(JUnit4Provider.java:141)
	at org.apache.maven.surefire.junit4.JUnit4Provider.invoke(JUnit4Provider.java:112)
	at sun.reflect.NativeMethodAccessorImpl.invoke0(Native Method)
	at sun.reflect.NativeMethodAccessorImpl.invoke(NativeMethodAccessorImpl.java:39)
	at sun.reflect.DelegatingMethodAccessorImpl.invoke(DelegatingMethodAccessorImpl.java:25)
	at java.lang.reflect.Method.invoke(Method.java:597)
	at org.apache.maven.surefire.util.ReflectionUtils.invokeMethodWithArray(ReflectionUtils.java:189)
	at org.apache.maven.surefire.booter.ProviderFactory$ProviderProxy.invoke(ProviderFactory.java:165)
	at org.apache.maven.surefire.booter.ProviderFactory.invokeProvider(ProviderFactory.java:85)
	at org.apache.maven.surefire.booter.ForkedBooter.runSuitesInProcess(ForkedBooter.java:115)
	at org.apache.maven.surefire.booter.ForkedBooter.main(ForkedBooter.java:75)
Caused by: org.apache.hadoop.yarn.YarnException: java.io.IOException: ResourceManager failed to start. Final state is INITED
	at org.apache.hadoop.yarn.server.MiniYARNCluster$ResourceManagerWrapper.start(MiniYARNCluster.java:181)
	at org.apache.hadoop.yarn.service.CompositeService.start(CompositeService.java:68)
	... 31 more
Caused by: java.io.IOException: ResourceManager failed to start. Final state is INITED
	at org.apache.hadoop.yarn.server.MiniYARNCluster$ResourceManagerWrapper.start(MiniYARNCluster.java:175)
	... 32 more


FAILED:  org.apache.hadoop.mapreduce.v2.TestMROldApiJobs.org.apache.hadoop.mapreduce.v2.TestMROldApiJobs

Error Message:
Failed to Start org.apache.hadoop.mapreduce.v2.TestMROldApiJobs

Stack Trace:
org.apache.hadoop.yarn.YarnException: Failed to Start org.apache.hadoop.mapreduce.v2.TestMROldApiJobs
	at org.apache.hadoop.yarn.service.CompositeService.start(CompositeService.java:78)
	at org.apache.hadoop.mapreduce.v2.TestMROldApiJobs.setup(TestMROldApiJobs.java:77)
	at sun.reflect.NativeMethodAccessorImpl.invoke0(Native Method)
	at sun.reflect.NativeMethodAccessorImpl.invoke(NativeMethodAccessorImpl.java:39)
	at sun.reflect.DelegatingMethodAccessorImpl.invoke(DelegatingMethodAccessorImpl.java:25)
	at java.lang.reflect.Method.invoke(Method.java:597)
	at org.junit.runners.model.FrameworkMethod$1.runReflectiveCall(FrameworkMethod.java:44)
	at org.junit.internal.runners.model.ReflectiveCallable.run(ReflectiveCallable.java:15)
	at org.junit.runners.model.FrameworkMethod.invokeExplosively(FrameworkMethod.java:41)
	at org.junit.internal.runners.statements.RunBefores.evaluate(RunBefores.java:27)
	at org.junit.internal.runners.statements.RunAfters.evaluate(RunAfters.java:31)
	at org.junit.runners.ParentRunner.run(ParentRunner.java:236)
	at org.apache.maven.surefire.junit4.JUnit4Provider.execute(JUnit4Provider.java:252)
	at org.apache.maven.surefire.junit4.JUnit4Provider.executeTestSet(JUnit4Provider.java:141)
	at org.apache.maven.surefire.junit4.JUnit4Provider.invoke(JUnit4Provider.java:112)
	at sun.reflect.NativeMethodAccessorImpl.invoke0(Native Method)
	at sun.reflect.NativeMethodAccessorImpl.invoke(NativeMethodAccessorImpl.java:39)
	at sun.reflect.DelegatingMethodAccessorImpl.invoke(DelegatingMethodAccessorImpl.java:25)
	at java.lang.reflect.Method.invoke(Method.java:597)
	at org.apache.maven.surefire.util.ReflectionUtils.invokeMethodWithArray(ReflectionUtils.java:189)
	at org.apache.maven.surefire.booter.ProviderFactory$ProviderProxy.invoke(ProviderFactory.java:165)
	at org.apache.maven.surefire.booter.ProviderFactory.invokeProvider(ProviderFactory.java:85)
	at org.apache.maven.surefire.booter.ForkedBooter.runSuitesInProcess(ForkedBooter.java:115)
	at org.apache.maven.surefire.booter.ForkedBooter.main(ForkedBooter.java:75)
Caused by: org.apache.hadoop.yarn.YarnException: java.io.IOException: ResourceManager failed to start. Final state is INITED
	at org.apache.hadoop.yarn.server.MiniYARNCluster$ResourceManagerWrapper.start(MiniYARNCluster.java:181)
	at org.apache.hadoop.yarn.service.CompositeService.start(CompositeService.java:68)
	... 23 more
Caused by: java.io.IOException: ResourceManager failed to start. Final state is INITED
	at org.apache.hadoop.yarn.server.MiniYARNCluster$ResourceManagerWrapper.start(MiniYARNCluster.java:175)
	... 24 more


FAILED:  org.apache.hadoop.mapreduce.v2.TestMiniMRProxyUser.testValidProxyUser

Error Message:
Failed to Start org.apache.hadoop.mapred.MiniMRCluster

Stack Trace:
org.apache.hadoop.yarn.YarnException: Failed to Start org.apache.hadoop.mapred.MiniMRCluster
	at org.apache.hadoop.yarn.service.CompositeService.start(CompositeService.java:78)
	at org.apache.hadoop.mapred.MiniMRClientClusterFactory.create(MiniMRClientClusterFactory.java:75)
	at org.apache.hadoop.mapred.MiniMRCluster.<init>(MiniMRCluster.java:180)
	at org.apache.hadoop.mapred.MiniMRCluster.<init>(MiniMRCluster.java:170)
	at org.apache.hadoop.mapred.MiniMRCluster.<init>(MiniMRCluster.java:162)
	at org.apache.hadoop.mapreduce.v2.TestMiniMRProxyUser.setUp(TestMiniMRProxyUser.java:85)
	at junit.framework.TestCase.runBare(TestCase.java:132)
	at junit.framework.TestResult$1.protect(TestResult.java:110)
	at junit.framework.TestResult.runProtected(TestResult.java:128)
	at junit.framework.TestResult.run(TestResult.java:113)
	at junit.framework.TestCase.run(TestCase.java:124)
	at junit.framework.TestSuite.runTest(TestSuite.java:243)
	at junit.framework.TestSuite.run(TestSuite.java:238)
	at org.junit.internal.runners.JUnit38ClassRunner.run(JUnit38ClassRunner.java:83)
	at org.apache.maven.surefire.junit4.JUnit4Provider.execute(JUnit4Provider.java:252)
	at org.apache.maven.surefire.junit4.JUnit4Provider.executeTestSet(JUnit4Provider.java:141)
	at org.apache.maven.surefire.junit4.JUnit4Provider.invoke(JUnit4Provider.java:112)
	at sun.reflect.NativeMethodAccessorImpl.invoke0(Native Method)
	at sun.reflect.NativeMethodAccessorImpl.invoke(NativeMethodAccessorImpl.java:39)
	at sun.reflect.DelegatingMethodAccessorImpl.invoke(DelegatingMethodAccessorImpl.java:25)
	at java.lang.reflect.Method.invoke(Method.java:597)
	at org.apache.maven.surefire.util.ReflectionUtils.invokeMethodWithArray(ReflectionUtils.java:189)
	at org.apache.maven.surefire.booter.ProviderFactory$ProviderProxy.invoke(ProviderFactory.java:165)
	at org.apache.maven.surefire.booter.ProviderFactory.invokeProvider(ProviderFactory.java:85)
	at org.apache.maven.surefire.booter.ForkedBooter.runSuitesInProcess(ForkedBooter.java:115)
	at org.apache.maven.surefire.booter.ForkedBooter.main(ForkedBooter.java:75)
Caused by: org.apache.hadoop.yarn.YarnException: java.io.IOException: ResourceManager failed to start. Final state is INITED
	at org.apache.hadoop.yarn.server.MiniYARNCluster$ResourceManagerWrapper.start(MiniYARNCluster.java:181)
	at org.apache.hadoop.yarn.service.CompositeService.start(CompositeService.java:68)
	... 25 more
Caused by: java.io.IOException: ResourceManager failed to start. Final state is INITED
	at org.apache.hadoop.yarn.server.MiniYARNCluster$ResourceManagerWrapper.start(MiniYARNCluster.java:175)
	... 26 more


FAILED:  org.apache.hadoop.mapreduce.v2.TestNonExistentJob.testGetInvalidJob

Error Message:
Failed to Start org.apache.hadoop.mapred.MiniMRCluster

Stack Trace:
org.apache.hadoop.yarn.YarnException: Failed to Start org.apache.hadoop.mapred.MiniMRCluster
	at org.apache.hadoop.yarn.service.CompositeService.start(CompositeService.java:78)
	at org.apache.hadoop.mapred.MiniMRClientClusterFactory.create(MiniMRClientClusterFactory.java:75)
	at org.apache.hadoop.mapred.MiniMRCluster.<init>(MiniMRCluster.java:180)
	at org.apache.hadoop.mapred.MiniMRCluster.<init>(MiniMRCluster.java:170)
	at org.apache.hadoop.mapred.MiniMRCluster.<init>(MiniMRCluster.java:162)
	at org.apache.hadoop.mapreduce.v2.TestNonExistentJob.setUp(TestNonExistentJob.java:79)
	at junit.framework.TestCase.runBare(TestCase.java:132)
	at junit.framework.TestResult$1.protect(TestResult.java:110)
	at junit.framework.TestResult.runProtected(TestResult.java:128)
	at junit.framework.TestResult.run(TestResult.java:113)
	at junit.framework.TestCase.run(TestCase.java:124)
	at junit.framework.TestSuite.runTest(TestSuite.java:243)
	at junit.framework.TestSuite.run(TestSuite.java:238)
	at org.junit.internal.runners.JUnit38ClassRunner.run(JUnit38ClassRunner.java:83)
	at org.apache.maven.surefire.junit4.JUnit4Provider.execute(JUnit4Provider.java:252)
	at org.apache.maven.surefire.junit4.JUnit4Provider.executeTestSet(JUnit4Provider.java:141)
	at org.apache.maven.surefire.junit4.JUnit4Provider.invoke(JUnit4Provider.java:112)
	at sun.reflect.NativeMethodAccessorImpl.invoke0(Native Method)
	at sun.reflect.NativeMethodAccessorImpl.invoke(NativeMethodAccessorImpl.java:39)
	at sun.reflect.DelegatingMethodAccessorImpl.invoke(DelegatingMethodAccessorImpl.java:25)
	at java.lang.reflect.Method.invoke(Method.java:597)
	at org.apache.maven.surefire.util.ReflectionUtils.invokeMethodWithArray(ReflectionUtils.java:189)
	at org.apache.maven.surefire.booter.ProviderFactory$ProviderProxy.invoke(ProviderFactory.java:165)
	at org.apache.maven.surefire.booter.ProviderFactory.invokeProvider(ProviderFactory.java:85)
	at org.apache.maven.surefire.booter.ForkedBooter.runSuitesInProcess(ForkedBooter.java:115)
	at org.apache.maven.surefire.booter.ForkedBooter.main(ForkedBooter.java:75)
Caused by: org.apache.hadoop.yarn.YarnException: java.io.IOException: ResourceManager failed to start. Final state is INITED
	at org.apache.hadoop.yarn.server.MiniYARNCluster$ResourceManagerWrapper.start(MiniYARNCluster.java:181)
	at org.apache.hadoop.yarn.service.CompositeService.start(CompositeService.java:68)
	... 25 more
Caused by: java.io.IOException: ResourceManager failed to start. Final state is INITED
	at org.apache.hadoop.yarn.server.MiniYARNCluster$ResourceManagerWrapper.start(MiniYARNCluster.java:175)
	... 26 more


FAILED:  org.apache.hadoop.mapreduce.v2.TestRMNMInfo.org.apache.hadoop.mapreduce.v2.TestRMNMInfo

Error Message:
Failed to Start org.apache.hadoop.mapreduce.v2.TestRMNMInfo

Stack Trace:
org.apache.hadoop.yarn.YarnException: Failed to Start org.apache.hadoop.mapreduce.v2.TestRMNMInfo
	at org.apache.hadoop.yarn.service.CompositeService.start(CompositeService.java:78)
	at org.apache.hadoop.mapreduce.v2.TestRMNMInfo.setup(TestRMNMInfo.java:80)
	at sun.reflect.NativeMethodAccessorImpl.invoke0(Native Method)
	at sun.reflect.NativeMethodAccessorImpl.invoke(NativeMethodAccessorImpl.java:39)
	at sun.reflect.DelegatingMethodAccessorImpl.invoke(DelegatingMethodAccessorImpl.java:25)
	at java.lang.reflect.Method.invoke(Method.java:597)
	at org.junit.runners.model.FrameworkMethod$1.runReflectiveCall(FrameworkMethod.java:44)
	at org.junit.internal.runners.model.ReflectiveCallable.run(ReflectiveCallable.java:15)
	at org.junit.runners.model.FrameworkMethod.invokeExplosively(FrameworkMethod.java:41)
	at org.junit.internal.runners.statements.RunBefores.evaluate(RunBefores.java:27)
	at org.junit.internal.runners.statements.RunAfters.evaluate(RunAfters.java:31)
	at org.junit.runners.ParentRunner.run(ParentRunner.java:236)
	at org.apache.maven.surefire.junit4.JUnit4Provider.execute(JUnit4Provider.java:252)
	at org.apache.maven.surefire.junit4.JUnit4Provider.executeTestSet(JUnit4Provider.java:141)
	at org.apache.maven.surefire.junit4.JUnit4Provider.invoke(JUnit4Provider.java:112)
	at sun.reflect.NativeMethodAccessorImpl.invoke0(Native Method)
	at sun.reflect.NativeMethodAccessorImpl.invoke(NativeMethodAccessorImpl.java:39)
	at sun.reflect.DelegatingMethodAccessorImpl.invoke(DelegatingMethodAccessorImpl.java:25)
	at java.lang.reflect.Method.invoke(Method.java:597)
	at org.apache.maven.surefire.util.ReflectionUtils.invokeMethodWithArray(ReflectionUtils.java:189)
	at org.apache.maven.surefire.booter.ProviderFactory$ProviderProxy.invoke(ProviderFactory.java:165)
	at org.apache.maven.surefire.booter.ProviderFactory.invokeProvider(ProviderFactory.java:85)
	at org.apache.maven.surefire.booter.ForkedBooter.runSuitesInProcess(ForkedBooter.java:115)
	at org.apache.maven.surefire.booter.ForkedBooter.main(ForkedBooter.java:75)
Caused by: org.apache.hadoop.yarn.YarnException: java.io.IOException: ResourceManager failed to start. Final state is INITED
	at org.apache.hadoop.yarn.server.MiniYARNCluster$ResourceManagerWrapper.start(MiniYARNCluster.java:181)
	at org.apache.hadoop.yarn.service.CompositeService.start(CompositeService.java:68)
	... 23 more
Caused by: java.io.IOException: ResourceManager failed to start. Final state is INITED
	at org.apache.hadoop.yarn.server.MiniYARNCluster$ResourceManagerWrapper.start(MiniYARNCluster.java:175)
	... 24 more


FAILED:  org.apache.hadoop.mapreduce.v2.TestSpeculativeExecution.org.apache.hadoop.mapreduce.v2.TestSpeculativeExecution

Error Message:
Failed to Start org.apache.hadoop.mapreduce.v2.TestSpeculativeExecution

Stack Trace:
org.apache.hadoop.yarn.YarnException: Failed to Start org.apache.hadoop.mapreduce.v2.TestSpeculativeExecution
	at org.apache.hadoop.yarn.service.CompositeService.start(CompositeService.java:78)
	at org.apache.hadoop.mapreduce.v2.TestSpeculativeExecution.setup(TestSpeculativeExecution.java:118)
	at sun.reflect.NativeMethodAccessorImpl.invoke0(Native Method)
	at sun.reflect.NativeMethodAccessorImpl.invoke(NativeMethodAccessorImpl.java:39)
	at sun.reflect.DelegatingMethodAccessorImpl.invoke(DelegatingMethodAccessorImpl.java:25)
	at java.lang.reflect.Method.invoke(Method.java:597)
	at org.junit.runners.model.FrameworkMethod$1.runReflectiveCall(FrameworkMethod.java:44)
	at org.junit.internal.runners.model.ReflectiveCallable.run(ReflectiveCallable.java:15)
	at org.junit.runners.model.FrameworkMethod.invokeExplosively(FrameworkMethod.java:41)
	at org.junit.internal.runners.statements.RunBefores.evaluate(RunBefores.java:27)
	at org.junit.internal.runners.statements.RunAfters.evaluate(RunAfters.java:31)
	at org.junit.runners.ParentRunner.run(ParentRunner.java:236)
	at org.apache.maven.surefire.junit4.JUnit4Provider.execute(JUnit4Provider.java:252)
	at org.apache.maven.surefire.junit4.JUnit4Provider.executeTestSet(JUnit4Provider.java:141)
	at org.apache.maven.surefire.junit4.JUnit4Provider.invoke(JUnit4Provider.java:112)
	at sun.reflect.NativeMethodAccessorImpl.invoke0(Native Method)
	at sun.reflect.NativeMethodAccessorImpl.invoke(NativeMethodAccessorImpl.java:39)
	at sun.reflect.DelegatingMethodAccessorImpl.invoke(DelegatingMethodAccessorImpl.java:25)
	at java.lang.reflect.Method.invoke(Method.java:597)
	at org.apache.maven.surefire.util.ReflectionUtils.invokeMethodWithArray(ReflectionUtils.java:189)
	at org.apache.maven.surefire.booter.ProviderFactory$ProviderProxy.invoke(ProviderFactory.java:165)
	at org.apache.maven.surefire.booter.ProviderFactory.invokeProvider(ProviderFactory.java:85)
	at org.apache.maven.surefire.booter.ForkedBooter.runSuitesInProcess(ForkedBooter.java:115)
	at org.apache.maven.surefire.booter.ForkedBooter.main(ForkedBooter.java:75)
Caused by: org.apache.hadoop.yarn.YarnException: java.io.IOException: ResourceManager failed to start. Final state is INITED
	at org.apache.hadoop.yarn.server.MiniYARNCluster$ResourceManagerWrapper.start(MiniYARNCluster.java:181)
	at org.apache.hadoop.yarn.service.CompositeService.start(CompositeService.java:68)
	... 23 more
Caused by: java.io.IOException: ResourceManager failed to start. Final state is INITED
	at org.apache.hadoop.yarn.server.MiniYARNCluster$ResourceManagerWrapper.start(MiniYARNCluster.java:175)
	... 24 more


FAILED:  org.apache.hadoop.mapreduce.v2.TestUberAM.org.apache.hadoop.mapreduce.v2.TestUberAM

Error Message:
Failed to Start org.apache.hadoop.mapreduce.v2.TestMRJobs

Stack Trace:
org.apache.hadoop.yarn.YarnException: Failed to Start org.apache.hadoop.mapreduce.v2.TestMRJobs
	at org.apache.hadoop.yarn.service.CompositeService.start(CompositeService.java:78)
	at org.apache.hadoop.mapreduce.v2.TestMRJobs.setup(TestMRJobs.java:122)
	at org.apache.hadoop.mapreduce.v2.TestUberAM.setup(TestUberAM.java:45)
	at sun.reflect.NativeMethodAccessorImpl.invoke0(Native Method)
	at sun.reflect.NativeMethodAccessorImpl.invoke(NativeMethodAccessorImpl.java:39)
	at sun.reflect.DelegatingMethodAccessorImpl.invoke(DelegatingMethodAccessorImpl.java:25)
	at java.lang.reflect.Method.invoke(Method.java:597)
	at org.junit.runners.model.FrameworkMethod$1.runReflectiveCall(FrameworkMethod.java:44)
	at org.junit.internal.runners.model.ReflectiveCallable.run(ReflectiveCallable.java:15)
	at org.junit.runners.model.FrameworkMethod.invokeExplosively(FrameworkMethod.java:41)
	at org.junit.internal.runners.statements.RunBefores.evaluate(RunBefores.java:27)
	at org.junit.internal.runners.statements.RunAfters.evaluate(RunAfters.java:31)
	at org.junit.runners.ParentRunner.run(ParentRunner.java:236)
	at org.apache.maven.surefire.junit4.JUnit4Provider.execute(JUnit4Provider.java:252)
	at org.apache.maven.surefire.junit4.JUnit4Provider.executeTestSet(JUnit4Provider.java:141)
	at org.apache.maven.surefire.junit4.JUnit4Provider.invoke(JUnit4Provider.java:112)
	at sun.reflect.NativeMethodAccessorImpl.invoke0(Native Method)
	at sun.reflect.NativeMethodAccessorImpl.invoke(NativeMethodAccessorImpl.java:39)
	at sun.reflect.DelegatingMethodAccessorImpl.invoke(DelegatingMethodAccessorImpl.java:25)
	at java.lang.reflect.Method.invoke(Method.java:597)
	at org.apache.maven.surefire.util.ReflectionUtils.invokeMethodWithArray(ReflectionUtils.java:189)
	at org.apache.maven.surefire.booter.ProviderFactory$ProviderProxy.invoke(ProviderFactory.java:165)
	at org.apache.maven.surefire.booter.ProviderFactory.invokeProvider(ProviderFactory.java:85)
	at org.apache.maven.surefire.booter.ForkedBooter.runSuitesInProcess(ForkedBooter.java:115)
	at org.apache.maven.surefire.booter.ForkedBooter.main(ForkedBooter.java:75)
Caused by: org.apache.hadoop.yarn.YarnException: java.io.IOException: ResourceManager failed to start. Final state is INITED
	at org.apache.hadoop.yarn.server.MiniYARNCluster$ResourceManagerWrapper.start(MiniYARNCluster.java:181)
	at org.apache.hadoop.yarn.service.CompositeService.start(CompositeService.java:68)
	... 24 more
Caused by: java.io.IOException: ResourceManager failed to start. Final state is INITED
	at org.apache.hadoop.yarn.server.MiniYARNCluster$ResourceManagerWrapper.start(MiniYARNCluster.java:175)
	... 25 more



Mime
  • Unnamed multipart/mixed (inline, None, 0 bytes)
View raw message