hadoop-yarn-dev mailing list archives

Site index · List index
Message view « Date » · « Thread »
Top « Date » · « Thread »
From Apache Jenkins Server <jenk...@builds.apache.org>
Subject Build failed in Jenkins: Hadoop-Yarn-trunk #86
Date Fri, 04 Jan 2013 10:32:40 GMT
See <https://builds.apache.org/job/Hadoop-Yarn-trunk/86/changes>

Changes:

[szetszwo] HDFS-4270. Introduce soft and hard limits for max replication so that replications
of the highest priority are allowed to choose a source datanode that has reached its soft
limit but not the hard limit.  Contributed by Derek Dagit

[todd] HDFS-4352. Encapsulate arguments to BlockReaderFactory in a class. Contributed by Colin
Patrick McCabe.

[todd] HDFS-4302. Fix fatal exception when starting NameNode with DEBUG logs. Contributed
by Eugene Koontz.

[atm] Add file which was accidentally missed during commit of HDFS-4346.

[sseth] YARN-103. Add a yarn AM-RM client module. Contributed by Bikas Saha.

[bobby] MAPREDUCE-4279. getClusterStatus() fails with null pointer exception when running
jobs in local mode (Devaraj K via bobby)

[tomwhite] YARN-301. Fair scheduler throws ConcurrentModificationException when iterating
over app's priorities. Contributed by Sandy Ryza.

[tomwhite] YARN-300. After YARN-271, fair scheduler can infinite loop and not schedule any
application. Contributed by Sandy Ryza.

[tomwhite] YARN-288. Fair scheduler queue doesn't accept any jobs when ACLs are configured.
Contributed by Sandy Ryza.

[tomwhite] YARN-192. Node update causes NPE in the fair scheduler. Contributed by Sandy Ryza

------------------------------------------
[...truncated 9848 lines...]
127 KB   45 KB   15 KB   127 KB   
                                  
Downloaded: http://repo1.maven.org/maven2/com/sun/jersey/jersey-client/1.8/jersey-client-1.8.jar
(127 KB at 1051.6 KB/sec)
127 KB   49 KB   15 KB            
127 KB   53 KB   15 KB   
127 KB   57 KB   15 KB   
127 KB   61 KB   15 KB   
127 KB   63 KB   15 KB   
127 KB   67 KB   15 KB   
127 KB   71 KB   15 KB   
                         
Downloaded: http://repo1.maven.org/maven2/com/sun/jersey/contribs/jersey-guice/1.8/jersey-guice-1.8.jar
(15 KB at 2052.5 KB/sec)
127 KB   75 KB           
127 KB   79 KB   
127 KB   83 KB   
127 KB   87 KB   
127 KB   91 KB   
127 KB   95 KB   
127 KB   99 KB   
127 KB   103 KB   
127 KB   107 KB   
127 KB   111 KB   
127 KB   115 KB   
127 KB   119 KB   
127 KB   123 KB   
127 KB   127 KB   
127 KB   131 KB   
127 KB   135 KB   
127 KB   139 KB   
127 KB   143 KB   
127 KB   147 KB   
127 KB   151 KB   
127 KB   155 KB   4 KB   
127 KB   155 KB   4 KB   
127 KB   155 KB   8 KB   
127 KB   159 KB   8 KB   
127 KB   159 KB   12 KB   
127 KB   163 KB   12 KB   
127 KB   163 KB   16 KB   
127 KB   163 KB   20 KB   
127 KB   167 KB   20 KB   
127 KB   167 KB   24 KB   
127 KB   167 KB   28 KB   
131 KB   171 KB   28 KB   
131 KB   175 KB   32 KB   
131 KB   179 KB   32 KB   
131 KB   183 KB   32 KB   
131 KB   187 KB   32 KB   
131 KB   190 KB   32 KB   
131 KB   167 KB   28 KB   
135 KB   190 KB   32 KB   
139 KB   190 KB   32 KB   
143 KB   190 KB   32 KB   
147 KB   190 KB   32 KB   
151 KB   190 KB   32 KB   
155 KB   190 KB   32 KB   
159 KB   190 KB   32 KB   
163 KB   190 KB   32 KB   
167 KB   190 KB   32 KB   
171 KB   190 KB   32 KB   
175 KB   190 KB   32 KB   
179 KB   190 KB   32 KB   
183 KB   190 KB   32 KB   
187 KB   190 KB   32 KB   
191 KB   190 KB   32 KB   
191 KB   190 KB   32 KB   
131 KB   171 KB   32 KB   
191 KB   190 KB   36 KB   
191 KB   190 KB   40 KB   
                          
191 KB   44 KB            
Downloaded: http://repo1.maven.org/maven2/org/glassfish/grizzly/grizzly-http-server/2.1.1/grizzly-http-server-2.1.1.jar
(190 KB at 3437.2 KB/sec)
191 KB   48 KB   
191 KB   52 KB   
191 KB   56 KB   
191 KB   60 KB   
191 KB   64 KB   
191 KB   68 KB   
191 KB   72 KB   
191 KB   76 KB   
191 KB   80 KB   
191 KB   84 KB   
191 KB   88 KB   
191 KB   92 KB   
191 KB   96 KB   
191 KB   100 KB   
191 KB   104 KB   
191 KB   108 KB   
191 KB   112 KB   
191 KB   116 KB   
191 KB   120 KB   
191 KB   124 KB   
191 KB   128 KB   
191 KB   132 KB   
191 KB   136 KB   
191 KB   140 KB   
191 KB   144 KB   
191 KB   148 KB   
191 KB   152 KB   
191 KB   156 KB   
191 KB   160 KB   
191 KB   164 KB   
191 KB   168 KB   
191 KB   172 KB   
191 KB   176 KB   
191 KB   180 KB   
191 KB   184 KB   
191 KB   188 KB   
191 KB   192 KB   
191 KB   196 KB   
191 KB   200 KB   
191 KB   204 KB   
191 KB   206 KB   
                  
Downloaded: http://repo1.maven.org/maven2/org/glassfish/grizzly/grizzly-framework/2.1.1/grizzly-framework-2.1.1-tests.jar
(206 KB at 7100.1 KB/sec)
195 KB            
199 KB   
203 KB   
207 KB   
211 KB   
215 KB   
219 KB   
223 KB   
227 KB   
231 KB   
235 KB   
239 KB   
243 KB   
247 KB   
251 KB   
255 KB   
259 KB   
263 KB   
267 KB   
271 KB   
275 KB   
279 KB   
283 KB   
287 KB   
291 KB   
295 KB   
299 KB   
303 KB   
307 KB   
311 KB   
315 KB   
319 KB   
323 KB   
327 KB   
329 KB   
         
Downloaded: http://repo1.maven.org/maven2/org/glassfish/grizzly/grizzly-http-servlet/2.1.1/grizzly-http-servlet-2.1.1.jar
(329 KB at 4838.0 KB/sec)
[INFO] 
[INFO] --- maven-clean-plugin:2.4.1:clean (default-clean) @ hadoop-yarn ---
[INFO] 
[INFO] --- maven-antrun-plugin:1.6:run (create-testdirs) @ hadoop-yarn ---
[INFO] Executing tasks

main:
    [mkdir] Created dir: <https://builds.apache.org/job/Hadoop-Yarn-trunk/ws/trunk/hadoop-yarn-project/hadoop-yarn/target/test-dir>
[INFO] Executed tasks
[INFO] 
[INFO] --- maven-source-plugin:2.1.2:jar-no-fork (hadoop-java-sources) @ hadoop-yarn ---
[INFO] 
[INFO] --- maven-enforcer-plugin:1.0:enforce (dist-enforce) @ hadoop-yarn ---
[INFO] 
[INFO] --- maven-site-plugin:3.0:attach-descriptor (attach-descriptor) @ hadoop-yarn ---
[INFO] 
[INFO] --- maven-javadoc-plugin:2.8.1:jar (module-javadocs) @ hadoop-yarn ---
[INFO] Not executing Javadoc as the project is not a Java classpath-capable package
[INFO] 
[INFO] --- maven-checkstyle-plugin:2.6:checkstyle (default-cli) @ hadoop-yarn ---
[INFO] 
[INFO] --- findbugs-maven-plugin:2.3.2:findbugs (default-cli) @ hadoop-yarn ---
[INFO] ****** FindBugsMojo execute *******
[INFO] canGenerate is false
[INFO]                                                                         
[INFO] ------------------------------------------------------------------------
[INFO] Building hadoop-yarn-api 3.0.0-SNAPSHOT
[INFO] ------------------------------------------------------------------------
[WARNING] The POM for org.eclipse.m2e:lifecycle-mapping:jar:1.0.0 is missing, no dependency
information available
[WARNING] Failed to retrieve plugin descriptor for org.eclipse.m2e:lifecycle-mapping:1.0.0:
Plugin org.eclipse.m2e:lifecycle-mapping:1.0.0 or one of its dependencies could not be resolved:
Failed to read artifact descriptor for org.eclipse.m2e:lifecycle-mapping:jar:1.0.0
[INFO] 
[INFO] --- maven-clean-plugin:2.4.1:clean (default-clean) @ hadoop-yarn-api ---
[INFO] 
[INFO] --- maven-antrun-plugin:1.6:run (create-testdirs) @ hadoop-yarn-api ---
[INFO] Executing tasks

main:
    [mkdir] Created dir: <https://builds.apache.org/job/Hadoop-Yarn-trunk/ws/trunk/hadoop-yarn-project/hadoop-yarn/hadoop-yarn-api/target/test-dir>
[INFO] Executed tasks
[INFO] 
[INFO] --- maven-antrun-plugin:1.6:run (create-protobuf-generated-sources-directory) @ hadoop-yarn-api
---
[INFO] Executing tasks

main:
    [mkdir] Created dir: <https://builds.apache.org/job/Hadoop-Yarn-trunk/ws/trunk/hadoop-yarn-project/hadoop-yarn/hadoop-yarn-api/target/generated-sources/proto>
[INFO] Executed tasks
[INFO] 
[INFO] --- exec-maven-plugin:1.2:exec (generate-sources) @ hadoop-yarn-api ---
yarn_protos.proto:21:8: Option "java_generic_services" unknown.
[INFO] ------------------------------------------------------------------------
[INFO] Reactor Summary:
[INFO] 
[INFO] hadoop-yarn ....................................... SUCCESS [22.932s]
[INFO] hadoop-yarn-api ................................... FAILURE [0.462s]
[INFO] hadoop-yarn-common ................................ SKIPPED
[INFO] hadoop-yarn-server ................................ SKIPPED
[INFO] hadoop-yarn-server-common ......................... SKIPPED
[INFO] hadoop-yarn-server-nodemanager .................... SKIPPED
[INFO] hadoop-yarn-server-web-proxy ...................... SKIPPED
[INFO] hadoop-yarn-server-resourcemanager ................ SKIPPED
[INFO] hadoop-yarn-server-tests .......................... SKIPPED
[INFO] hadoop-yarn-client ................................ SKIPPED
[INFO] hadoop-yarn-applications .......................... SKIPPED
[INFO] hadoop-yarn-applications-distributedshell ......... SKIPPED
[INFO] hadoop-yarn-applications-unmanaged-am-launcher .... SKIPPED
[INFO] hadoop-yarn-site .................................. SKIPPED
[INFO] hadoop-yarn-project ............................... SKIPPED
[INFO] ------------------------------------------------------------------------
[INFO] BUILD FAILURE
[INFO] ------------------------------------------------------------------------
[INFO] Total time: 24.996s
[INFO] Finished at: Fri Jan 04 10:32:33 UTC 2013
[INFO] Final Memory: 28M/167M
[INFO] ------------------------------------------------------------------------
[ERROR] Failed to execute goal org.codehaus.mojo:exec-maven-plugin:1.2:exec (generate-sources)
on project hadoop-yarn-api: Command execution failed. Process exited with an error: 1(Exit
value: 1) -> [Help 1]
[ERROR] 
[ERROR] To see the full stack trace of the errors, re-run Maven with the -e switch.
[ERROR] Re-run Maven using the -X switch to enable full debug logging.
[ERROR] 
[ERROR] For more information about the errors and possible solutions, please read the following
articles:
[ERROR] [Help 1] http://cwiki.apache.org/confluence/display/MAVEN/MojoExecutionException
[ERROR] 
[ERROR] After correcting the problems, you can resume the build with the command
[ERROR]   mvn <goals> -rf :hadoop-yarn-api
Build step 'Execute shell' marked build as failure
Archiving artifacts
Updating HDFS-4352
Updating YARN-288
Updating YARN-103
Updating MAPREDUCE-4279
Updating HDFS-4346
Updating YARN-192
Updating YARN-301
Updating YARN-271
Updating YARN-300
Updating HDFS-4302
Updating HDFS-4270

Mime
View raw message