hadoop-yarn-dev mailing list archives

Site index · List index
Message view « Date » · « Thread »
Top « Date » · « Thread »
From Apache Jenkins Server <jenk...@builds.apache.org>
Subject Hadoop-Yarn-trunk - Build # 79 - Still Failing
Date Fri, 28 Dec 2012 10:32:14 GMT
See https://builds.apache.org/job/Hadoop-Yarn-trunk/79/

###################################################################################
########################## LAST 60 LINES OF THE CONSOLE ###########################
[...truncated 104 lines...]
	at hudson.remoting.PingThread.run(PingThread.java:81)
Caused by: java.util.concurrent.TimeoutException: Ping started on 1356410048970 hasn't completed
at 1356410288970
	... 2 more
ERROR: Publisher hudson.plugins.violations.ViolationsPublisher aborted due to exception
hudson.util.IOException2: remote file operation failed: /home/jenkins/jenkins-slave/workspace/Hadoop-Yarn-trunk
at hudson.remoting.Channel@43c995d7:hadoop6
	at hudson.FilePath.act(FilePath.java:848)
	at hudson.FilePath.act(FilePath.java:825)
	at hudson.plugins.violations.ViolationsPublisher.perform(ViolationsPublisher.java:74)
	at hudson.tasks.BuildStepMonitor$3.perform(BuildStepMonitor.java:36)
	at hudson.model.AbstractBuild$AbstractBuildExecution.perform(AbstractBuild.java:804)
	at hudson.model.AbstractBuild$AbstractBuildExecution.performAllBuildSteps(AbstractBuild.java:779)
	at hudson.model.Build$BuildExecution.post2(Build.java:183)
	at hudson.model.AbstractBuild$AbstractBuildExecution.post(AbstractBuild.java:726)
	at hudson.model.Run.execute(Run.java:1567)
	at hudson.model.FreeStyleBuild.run(FreeStyleBuild.java:46)
	at hudson.model.ResourceController.execute(ResourceController.java:88)
	at hudson.model.Executor.run(Executor.java:236)
Caused by: hudson.remoting.ChannelClosedException: channel is already closed
	at hudson.remoting.Channel.send(Channel.java:494)
	at hudson.remoting.Request.call(Request.java:129)
	at hudson.remoting.Channel.call(Channel.java:665)
	at hudson.FilePath.act(FilePath.java:841)
	... 11 more
Caused by: java.io.IOException
	at hudson.remoting.Channel.close(Channel.java:903)
	at hudson.slaves.ChannelPinger$1.onDead(ChannelPinger.java:110)
	at hudson.remoting.PingThread.ping(PingThread.java:120)
	at hudson.remoting.PingThread.run(PingThread.java:81)
Caused by: java.util.concurrent.TimeoutException: Ping started on 1356410048970 hasn't completed
at 1356410288970
	... 2 more
ERROR: Publisher hudson.tasks.Mailer aborted due to exception
hudson.remoting.ChannelClosedException: channel is already closed
	at hudson.remoting.Channel.send(Channel.java:494)
	at hudson.remoting.Request.call(Request.java:129)
	at hudson.remoting.Channel.call(Channel.java:665)
	at hudson.EnvVars.getRemote(EnvVars.java:212)
	at hudson.model.Computer.getEnvironment(Computer.java:882)
	at jenkins.model.CoreEnvironmentContributor.buildEnvironmentFor(CoreEnvironmentContributor.java:28)
	at hudson.model.Run.getEnvironment(Run.java:1997)
	at hudson.model.AbstractBuild.getEnvironment(AbstractBuild.java:930)
	at hudson.tasks.Mailer.perform(Mailer.java:112)
	at hudson.tasks.BuildStepMonitor$1.perform(BuildStepMonitor.java:19)
	at hudson.model.AbstractBuild$AbstractBuildExecution.perform(AbstractBuild.java:804)
	at hudson.model.AbstractBuild$AbstractBuildExecution.performAllBuildSteps(AbstractBuild.java:779)
	at hudson.model.Build$BuildExecution.post2(Build.java:183)
	at hudson.model.AbstractBuild$AbstractBuildExecution.post(AbstractBuild.java:726)
	at hudson.model.Run.execute(Run.java:1567)
	at hudson.model.FreeStyleBuild.run(FreeStyleBuild.java:46)
	at hudson.model.ResourceController.execute(ResourceController.java:88)
	at hudson.model.Executor.run(Executor.java:236)
Caused by: java.io.IOException
	at hudson.remoting.Channel.close(Channel.java:903)
	at hudson.slaves.ChannelPinger$1.onDead(ChannelPinger.java:110)
	at hudson.remoting.PingThread.ping(PingThread.java:120)
	at hudson.remoting.PingThread.run(PingThread.java:81)
Caused by: java.util.concurrent.TimeoutException: Ping started on 1356410048970 hasn't completed
at 1356410288970
	... 2 more
Email was triggered for: Failure
Sending email for trigger: Failure



###################################################################################
############################## FAILED TESTS (if any) ##############################
No tests ran.
Mime
  • Unnamed multipart/mixed (inline, None, 0 bytes)
View raw message