hadoop-yarn-dev mailing list archives

Site index · List index
Message view « Date » · « Thread »
Top « Date » · « Thread »
From Apache Jenkins Server <jenk...@builds.apache.org>
Subject Build failed in Jenkins: Hadoop-Yarn-trunk #27
Date Mon, 05 Nov 2012 10:40:43 GMT
See <https://builds.apache.org/job/Hadoop-Yarn-trunk/27/>

------------------------------------------
[...truncated 12911 lines...]
[INFO] Executed tasks
[INFO] 
[INFO] --- maven-resources-plugin:2.2:testResources (default-testResources) @ hadoop-yarn-server-nodemanager
---
[INFO] Using default encoding to copy filtered resources.
[INFO] 
[INFO] --- maven-compiler-plugin:2.5.1:testCompile (default-testCompile) @ hadoop-yarn-server-nodemanager
---
[INFO] Compiling 48 source files to <https://builds.apache.org/job/Hadoop-Yarn-trunk/ws/trunk/hadoop-yarn-project/hadoop-yarn/hadoop-yarn-server/hadoop-yarn-server-nodemanager/target/test-classes>
[INFO] 
[INFO] --- maven-surefire-plugin:2.12.3:test (default-test) @ hadoop-yarn-server-nodemanager
---
[INFO] Surefire report directory: <https://builds.apache.org/job/Hadoop-Yarn-trunk/ws/trunk/hadoop-yarn-project/hadoop-yarn/hadoop-yarn-server/hadoop-yarn-server-nodemanager/target/surefire-reports>

-------------------------------------------------------
 T E S T S
-------------------------------------------------------

-------------------------------------------------------
 T E S T S
-------------------------------------------------------
Running org.apache.hadoop.yarn.server.nodemanager.TestLocalDirsHandlerService
Tests run: 2, Failures: 0, Errors: 0, Skipped: 0, Time elapsed: 0.562 sec
Running org.apache.hadoop.yarn.server.nodemanager.TestEventFlow
Tests run: 1, Failures: 0, Errors: 0, Skipped: 0, Time elapsed: 1.383 sec
Running org.apache.hadoop.yarn.server.nodemanager.TestRecordFactory
Tests run: 1, Failures: 0, Errors: 0, Skipped: 0, Time elapsed: 0.171 sec
Running org.apache.hadoop.yarn.server.nodemanager.metrics.TestNodeManagerMetrics
Tests run: 1, Failures: 0, Errors: 0, Skipped: 0, Time elapsed: 0.513 sec
Running org.apache.hadoop.yarn.server.nodemanager.TestNMAuditLogger
Tests run: 3, Failures: 0, Errors: 0, Skipped: 0, Time elapsed: 0.793 sec
Running org.apache.hadoop.yarn.server.nodemanager.TestDirectoryCollection
Tests run: 2, Failures: 0, Errors: 0, Skipped: 0, Time elapsed: 0.443 sec
Running org.apache.hadoop.yarn.server.nodemanager.TestDeletionService
Tests run: 4, Failures: 0, Errors: 0, Skipped: 0, Time elapsed: 21.324 sec
Running org.apache.hadoop.yarn.server.nodemanager.util.TestProcessIdFileReader
Tests run: 3, Failures: 0, Errors: 0, Skipped: 0, Time elapsed: 0.136 sec
Running org.apache.hadoop.yarn.server.nodemanager.api.protocolrecords.impl.pb.TestPBLocalizerRPC
Tests run: 1, Failures: 0, Errors: 0, Skipped: 0, Time elapsed: 0.849 sec
Running org.apache.hadoop.yarn.server.nodemanager.api.protocolrecords.impl.pb.TestPBRecordImpl
Tests run: 3, Failures: 0, Errors: 0, Skipped: 0, Time elapsed: 0.366 sec
Running org.apache.hadoop.yarn.server.nodemanager.TestNodeManager
Tests run: 1, Failures: 0, Errors: 0, Skipped: 0, Time elapsed: 0.575 sec
Running org.apache.hadoop.yarn.server.nodemanager.TestDefaultContainerExecutor
Tests run: 1, Failures: 0, Errors: 0, Skipped: 0, Time elapsed: 0.607 sec
Running org.apache.hadoop.yarn.server.nodemanager.TestNodeStatusUpdater
Tests run: 6, Failures: 0, Errors: 0, Skipped: 0, Time elapsed: 31.501 sec
Running org.apache.hadoop.yarn.server.nodemanager.containermanager.container.TestContainer
Tests run: 12, Failures: 0, Errors: 0, Skipped: 0, Time elapsed: 1.206 sec
Running org.apache.hadoop.yarn.server.nodemanager.containermanager.monitor.TestContainersMonitor
Tests run: 2, Failures: 0, Errors: 0, Skipped: 0, Time elapsed: 4.328 sec
Running org.apache.hadoop.yarn.server.nodemanager.containermanager.TestContainerManager
Tests run: 6, Failures: 0, Errors: 0, Skipped: 0, Time elapsed: 19.162 sec
Running org.apache.hadoop.yarn.server.nodemanager.containermanager.loghandler.TestNonAggregatingLogHandler
Tests run: 3, Failures: 0, Errors: 0, Skipped: 0, Time elapsed: 0.84 sec
Running org.apache.hadoop.yarn.server.nodemanager.containermanager.TestAuxServices
Tests run: 4, Failures: 0, Errors: 0, Skipped: 0, Time elapsed: 0.411 sec
Running org.apache.hadoop.yarn.server.nodemanager.containermanager.logaggregation.TestLogAggregationService
Tests run: 8, Failures: 0, Errors: 1, Skipped: 0, Time elapsed: 7.797 sec <<< FAILURE!
testMultipleAppsLogAggregation(org.apache.hadoop.yarn.server.nodemanager.containermanager.logaggregation.TestLogAggregationService)
 Time elapsed: 150 sec  <<< ERROR!
org.mortbay.util.MultiException[junit.framework.AssertionFailedError: expected events expected:<3>
but was:<2>, junit.framework.AssertionFailedError: missing event: [ getType=APPLICATION_LOG_HANDLING_INITED
getApplicationID=application_1234_0003 ]]
	at org.apache.hadoop.yarn.server.nodemanager.containermanager.logaggregation.TestLogAggregationService.checkEvents(TestLogAggregationService.java:753)
	at org.apache.hadoop.yarn.server.nodemanager.containermanager.logaggregation.TestLogAggregationService.testMultipleAppsLogAggregation(TestLogAggregationService.java:333)
	at sun.reflect.NativeMethodAccessorImpl.invoke0(Native Method)
	at sun.reflect.NativeMethodAccessorImpl.invoke(NativeMethodAccessorImpl.java:39)
	at sun.reflect.DelegatingMethodAccessorImpl.invoke(DelegatingMethodAccessorImpl.java:25)
	at java.lang.reflect.Method.invoke(Method.java:597)
	at org.junit.runners.model.FrameworkMethod$1.runReflectiveCall(FrameworkMethod.java:44)
	at org.junit.internal.runners.model.ReflectiveCallable.run(ReflectiveCallable.java:15)
	at org.junit.runners.model.FrameworkMethod.invokeExplosively(FrameworkMethod.java:41)
	at org.junit.internal.runners.statements.InvokeMethod.evaluate(InvokeMethod.java:20)
	at org.junit.internal.runners.statements.RunBefores.evaluate(RunBefores.java:28)
	at org.junit.internal.runners.statements.RunAfters.evaluate(RunAfters.java:31)
	at org.junit.runners.BlockJUnit4ClassRunner.runNotIgnored(BlockJUnit4ClassRunner.java:79)
	at org.junit.runners.BlockJUnit4ClassRunner.runChild(BlockJUnit4ClassRunner.java:71)
	at org.junit.runners.BlockJUnit4ClassRunner.runChild(BlockJUnit4ClassRunner.java:49)
	at org.junit.runners.ParentRunner$3.run(ParentRunner.java:193)
	at org.junit.runners.ParentRunner$1.schedule(ParentRunner.java:52)
	at org.junit.runners.ParentRunner.runChildren(ParentRunner.java:191)
	at org.junit.runners.ParentRunner.access$000(ParentRunner.java:42)
	at org.junit.runners.ParentRunner$2.evaluate(ParentRunner.java:184)
	at org.junit.runners.ParentRunner.run(ParentRunner.java:236)
	at org.apache.maven.surefire.junit4.JUnit4Provider.execute(JUnit4Provider.java:252)
	at org.apache.maven.surefire.junit4.JUnit4Provider.executeTestSet(JUnit4Provider.java:141)
	at org.apache.maven.surefire.junit4.JUnit4Provider.invoke(JUnit4Provider.java:112)
	at sun.reflect.NativeMethodAccessorImpl.invoke0(Native Method)
	at sun.reflect.NativeMethodAccessorImpl.invoke(NativeMethodAccessorImpl.java:39)
	at sun.reflect.DelegatingMethodAccessorImpl.invoke(DelegatingMethodAccessorImpl.java:25)
	at java.lang.reflect.Method.invoke(Method.java:597)
	at org.apache.maven.surefire.util.ReflectionUtils.invokeMethodWithArray(ReflectionUtils.java:189)
	at org.apache.maven.surefire.booter.ProviderFactory$ProviderProxy.invoke(ProviderFactory.java:165)
	at org.apache.maven.surefire.booter.ProviderFactory.invokeProvider(ProviderFactory.java:85)
	at org.apache.maven.surefire.booter.ForkedBooter.runSuitesInProcess(ForkedBooter.java:115)
	at org.apache.maven.surefire.booter.ForkedBooter.main(ForkedBooter.java:75)
junit.framework.AssertionFailedError: expected events expected:<3> but was:<2>
	at junit.framework.Assert.fail(Assert.java:47)
	at junit.framework.Assert.failNotEquals(Assert.java:283)
	at junit.framework.Assert.assertEquals(Assert.java:64)
	at junit.framework.Assert.assertEquals(Assert.java:195)
	at org.apache.hadoop.yarn.server.nodemanager.containermanager.logaggregation.TestLogAggregationService.checkEvents(TestLogAggregationService.java:755)
	at org.apache.hadoop.yarn.server.nodemanager.containermanager.logaggregation.TestLogAggregationService.testMultipleAppsLogAggregation(TestLogAggregationService.java:333)
	at sun.reflect.NativeMethodAccessorImpl.invoke0(Native Method)
	at sun.reflect.NativeMethodAccessorImpl.invoke(NativeMethodAccessorImpl.java:39)
	at sun.reflect.DelegatingMethodAccessorImpl.invoke(DelegatingMethodAccessorImpl.java:25)
	at java.lang.reflect.Method.invoke(Method.java:597)
	at org.junit.runners.model.FrameworkMethod$1.runReflectiveCall(FrameworkMethod.java:44)
	at org.junit.internal.runners.model.ReflectiveCallable.run(ReflectiveCallable.java:15)
	at org.junit.runners.model.FrameworkMethod.invokeExplosively(FrameworkMethod.java:41)
	at org.junit.internal.runners.statements.InvokeMethod.evaluate(InvokeMethod.java:20)
	at org.junit.internal.runners.statements.RunBefores.evaluate(RunBefores.java:28)
	at org.junit.internal.runners.statements.RunAfters.evaluate(RunAfters.java:31)
	at org.junit.runners.BlockJUnit4ClassRunner.runNotIgnored(BlockJUnit4ClassRunner.java:79)
	at org.junit.runners.BlockJUnit4ClassRunner.runChild(BlockJUnit4ClassRunner.java:71)
	at org.junit.runners.BlockJUnit4ClassRunner.runChild(BlockJUnit4ClassRunner.java:49)
	at org.junit.runners.ParentRunner$3.run(ParentRunner.java:193)
	at org.junit.runners.ParentRunner$1.schedule(ParentRunner.java:52)
	at org.junit.runners.ParentRunner.runChildren(ParentRunner.java:191)
	at org.junit.runners.ParentRunner.access$000(ParentRunner.java:42)
	at org.junit.runners.ParentRunner$2.evaluate(ParentRunner.java:184)
	at org.junit.runners.ParentRunner.run(ParentRunner.java:236)
	at org.apache.maven.surefire.junit4.JUnit4Provider.execute(JUnit4Provider.java:252)
	at org.apache.maven.surefire.junit4.JUnit4Provider.executeTestSet(JUnit4Provider.java:141)
	at org.apache.maven.surefire.junit4.JUnit4Provider.invoke(JUnit4Provider.java:112)
	at sun.reflect.NativeMethodAccessorImpl.invoke0(Native Method)
	at sun.reflect.NativeMethodAccessorImpl.invoke(NativeMethodAccessorImpl.java:39)
	at sun.reflect.DelegatingMethodAccessorImpl.invoke(DelegatingMethodAccessorImpl.java:25)
	at java.lang.reflect.Method.invoke(Method.java:597)
	at org.apache.maven.surefire.util.ReflectionUtils.invokeMethodWithArray(ReflectionUtils.java:189)
	at org.apache.maven.surefire.booter.ProviderFactory$ProviderProxy.invoke(ProviderFactory.java:165)
	at org.apache.maven.surefire.booter.ProviderFactory.invokeProvider(ProviderFactory.java:85)
	at org.apache.maven.surefire.booter.ForkedBooter.runSuitesInProcess(ForkedBooter.java:115)
	at org.apache.maven.surefire.booter.ForkedBooter.main(ForkedBooter.java:75)
junit.framework.AssertionFailedError: missing event: [ getType=APPLICATION_LOG_HANDLING_INITED
getApplicationID=application_1234_0003 ]
	at junit.framework.Assert.fail(Assert.java:47)
	at org.apache.hadoop.yarn.server.nodemanager.containermanager.logaggregation.TestLogAggregationService.checkEvents(TestLogAggregationService.java:790)
	at org.apache.hadoop.yarn.server.nodemanager.containermanager.logaggregation.TestLogAggregationService.testMultipleAppsLogAggregation(TestLogAggregationService.java:333)
	at sun.reflect.NativeMethodAccessorImpl.invoke0(Native Method)
	at sun.reflect.NativeMethodAccessorImpl.invoke(NativeMethodAccessorImpl.java:39)
	at sun.reflect.DelegatingMethodAccessorImpl.invoke(DelegatingMethodAccessorImpl.java:25)
	at java.lang.reflect.Method.invoke(Method.java:597)
	at org.junit.runners.model.FrameworkMethod$1.runReflectiveCall(FrameworkMethod.java:44)
	at org.junit.internal.runners.model.ReflectiveCallable.run(ReflectiveCallable.java:15)
	at org.junit.runners.model.FrameworkMethod.invokeExplosively(FrameworkMethod.java:41)
	at org.junit.internal.runners.statements.InvokeMethod.evaluate(InvokeMethod.java:20)
	at org.junit.internal.runners.statements.RunBefores.evaluate(RunBefores.java:28)
	at org.junit.internal.runners.statements.RunAfters.evaluate(RunAfters.java:31)
	at org.junit.runners.BlockJUnit4ClassRunner.runNotIgnored(BlockJUnit4ClassRunner.java:79)
	at org.junit.runners.BlockJUnit4ClassRunner.runChild(BlockJUnit4ClassRunner.java:71)
	at org.junit.runners.BlockJUnit4ClassRunner.runChild(BlockJUnit4ClassRunner.java:49)
	at org.junit.runners.ParentRunner$3.run(ParentRunner.java:193)
	at org.junit.runners.ParentRunner$1.schedule(ParentRunner.java:52)
	at org.junit.runners.ParentRunner.runChildren(ParentRunner.java:191)
	at org.junit.runners.ParentRunner.access$000(ParentRunner.java:42)
	at org.junit.runners.ParentRunner$2.evaluate(ParentRunner.java:184)
	at org.junit.runners.ParentRunner.run(ParentRunner.java:236)
	at org.apache.maven.surefire.junit4.JUnit4Provider.execute(JUnit4Provider.java:252)
	at org.apache.maven.surefire.junit4.JUnit4Provider.executeTestSet(JUnit4Provider.java:141)
	at org.apache.maven.surefire.junit4.JUnit4Provider.invoke(JUnit4Provider.java:112)
	at sun.reflect.NativeMethodAccessorImpl.invoke0(Native Method)
	at sun.reflect.NativeMethodAccessorImpl.invoke(NativeMethodAccessorImpl.java:39)
	at sun.reflect.DelegatingMethodAccessorImpl.invoke(DelegatingMethodAccessorImpl.java:25)
	at java.lang.reflect.Method.invoke(Method.java:597)
	at org.apache.maven.surefire.util.ReflectionUtils.invokeMethodWithArray(ReflectionUtils.java:189)
	at org.apache.maven.surefire.booter.ProviderFactory$ProviderProxy.invoke(ProviderFactory.java:165)
	at org.apache.maven.surefire.booter.ProviderFactory.invokeProvider(ProviderFactory.java:85)
	at org.apache.maven.surefire.booter.ForkedBooter.runSuitesInProcess(ForkedBooter.java:115)
	at org.apache.maven.surefire.booter.ForkedBooter.main(ForkedBooter.java:75)

Running org.apache.hadoop.yarn.server.nodemanager.containermanager.application.TestApplication
Tests run: 5, Failures: 0, Errors: 0, Skipped: 0, Time elapsed: 0.867 sec
Running org.apache.hadoop.yarn.server.nodemanager.containermanager.localizer.TestContainerLocalizer
Tests run: 2, Failures: 0, Errors: 0, Skipped: 0, Time elapsed: 1.254 sec
Running org.apache.hadoop.yarn.server.nodemanager.containermanager.localizer.TestResourceRetention
Tests run: 1, Failures: 0, Errors: 0, Skipped: 0, Time elapsed: 0.369 sec
Running org.apache.hadoop.yarn.server.nodemanager.containermanager.localizer.TestLocalizedResource
Tests run: 2, Failures: 0, Errors: 0, Skipped: 0, Time elapsed: 0.533 sec
Running org.apache.hadoop.yarn.server.nodemanager.containermanager.localizer.TestLocalResource
Tests run: 2, Failures: 0, Errors: 0, Skipped: 0, Time elapsed: 0.286 sec
Running org.apache.hadoop.yarn.server.nodemanager.containermanager.localizer.TestResourceLocalizationService
Tests run: 3, Failures: 0, Errors: 0, Skipped: 0, Time elapsed: 2.383 sec
Running org.apache.hadoop.yarn.server.nodemanager.containermanager.localizer.TestLocalResourcesTrackerImpl
Tests run: 2, Failures: 0, Errors: 0, Skipped: 0, Time elapsed: 0.551 sec
Running org.apache.hadoop.yarn.server.nodemanager.containermanager.launcher.TestContainerLaunch
Tests run: 3, Failures: 0, Errors: 0, Skipped: 0, Time elapsed: 6.52 sec
Running org.apache.hadoop.yarn.server.nodemanager.TestNodeHealthService
Tests run: 2, Failures: 0, Errors: 0, Skipped: 0, Time elapsed: 4.656 sec
Running org.apache.hadoop.yarn.server.nodemanager.TestLinuxContainerExecutorWithMocks
Tests run: 3, Failures: 0, Errors: 0, Skipped: 0, Time elapsed: 0.678 sec
Running org.apache.hadoop.yarn.server.nodemanager.TestRPCFactories
Tests run: 1, Failures: 0, Errors: 0, Skipped: 0, Time elapsed: 0.517 sec
Running org.apache.hadoop.yarn.server.nodemanager.TestLinuxContainerExecutor
Tests run: 2, Failures: 0, Errors: 0, Skipped: 0, Time elapsed: 0.541 sec
Running org.apache.hadoop.yarn.server.nodemanager.TestContainerManagerWithLCE
Tests run: 6, Failures: 0, Errors: 0, Skipped: 0, Time elapsed: 1.152 sec
Running org.apache.hadoop.yarn.server.nodemanager.webapp.TestNMWebServicesApps
Tests run: 19, Failures: 0, Errors: 0, Skipped: 0, Time elapsed: 7.557 sec
Running org.apache.hadoop.yarn.server.nodemanager.webapp.TestNMWebServicesContainers
Tests run: 12, Failures: 0, Errors: 0, Skipped: 0, Time elapsed: 5.888 sec
Running org.apache.hadoop.yarn.server.nodemanager.webapp.TestNMWebServices
Tests run: 10, Failures: 0, Errors: 0, Skipped: 0, Time elapsed: 5.589 sec
Running org.apache.hadoop.yarn.server.nodemanager.webapp.TestContainerLogsPage
Tests run: 1, Failures: 0, Errors: 0, Skipped: 0, Time elapsed: 0.664 sec
Running org.apache.hadoop.yarn.server.nodemanager.webapp.TestNMWebServer
Tests run: 3, Failures: 0, Errors: 0, Skipped: 0, Time elapsed: 3.023 sec

Results :

Tests in error: 
  testMultipleAppsLogAggregation(org.apache.hadoop.yarn.server.nodemanager.containermanager.logaggregation.TestLogAggregationService):
Multiple exceptions

Tests run: 143, Failures: 0, Errors: 1, Skipped: 0

[INFO] ------------------------------------------------------------------------
[INFO] Reactor Summary:
[INFO] 
[INFO] hadoop-yarn ....................................... SUCCESS [3.228s]
[INFO] hadoop-yarn-api ................................... SUCCESS [1:53.940s]
[INFO] hadoop-yarn-common ................................ SUCCESS [1:58.770s]
[INFO] hadoop-yarn-server ................................ SUCCESS [0.184s]
[INFO] hadoop-yarn-server-common ......................... SUCCESS [27.147s]
[INFO] hadoop-yarn-server-nodemanager .................... FAILURE [2:29.024s]
[INFO] hadoop-yarn-server-web-proxy ...................... SKIPPED
[INFO] hadoop-yarn-server-resourcemanager ................ SKIPPED
[INFO] hadoop-yarn-server-tests .......................... SKIPPED
[INFO] hadoop-yarn-client ................................ SKIPPED
[INFO] hadoop-yarn-applications .......................... SKIPPED
[INFO] hadoop-yarn-applications-distributedshell ......... SKIPPED
[INFO] hadoop-yarn-applications-unmanaged-am-launcher .... SKIPPED
[INFO] hadoop-yarn-site .................................. SKIPPED
[INFO] hadoop-yarn-project ............................... SKIPPED
[INFO] ------------------------------------------------------------------------
[INFO] BUILD FAILURE
[INFO] ------------------------------------------------------------------------
[INFO] Total time: 6:53.664s
[INFO] Finished at: Mon Nov 05 10:40:42 UTC 2012
[INFO] Final Memory: 46M/790M
[INFO] ------------------------------------------------------------------------
[ERROR] Failed to execute goal org.apache.maven.plugins:maven-surefire-plugin:2.12.3:test
(default-test) on project hadoop-yarn-server-nodemanager: There are test failures.
[ERROR] 
[ERROR] Please refer to <https://builds.apache.org/job/Hadoop-Yarn-trunk/ws/trunk/hadoop-yarn-project/hadoop-yarn/hadoop-yarn-server/hadoop-yarn-server-nodemanager/target/surefire-reports>
for the individual test results.
[ERROR] -> [Help 1]
[ERROR] 
[ERROR] To see the full stack trace of the errors, re-run Maven with the -e switch.
[ERROR] Re-run Maven using the -X switch to enable full debug logging.
[ERROR] 
[ERROR] For more information about the errors and possible solutions, please read the following
articles:
[ERROR] [Help 1] http://cwiki.apache.org/confluence/display/MAVEN/MojoFailureException
[ERROR] 
[ERROR] After correcting the problems, you can resume the build with the command
[ERROR]   mvn <goals> -rf :hadoop-yarn-server-nodemanager
Build step 'Execute shell' marked build as failure
Archiving artifacts

Mime
View raw message