hadoop-yarn-dev mailing list archives

Site index · List index
Message view « Date » · « Thread »
Top « Date » · « Thread »
From Apache Jenkins Server <jenk...@builds.apache.org>
Subject Failed: YARN-127 PreCommit Build #71
Date Sat, 06 Oct 2012 00:08:31 GMT
Jira: https://issues.apache.org/jira/browse/YARN-127
Build: https://builds.apache.org/job/PreCommit-YARN-Build/71/

###################################################################################
########################## LAST 60 LINES OF THE CONSOLE ###########################
[...truncated 3207 lines...]



{color:red}-1 overall{color}.  Here are the results of testing the latest attachment 
  http://issues.apache.org/jira/secure/attachment/12548073/YARN-127-20121005.txt
  against trunk revision .

    {color:green}+1 @author{color}.  The patch does not contain any @author tags.

    {color:green}+1 tests included{color}.  The patch appears to include 2 new or modified
test files.

    {color:green}+1 javac{color}.  The applied patch does not increase the total number of
javac compiler warnings.

    {color:green}+1 javadoc{color}.  The javadoc tool did not generate any warning messages.

    {color:green}+1 eclipse:eclipse{color}.  The patch built with eclipse:eclipse.

    {color:green}+1 findbugs{color}.  The patch does not introduce any new Findbugs (version
1.3.9) warnings.

    {color:green}+1 release audit{color}.  The applied patch does not increase the total number
of release audit warnings.

    {color:red}-1 core tests{color}.  The patch failed these unit tests in hadoop-yarn-project/hadoop-yarn/hadoop-yarn-api
hadoop-yarn-project/hadoop-yarn/hadoop-yarn-client hadoop-yarn-project/hadoop-yarn/hadoop-yarn-common
hadoop-yarn-project/hadoop-yarn/hadoop-yarn-server/hadoop-yarn-server-resourcemanager:

                  org.apache.hadoop.yarn.client.TestYarnClient
                  org.apache.hadoop.yarn.server.resourcemanager.security.TestApplicationTokens
                  org.apache.hadoop.yarn.server.resourcemanager.TestAMAuthorization

    {color:green}+1 contrib tests{color}.  The patch passed contrib unit tests.

Test results: https://builds.apache.org/job/PreCommit-YARN-Build/71//testReport/
Console output: https://builds.apache.org/job/PreCommit-YARN-Build/71//console

This message is automatically generated.


======================================================================
======================================================================
    Adding comment to Jira.
======================================================================
======================================================================


Comment added.
5fr0NmXEqC logged out


======================================================================
======================================================================
    Finished build.
======================================================================
======================================================================


Build step 'Execute shell' marked build as failure
Archiving artifacts
[description-setter] Could not determine description.
Recording test results
Email was triggered for: Failure
Sending email for trigger: Failure



###################################################################################
############################## FAILED TESTS (if any) ##############################
4 tests failed.
FAILED:  org.apache.hadoop.yarn.client.TestYarnClient.testClientStop

Error Message:
Can only configure with YarnConfiguration

Stack Trace:
java.lang.IllegalArgumentException: Can only configure with YarnConfiguration
	at org.apache.hadoop.yarn.server.resourcemanager.scheduler.capacity.CapacityScheduler.setConf(CapacityScheduler.java:118)
	at org.apache.hadoop.util.ReflectionUtils.setConf(ReflectionUtils.java:70)
	at org.apache.hadoop.util.ReflectionUtils.newInstance(ReflectionUtils.java:130)
	at org.apache.hadoop.yarn.server.resourcemanager.ResourceManager.createScheduler(ResourceManager.java:264)
	at org.apache.hadoop.yarn.server.resourcemanager.ResourceManager.init(ResourceManager.java:176)
	at org.apache.hadoop.yarn.client.TestYarnClient.testClientStop(TestYarnClient.java:38)
	at sun.reflect.NativeMethodAccessorImpl.invoke0(Native Method)
	at sun.reflect.NativeMethodAccessorImpl.invoke(NativeMethodAccessorImpl.java:39)
	at sun.reflect.DelegatingMethodAccessorImpl.invoke(DelegatingMethodAccessorImpl.java:25)
	at java.lang.reflect.Method.invoke(Method.java:597)
	at org.junit.runners.model.FrameworkMethod$1.runReflectiveCall(FrameworkMethod.java:44)
	at org.junit.internal.runners.model.ReflectiveCallable.run(ReflectiveCallable.java:15)
	at org.junit.runners.model.FrameworkMethod.invokeExplosively(FrameworkMethod.java:41)
	at org.junit.internal.runners.statements.InvokeMethod.evaluate(InvokeMethod.java:20)
	at org.junit.runners.BlockJUnit4ClassRunner.runNotIgnored(BlockJUnit4ClassRunner.java:79)
	at org.junit.runners.BlockJUnit4ClassRunner.runChild(BlockJUnit4ClassRunner.java:71)
	at org.junit.runners.BlockJUnit4ClassRunner.runChild(BlockJUnit4ClassRunner.java:49)
	at org.junit.runners.ParentRunner$3.run(ParentRunner.java:193)
	at org.junit.runners.ParentRunner$1.schedule(ParentRunner.java:52)
	at org.junit.runners.ParentRunner.runChildren(ParentRunner.java:191)
	at org.junit.runners.ParentRunner.access$000(ParentRunner.java:42)
	at org.junit.runners.ParentRunner$2.evaluate(ParentRunner.java:184)
	at org.junit.runners.ParentRunner.run(ParentRunner.java:236)
	at org.apache.maven.surefire.junit4.JUnit4Provider.execute(JUnit4Provider.java:236)
	at org.apache.maven.surefire.junit4.JUnit4Provider.executeTestSet(JUnit4Provider.java:134)
	at org.apache.maven.surefire.junit4.JUnit4Provider.invoke(JUnit4Provider.java:113)
	at sun.reflect.NativeMethodAccessorImpl.invoke0(Native Method)
	at sun.reflect.NativeMethodAccessorImpl.invoke(NativeMethodAccessorImpl.java:39)
	at sun.reflect.DelegatingMethodAccessorImpl.invoke(DelegatingMethodAccessorImpl.java:25)
	at java.lang.reflect.Method.invoke(Method.java:597)
	at org.apache.maven.surefire.util.ReflectionUtils.invokeMethodWithArray(ReflectionUtils.java:189)
	at org.apache.maven.surefire.booter.ProviderFactory$ProviderProxy.invoke(ProviderFactory.java:165)
	at org.apache.maven.surefire.booter.ProviderFactory.invokeProvider(ProviderFactory.java:85)
	at org.apache.maven.surefire.booter.ForkedBooter.runSuitesInProcess(ForkedBooter.java:103)
	at org.apache.maven.surefire.booter.ForkedBooter.main(ForkedBooter.java:74)


FAILED:  org.apache.hadoop.yarn.server.resourcemanager.TestAMAuthorization.testAuthorizedAccess

Error Message:
java.lang.reflect.InvocationTargetException

Stack Trace:
org.apache.hadoop.yarn.YarnException: java.lang.reflect.InvocationTargetException
	at org.apache.hadoop.yarn.factories.impl.pb.RpcClientFactoryPBImpl.getClient(RpcClientFactoryPBImpl.java:76)
	at org.apache.hadoop.yarn.ipc.HadoopYarnProtoRPC.getProxy(HadoopYarnProtoRPC.java:46)
	at org.apache.hadoop.yarn.server.resourcemanager.TestAMAuthorization$1.run(TestAMAuthorization.java:157)
	at org.apache.hadoop.yarn.server.resourcemanager.TestAMAuthorization$1.run(TestAMAuthorization.java:154)
	at java.security.AccessController.doPrivileged(Native Method)
	at javax.security.auth.Subject.doAs(Subject.java:337)
	at org.apache.hadoop.security.UserGroupInformation.doAs(UserGroupInformation.java:1358)
	at org.apache.hadoop.yarn.server.resourcemanager.TestAMAuthorization.testAuthorizedAccess(TestAMAuthorization.java:153)
	at sun.reflect.NativeMethodAccessorImpl.invoke0(Native Method)
	at sun.reflect.NativeMethodAccessorImpl.invoke(NativeMethodAccessorImpl.java:39)
	at sun.reflect.DelegatingMethodAccessorImpl.invoke(DelegatingMethodAccessorImpl.java:25)
	at java.lang.reflect.Method.invoke(Method.java:597)
	at org.junit.runners.model.FrameworkMethod$1.runReflectiveCall(FrameworkMethod.java:44)
	at org.junit.internal.runners.model.ReflectiveCallable.run(ReflectiveCallable.java:15)
	at org.junit.runners.model.FrameworkMethod.invokeExplosively(FrameworkMethod.java:41)
	at org.junit.internal.runners.statements.InvokeMethod.evaluate(InvokeMethod.java:20)
	at org.junit.runners.BlockJUnit4ClassRunner.runNotIgnored(BlockJUnit4ClassRunner.java:79)
	at org.junit.runners.BlockJUnit4ClassRunner.runChild(BlockJUnit4ClassRunner.java:71)
	at org.junit.runners.BlockJUnit4ClassRunner.runChild(BlockJUnit4ClassRunner.java:49)
	at org.junit.runners.ParentRunner$3.run(ParentRunner.java:193)
	at org.junit.runners.ParentRunner$1.schedule(ParentRunner.java:52)
	at org.junit.runners.ParentRunner.runChildren(ParentRunner.java:191)
	at org.junit.runners.ParentRunner.access$000(ParentRunner.java:42)
	at org.junit.runners.ParentRunner$2.evaluate(ParentRunner.java:184)
	at org.junit.runners.ParentRunner.run(ParentRunner.java:236)
	at org.apache.maven.surefire.junit4.JUnit4Provider.execute(JUnit4Provider.java:236)
	at org.apache.maven.surefire.junit4.JUnit4Provider.executeTestSet(JUnit4Provider.java:134)
	at org.apache.maven.surefire.junit4.JUnit4Provider.invoke(JUnit4Provider.java:113)
	at sun.reflect.NativeMethodAccessorImpl.invoke0(Native Method)
	at sun.reflect.NativeMethodAccessorImpl.invoke(NativeMethodAccessorImpl.java:39)
	at sun.reflect.DelegatingMethodAccessorImpl.invoke(DelegatingMethodAccessorImpl.java:25)
	at java.lang.reflect.Method.invoke(Method.java:597)
	at org.apache.maven.surefire.util.ReflectionUtils.invokeMethodWithArray(ReflectionUtils.java:189)
	at org.apache.maven.surefire.booter.ProviderFactory$ProviderProxy.invoke(ProviderFactory.java:165)
	at org.apache.maven.surefire.booter.ProviderFactory.invokeProvider(ProviderFactory.java:85)
	at org.apache.maven.surefire.booter.ForkedBooter.runSuitesInProcess(ForkedBooter.java:103)
	at org.apache.maven.surefire.booter.ForkedBooter.main(ForkedBooter.java:74)
Caused by: java.lang.reflect.InvocationTargetException
	at sun.reflect.NativeConstructorAccessorImpl.newInstance0(Native Method)
	at sun.reflect.NativeConstructorAccessorImpl.newInstance(NativeConstructorAccessorImpl.java:39)
	at sun.reflect.DelegatingConstructorAccessorImpl.newInstance(DelegatingConstructorAccessorImpl.java:27)
	at java.lang.reflect.Constructor.newInstance(Constructor.java:513)
	at org.apache.hadoop.yarn.factories.impl.pb.RpcClientFactoryPBImpl.getClient(RpcClientFactoryPBImpl.java:73)
	... 36 more
Caused by: java.util.ServiceConfigurationError: org.apache.hadoop.security.SecurityInfo: Provider
org.apache.hadoop.yarn..security.admin.AdminSecurityInfo not found
	at java.util.ServiceLoader.fail(ServiceLoader.java:214)
	at java.util.ServiceLoader.access$400(ServiceLoader.java:164)
	at java.util.ServiceLoader$LazyIterator.next(ServiceLoader.java:350)
	at java.util.ServiceLoader$1.next(ServiceLoader.java:421)
	at org.apache.hadoop.security.SecurityUtil.getKerberosInfo(SecurityUtil.java:339)
	at org.apache.hadoop.ipc.Client$ConnectionId.getRemotePrincipal(Client.java:1354)
	at org.apache.hadoop.ipc.Client$ConnectionId.getConnectionId(Client.java:1332)
	at org.apache.hadoop.ipc.ProtobufRpcEngine$Invoker.<init>(ProtobufRpcEngine.java:114)
	at org.apache.hadoop.ipc.ProtobufRpcEngine$Invoker.<init>(ProtobufRpcEngine.java:102)
	at org.apache.hadoop.ipc.ProtobufRpcEngine.getProxy(ProtobufRpcEngine.java:85)
	at org.apache.hadoop.ipc.RPC.getProtocolProxy(RPC.java:526)
	at org.apache.hadoop.ipc.RPC.getProtocolProxy(RPC.java:471)
	at org.apache.hadoop.ipc.RPC.getProtocolProxy(RPC.java:436)
	at org.apache.hadoop.ipc.RPC.getProtocolProxy(RPC.java:589)
	at org.apache.hadoop.ipc.RPC.getProxy(RPC.java:546)
	at org.apache.hadoop.yarn.api.impl.pb.client.AMRMProtocolPBClientImpl.<init>(AMRMProtocolPBClientImpl.java:57)
	... 41 more


FAILED:  org.apache.hadoop.yarn.server.resourcemanager.TestAMAuthorization.testUnauthorizedAccess

Error Message:
Failed to Start ResourceManager

Stack Trace:
org.apache.hadoop.yarn.YarnException: Failed to Start ResourceManager
	at org.apache.hadoop.yarn.service.CompositeService.start(CompositeService.java:78)
	at org.apache.hadoop.yarn.server.resourcemanager.ResourceManager.start(ResourceManager.java:525)
	at org.apache.hadoop.yarn.server.resourcemanager.TestAMAuthorization.testUnauthorizedAccess(TestAMAuthorization.java:177)
	at sun.reflect.NativeMethodAccessorImpl.invoke0(Native Method)
	at sun.reflect.NativeMethodAccessorImpl.invoke(NativeMethodAccessorImpl.java:39)
	at sun.reflect.DelegatingMethodAccessorImpl.invoke(DelegatingMethodAccessorImpl.java:25)
	at java.lang.reflect.Method.invoke(Method.java:597)
	at org.junit.runners.model.FrameworkMethod$1.runReflectiveCall(FrameworkMethod.java:44)
	at org.junit.internal.runners.model.ReflectiveCallable.run(ReflectiveCallable.java:15)
	at org.junit.runners.model.FrameworkMethod.invokeExplosively(FrameworkMethod.java:41)
	at org.junit.internal.runners.statements.InvokeMethod.evaluate(InvokeMethod.java:20)
	at org.junit.runners.BlockJUnit4ClassRunner.runNotIgnored(BlockJUnit4ClassRunner.java:79)
	at org.junit.runners.BlockJUnit4ClassRunner.runChild(BlockJUnit4ClassRunner.java:71)
	at org.junit.runners.BlockJUnit4ClassRunner.runChild(BlockJUnit4ClassRunner.java:49)
	at org.junit.runners.ParentRunner$3.run(ParentRunner.java:193)
	at org.junit.runners.ParentRunner$1.schedule(ParentRunner.java:52)
	at org.junit.runners.ParentRunner.runChildren(ParentRunner.java:191)
	at org.junit.runners.ParentRunner.access$000(ParentRunner.java:42)
	at org.junit.runners.ParentRunner$2.evaluate(ParentRunner.java:184)
	at org.junit.runners.ParentRunner.run(ParentRunner.java:236)
	at org.apache.maven.surefire.junit4.JUnit4Provider.execute(JUnit4Provider.java:236)
	at org.apache.maven.surefire.junit4.JUnit4Provider.executeTestSet(JUnit4Provider.java:134)
	at org.apache.maven.surefire.junit4.JUnit4Provider.invoke(JUnit4Provider.java:113)
	at sun.reflect.NativeMethodAccessorImpl.invoke0(Native Method)
	at sun.reflect.NativeMethodAccessorImpl.invoke(NativeMethodAccessorImpl.java:39)
	at sun.reflect.DelegatingMethodAccessorImpl.invoke(DelegatingMethodAccessorImpl.java:25)
	at java.lang.reflect.Method.invoke(Method.java:597)
	at org.apache.maven.surefire.util.ReflectionUtils.invokeMethodWithArray(ReflectionUtils.java:189)
	at org.apache.maven.surefire.booter.ProviderFactory$ProviderProxy.invoke(ProviderFactory.java:165)
	at org.apache.maven.surefire.booter.ProviderFactory.invokeProvider(ProviderFactory.java:85)
	at org.apache.maven.surefire.booter.ForkedBooter.runSuitesInProcess(ForkedBooter.java:103)
	at org.apache.maven.surefire.booter.ForkedBooter.main(ForkedBooter.java:74)
Caused by: org.apache.hadoop.yarn.YarnException: java.net.BindException: Problem binding to
[0.0.0.0:8030] java.net.BindException: Address already in use; For more details see:  http://wiki.apache.org/hadoop/BindException
	at org.apache.hadoop.yarn.factories.impl.pb.RpcServerFactoryPBImpl.getServer(RpcServerFactoryPBImpl.java:139)
	at org.apache.hadoop.yarn.ipc.HadoopYarnProtoRPC.getServer(HadoopYarnProtoRPC.java:63)
	at org.apache.hadoop.yarn.ipc.YarnRPC.getServer(YarnRPC.java:52)
	at org.apache.hadoop.yarn.server.resourcemanager.ApplicationMasterService.start(ApplicationMasterService.java:106)
	at org.apache.hadoop.yarn.service.CompositeService.start(CompositeService.java:68)
	... 31 more
Caused by: java.net.BindException: Problem binding to [0.0.0.0:8030] java.net.BindException:
Address already in use; For more details see:  http://wiki.apache.org/hadoop/BindException
	at org.apache.hadoop.net.NetUtils.wrapException(NetUtils.java:710)
	at org.apache.hadoop.ipc.Server.bind(Server.java:396)
	at org.apache.hadoop.ipc.Server$Listener.<init>(Server.java:494)
	at org.apache.hadoop.ipc.Server.<init>(Server.java:1887)
	at org.apache.hadoop.ipc.RPC$Server.<init>(RPC.java:986)
	at org.apache.hadoop.ipc.ProtobufRpcEngine$Server.<init>(ProtobufRpcEngine.java:376)
	at org.apache.hadoop.ipc.ProtobufRpcEngine.getServer(ProtobufRpcEngine.java:351)
	at org.apache.hadoop.ipc.RPC$Builder.build(RPC.java:829)
	at org.apache.hadoop.yarn.factories.impl.pb.RpcServerFactoryPBImpl.createServer(RpcServerFactoryPBImpl.java:169)
	at org.apache.hadoop.yarn.factories.impl.pb.RpcServerFactoryPBImpl.getServer(RpcServerFactoryPBImpl.java:132)
	... 35 more


FAILED:  org.apache.hadoop.yarn.server.resourcemanager.security.TestApplicationTokens.testTokenExpiry

Error Message:
java.lang.reflect.InvocationTargetException

Stack Trace:
org.apache.hadoop.yarn.YarnException: java.lang.reflect.InvocationTargetException
	at org.apache.hadoop.yarn.factories.impl.pb.RpcClientFactoryPBImpl.getClient(RpcClientFactoryPBImpl.java:76)
	at org.apache.hadoop.yarn.ipc.HadoopYarnProtoRPC.getProxy(HadoopYarnProtoRPC.java:46)
	at org.apache.hadoop.yarn.server.resourcemanager.security.TestApplicationTokens$1.run(TestApplicationTokens.java:229)
	at org.apache.hadoop.yarn.server.resourcemanager.security.TestApplicationTokens$1.run(TestApplicationTokens.java:226)
	at java.security.AccessController.doPrivileged(Native Method)
	at javax.security.auth.Subject.doAs(Subject.java:337)
	at org.apache.hadoop.security.UserGroupInformation.doAs(UserGroupInformation.java:1358)
	at org.apache.hadoop.yarn.server.resourcemanager.security.TestApplicationTokens.createRMClient(TestApplicationTokens.java:226)
	at org.apache.hadoop.yarn.server.resourcemanager.security.TestApplicationTokens.testTokenExpiry(TestApplicationTokens.java:99)
	at sun.reflect.NativeMethodAccessorImpl.invoke0(Native Method)
	at sun.reflect.NativeMethodAccessorImpl.invoke(NativeMethodAccessorImpl.java:39)
	at sun.reflect.DelegatingMethodAccessorImpl.invoke(DelegatingMethodAccessorImpl.java:25)
	at java.lang.reflect.Method.invoke(Method.java:597)
	at org.junit.runners.model.FrameworkMethod$1.runReflectiveCall(FrameworkMethod.java:44)
	at org.junit.internal.runners.model.ReflectiveCallable.run(ReflectiveCallable.java:15)
	at org.junit.runners.model.FrameworkMethod.invokeExplosively(FrameworkMethod.java:41)
	at org.junit.internal.runners.statements.InvokeMethod.evaluate(InvokeMethod.java:20)
	at org.junit.runners.BlockJUnit4ClassRunner.runNotIgnored(BlockJUnit4ClassRunner.java:79)
	at org.junit.runners.BlockJUnit4ClassRunner.runChild(BlockJUnit4ClassRunner.java:71)
	at org.junit.runners.BlockJUnit4ClassRunner.runChild(BlockJUnit4ClassRunner.java:49)
	at org.junit.runners.ParentRunner$3.run(ParentRunner.java:193)
	at org.junit.runners.ParentRunner$1.schedule(ParentRunner.java:52)
	at org.junit.runners.ParentRunner.runChildren(ParentRunner.java:191)
	at org.junit.runners.ParentRunner.access$000(ParentRunner.java:42)
	at org.junit.runners.ParentRunner$2.evaluate(ParentRunner.java:184)
	at org.junit.runners.ParentRunner.run(ParentRunner.java:236)
	at org.apache.maven.surefire.junit4.JUnit4Provider.execute(JUnit4Provider.java:236)
	at org.apache.maven.surefire.junit4.JUnit4Provider.executeTestSet(JUnit4Provider.java:134)
	at org.apache.maven.surefire.junit4.JUnit4Provider.invoke(JUnit4Provider.java:113)
	at sun.reflect.NativeMethodAccessorImpl.invoke0(Native Method)
	at sun.reflect.NativeMethodAccessorImpl.invoke(NativeMethodAccessorImpl.java:39)
	at sun.reflect.DelegatingMethodAccessorImpl.invoke(DelegatingMethodAccessorImpl.java:25)
	at java.lang.reflect.Method.invoke(Method.java:597)
	at org.apache.maven.surefire.util.ReflectionUtils.invokeMethodWithArray(ReflectionUtils.java:189)
	at org.apache.maven.surefire.booter.ProviderFactory$ProviderProxy.invoke(ProviderFactory.java:165)
	at org.apache.maven.surefire.booter.ProviderFactory.invokeProvider(ProviderFactory.java:85)
	at org.apache.maven.surefire.booter.ForkedBooter.runSuitesInProcess(ForkedBooter.java:103)
	at org.apache.maven.surefire.booter.ForkedBooter.main(ForkedBooter.java:74)
Caused by: java.lang.reflect.InvocationTargetException
	at sun.reflect.NativeConstructorAccessorImpl.newInstance0(Native Method)
	at sun.reflect.NativeConstructorAccessorImpl.newInstance(NativeConstructorAccessorImpl.java:39)
	at sun.reflect.DelegatingConstructorAccessorImpl.newInstance(DelegatingConstructorAccessorImpl.java:27)
	at java.lang.reflect.Constructor.newInstance(Constructor.java:513)
	at org.apache.hadoop.yarn.factories.impl.pb.RpcClientFactoryPBImpl.getClient(RpcClientFactoryPBImpl.java:73)
	... 37 more
Caused by: java.util.ServiceConfigurationError: org.apache.hadoop.security.SecurityInfo: Provider
org.apache.hadoop.yarn..security.admin.AdminSecurityInfo not found
	at java.util.ServiceLoader.fail(ServiceLoader.java:214)
	at java.util.ServiceLoader.access$400(ServiceLoader.java:164)
	at java.util.ServiceLoader$LazyIterator.next(ServiceLoader.java:350)
	at java.util.ServiceLoader$1.next(ServiceLoader.java:421)
	at org.apache.hadoop.security.SecurityUtil.getKerberosInfo(SecurityUtil.java:339)
	at org.apache.hadoop.ipc.Client$ConnectionId.getRemotePrincipal(Client.java:1354)
	at org.apache.hadoop.ipc.Client$ConnectionId.getConnectionId(Client.java:1332)
	at org.apache.hadoop.ipc.ProtobufRpcEngine$Invoker.<init>(ProtobufRpcEngine.java:114)
	at org.apache.hadoop.ipc.ProtobufRpcEngine$Invoker.<init>(ProtobufRpcEngine.java:102)
	at org.apache.hadoop.ipc.ProtobufRpcEngine.getProxy(ProtobufRpcEngine.java:85)
	at org.apache.hadoop.ipc.RPC.getProtocolProxy(RPC.java:526)
	at org.apache.hadoop.ipc.RPC.getProtocolProxy(RPC.java:471)
	at org.apache.hadoop.ipc.RPC.getProtocolProxy(RPC.java:436)
	at org.apache.hadoop.ipc.RPC.getProtocolProxy(RPC.java:589)
	at org.apache.hadoop.ipc.RPC.getProxy(RPC.java:546)
	at org.apache.hadoop.yarn.api.impl.pb.client.AMRMProtocolPBClientImpl.<init>(AMRMProtocolPBClientImpl.java:57)
	... 42 more



Mime
  • Unnamed multipart/mixed (inline, None, 0 bytes)
View raw message