hadoop-yarn-dev mailing list archives

Site index · List index
Message view « Date » · « Thread »
Top « Date » · « Thread »
From Apache Jenkins Server <jenk...@builds.apache.org>
Subject Build failed in Jenkins: Hadoop-Yarn-trunk #10
Date Sun, 21 Oct 2012 10:39:51 GMT
See <https://builds.apache.org/job/Hadoop-Yarn-trunk/10/changes>

Changes:

[umamahesh] HDFS-4022. Replication not happening for appended block. Contributed by Vinay.

[suresh] Change incorrect jira number HADOOP-8923 to HADOOP-8932 introduced in commit r1398883.

------------------------------------------
[...truncated 12786 lines...]
    [mkdir] Created dir: <https://builds.apache.org/job/Hadoop-Yarn-trunk/ws/trunk/hadoop-yarn-project/hadoop-yarn/hadoop-yarn-server/hadoop-yarn-server-nodemanager/target/test-dir>
[INFO] Executed tasks
[INFO] 
[INFO] --- maven-antrun-plugin:1.6:run (create-protobuf-generated-sources-directory) @ hadoop-yarn-server-nodemanager
---
[INFO] Executing tasks

main:
    [mkdir] Created dir: <https://builds.apache.org/job/Hadoop-Yarn-trunk/ws/trunk/hadoop-yarn-project/hadoop-yarn/hadoop-yarn-server/hadoop-yarn-server-nodemanager/target/generated-sources/proto>
[INFO] Executed tasks
[INFO] 
[INFO] --- maven-antrun-plugin:1.6:run (compile) @ hadoop-yarn-server-nodemanager ---
[INFO] No ant target defined - SKIPPED
[INFO] 
[INFO] --- maven-dependency-plugin:2.1:build-classpath (build-classpath) @ hadoop-yarn-server-nodemanager
---
[INFO] Wrote classpath file '<https://builds.apache.org/job/Hadoop-Yarn-trunk/ws/trunk/hadoop-yarn-project/hadoop-yarn/hadoop-yarn-server/hadoop-yarn-server-nodemanager/target/classes/mrapp-generated-classpath'.>
[INFO] 
[INFO] --- exec-maven-plugin:1.2:exec (generate-sources) @ hadoop-yarn-server-nodemanager
---
[INFO] 
[INFO] --- build-helper-maven-plugin:1.5:add-source (add-source) @ hadoop-yarn-server-nodemanager
---
[INFO] Source directory: <https://builds.apache.org/job/Hadoop-Yarn-trunk/ws/trunk/hadoop-yarn-project/hadoop-yarn/hadoop-yarn-server/hadoop-yarn-server-nodemanager/target/generated-sources/proto>
added.
[INFO] 
[INFO] --- maven-resources-plugin:2.2:resources (default-resources) @ hadoop-yarn-server-nodemanager
---
[INFO] Using default encoding to copy filtered resources.
[INFO] 
[INFO] --- maven-compiler-plugin:2.5.1:compile (default-compile) @ hadoop-yarn-server-nodemanager
---
[INFO] Compiling 132 source files to <https://builds.apache.org/job/Hadoop-Yarn-trunk/ws/trunk/hadoop-yarn-project/hadoop-yarn/hadoop-yarn-server/hadoop-yarn-server-nodemanager/target/classes>
[INFO] 
[INFO] --- maven-antrun-plugin:1.6:run (make) @ hadoop-yarn-server-nodemanager ---
[INFO] Executing tasks

main:
    [mkdir] Created dir: <https://builds.apache.org/job/Hadoop-Yarn-trunk/ws/trunk/hadoop-yarn-project/hadoop-yarn/hadoop-yarn-server/hadoop-yarn-server-nodemanager/target/native/target>
     [exec] -- The C compiler identification is GNU
     [exec] -- The CXX compiler identification is GNU
     [exec] -- Check for working C compiler: /usr/bin/gcc
     [exec] -- Check for working C compiler: /usr/bin/gcc -- works
     [exec] -- Detecting C compiler ABI info
     [exec] -- Detecting C compiler ABI info - done
     [exec] -- Check for working CXX compiler: /usr/bin/c++
     [exec] -- Check for working CXX compiler: /usr/bin/c++ -- works
     [exec] -- Detecting CXX compiler ABI info
     [exec] -- Detecting CXX compiler ABI info - done
     [exec] JAVA_HOME=, JAVA_JVM_LIBRARY=/home/jenkins/tools/java/latest/jre/lib/i386/client/libjvm.so
     [exec] JAVA_INCLUDE_PATH=/home/jenkins/tools/java/latest/include, JAVA_INCLUDE_PATH2=/home/jenkins/tools/java/latest/include/linux
     [exec] Located all JNI components successfully.
     [exec] -- Configuring done
     [exec] -- Generating done
     [exec] -- Build files have been written to: <https://builds.apache.org/job/Hadoop-Yarn-trunk/ws/trunk/hadoop-yarn-project/hadoop-yarn/hadoop-yarn-server/hadoop-yarn-server-nodemanager/target/native>
     [exec] /usr/bin/cmake -H<https://builds.apache.org/job/Hadoop-Yarn-trunk/ws/trunk/hadoop-yarn-project/hadoop-yarn/hadoop-yarn-server/hadoop-yarn-server-nodemanager/src>
-B<https://builds.apache.org/job/Hadoop-Yarn-trunk/ws/trunk/hadoop-yarn-project/hadoop-yarn/hadoop-yarn-server/hadoop-yarn-server-nodemanager/target/native>
--check-build-system CMakeFiles/Makefile.cmake 0
     [exec] /usr/bin/cmake -E cmake_progress_start <https://builds.apache.org/job/Hadoop-Yarn-trunk/ws/trunk/hadoop-yarn-project/hadoop-yarn/hadoop-yarn-server/hadoop-yarn-server-nodemanager/target/native/CMakeFiles>
<https://builds.apache.org/job/Hadoop-Yarn-trunk/ws/trunk/hadoop-yarn-project/hadoop-yarn/hadoop-yarn-server/hadoop-yarn-server-nodemanager/target/native/CMakeFiles/progress.marks>
     [exec] make -f CMakeFiles/Makefile2 all
     [exec] make[1]: Entering directory `<https://builds.apache.org/job/Hadoop-Yarn-trunk/ws/trunk/hadoop-yarn-project/hadoop-yarn/hadoop-yarn-server/hadoop-yarn-server-nodemanager/target/native'>
     [exec] make -f CMakeFiles/container.dir/build.make CMakeFiles/container.dir/depend
     [exec] make[2]: Entering directory `<https://builds.apache.org/job/Hadoop-Yarn-trunk/ws/trunk/hadoop-yarn-project/hadoop-yarn/hadoop-yarn-server/hadoop-yarn-server-nodemanager/target/native'>
     [exec] cd <https://builds.apache.org/job/Hadoop-Yarn-trunk/ws/trunk/hadoop-yarn-project/hadoop-yarn/hadoop-yarn-server/hadoop-yarn-server-nodemanager/target/native>
&& /usr/bin/cmake -E cmake_depends "Unix Makefiles" <https://builds.apache.org/job/Hadoop-Yarn-trunk/ws/trunk/hadoop-yarn-project/hadoop-yarn/hadoop-yarn-server/hadoop-yarn-server-nodemanager/src>
<https://builds.apache.org/job/Hadoop-Yarn-trunk/ws/trunk/hadoop-yarn-project/hadoop-yarn/hadoop-yarn-server/hadoop-yarn-server-nodemanager/src>
<https://builds.apache.org/job/Hadoop-Yarn-trunk/ws/trunk/hadoop-yarn-project/hadoop-yarn/hadoop-yarn-server/hadoop-yarn-server-nodemanager/target/native>
<https://builds.apache.org/job/Hadoop-Yarn-trunk/ws/trunk/hadoop-yarn-project/hadoop-yarn/hadoop-yarn-server/hadoop-yarn-server-nodemanager/target/native>
<https://builds.apache.org/job/Hadoop-Yarn-trunk/ws/trunk/hadoop-yarn-project/hadoop-yarn/hadoop-yarn-server/hadoop-yarn-server-nodemanager/target/native/CMakeFiles/container.dir/DependInfo.cmake>
--color=
     [exec] Dependee "<https://builds.apache.org/job/Hadoop-Yarn-trunk/ws/trunk/hadoop-yarn-project/hadoop-yarn/hadoop-yarn-server/hadoop-yarn-server-nodemanager/target/native/CMakeFiles/container.dir/DependInfo.cmake">
is newer than depender "<https://builds.apache.org/job/Hadoop-Yarn-trunk/ws/trunk/hadoop-yarn-project/hadoop-yarn/hadoop-yarn-server/hadoop-yarn-server-nodemanager/target/native/CMakeFiles/container.dir/depend.internal".>
     [exec] Dependee "<https://builds.apache.org/job/Hadoop-Yarn-trunk/ws/trunk/hadoop-yarn-project/hadoop-yarn/hadoop-yarn-server/hadoop-yarn-server-nodemanager/target/native/CMakeFiles/CMakeDirectoryInformation.cmake">
is newer than depender "<https://builds.apache.org/job/Hadoop-Yarn-trunk/ws/trunk/hadoop-yarn-project/hadoop-yarn/hadoop-yarn-server/hadoop-yarn-server-nodemanager/target/native/CMakeFiles/container.dir/depend.internal".>
     [exec] Scanning dependencies of target container
     [exec] make[2]: Leaving directory `<https://builds.apache.org/job/Hadoop-Yarn-trunk/ws/trunk/hadoop-yarn-project/hadoop-yarn/hadoop-yarn-server/hadoop-yarn-server-nodemanager/target/native'>
     [exec] make -f CMakeFiles/container.dir/build.make CMakeFiles/container.dir/build
     [exec] make[2]: Entering directory `<https://builds.apache.org/job/Hadoop-Yarn-trunk/ws/trunk/hadoop-yarn-project/hadoop-yarn/hadoop-yarn-server/hadoop-yarn-server-nodemanager/target/native'>
     [exec] /usr/bin/cmake -E cmake_progress_report <https://builds.apache.org/job/Hadoop-Yarn-trunk/ws/trunk/hadoop-yarn-project/hadoop-yarn/hadoop-yarn-server/hadoop-yarn-server-nodemanager/target/native/CMakeFiles>
1
     [exec] [ 25%] Building C object CMakeFiles/container.dir/main/native/container-executor/impl/configuration.c.o
     [exec] /usr/bin/gcc   -m32 -g -Wall -O2 -D_GNU_SOURCE -D_REENTRANT -I<https://builds.apache.org/job/Hadoop-Yarn-trunk/ws/trunk/hadoop-yarn-project/hadoop-yarn/hadoop-yarn-server/hadoop-yarn-server-nodemanager/src>
-I<https://builds.apache.org/job/Hadoop-Yarn-trunk/ws/trunk/hadoop-yarn-project/hadoop-yarn/hadoop-yarn-server/hadoop-yarn-server-nodemanager/target/native>
-I<https://builds.apache.org/job/Hadoop-Yarn-trunk/ws/trunk/hadoop-yarn-project/hadoop-yarn/hadoop-yarn-server/hadoop-yarn-server-nodemanager/src/main/native/container-executor>
-I<https://builds.apache.org/job/Hadoop-Yarn-trunk/ws/trunk/hadoop-yarn-project/hadoop-yarn/hadoop-yarn-server/hadoop-yarn-server-nodemanager/src/main/native/container-executor/impl>
  -o CMakeFiles/container.dir/main/native/container-executor/impl/configuration.c.o   -c <https://builds.apache.org/job/Hadoop-Yarn-trunk/ws/trunk/hadoop-yarn-project/hadoop-yarn/hadoop-yarn-server/hadoop-yarn-server-nodemanager/src/main/native/container-executor/impl/configuration.c>
     [exec] /usr/bin/cmake -E cmake_progress_report <https://builds.apache.org/job/Hadoop-Yarn-trunk/ws/trunk/hadoop-yarn-project/hadoop-yarn/hadoop-yarn-server/hadoop-yarn-server-nodemanager/target/native/CMakeFiles>
2
     [exec] [ 50%] Building C object CMakeFiles/container.dir/main/native/container-executor/impl/container-executor.c.o
     [exec] /usr/bin/gcc   -m32 -g -Wall -O2 -D_GNU_SOURCE -D_REENTRANT -I<https://builds.apache.org/job/Hadoop-Yarn-trunk/ws/trunk/hadoop-yarn-project/hadoop-yarn/hadoop-yarn-server/hadoop-yarn-server-nodemanager/src>
-I<https://builds.apache.org/job/Hadoop-Yarn-trunk/ws/trunk/hadoop-yarn-project/hadoop-yarn/hadoop-yarn-server/hadoop-yarn-server-nodemanager/target/native>
-I<https://builds.apache.org/job/Hadoop-Yarn-trunk/ws/trunk/hadoop-yarn-project/hadoop-yarn/hadoop-yarn-server/hadoop-yarn-server-nodemanager/src/main/native/container-executor>
-I<https://builds.apache.org/job/Hadoop-Yarn-trunk/ws/trunk/hadoop-yarn-project/hadoop-yarn/hadoop-yarn-server/hadoop-yarn-server-nodemanager/src/main/native/container-executor/impl>
  -o CMakeFiles/container.dir/main/native/container-executor/impl/container-executor.c.o 
 -c <https://builds.apache.org/job/Hadoop-Yarn-trunk/ws/trunk/hadoop-yarn-project/hadoop-yarn/hadoop-yarn-server/hadoop-yarn-server-nodemanager/src/main/native/container-executor/impl/container-executor.c>
     [exec] Linking C static library libcontainer.a
     [exec] /usr/bin/cmake -P CMakeFiles/container.dir/cmake_clean_target.cmake
     [exec] /usr/bin/cmake -E cmake_link_script CMakeFiles/container.dir/link.txt --verbose=1
     [exec] /usr/bin/ar cr libcontainer.a  CMakeFiles/container.dir/main/native/container-executor/impl/configuration.c.o
CMakeFiles/container.dir/main/native/container-executor/impl/container-executor.c.o
     [exec] /usr/bin/ranlib libcontainer.a
     [exec] make[2]: Leaving directory `<https://builds.apache.org/job/Hadoop-Yarn-trunk/ws/trunk/hadoop-yarn-project/hadoop-yarn/hadoop-yarn-server/hadoop-yarn-server-nodemanager/target/native'>
     [exec] /usr/bin/cmake -E cmake_progress_report <https://builds.apache.org/job/Hadoop-Yarn-trunk/ws/trunk/hadoop-yarn-project/hadoop-yarn/hadoop-yarn-server/hadoop-yarn-server-nodemanager/target/native/CMakeFiles>
 1 2
     [exec] [ 50%] Built target container
     [exec] make -f CMakeFiles/container-executor.dir/build.make CMakeFiles/container-executor.dir/depend
     [exec] make[2]: Entering directory `<https://builds.apache.org/job/Hadoop-Yarn-trunk/ws/trunk/hadoop-yarn-project/hadoop-yarn/hadoop-yarn-server/hadoop-yarn-server-nodemanager/target/native'>
     [exec] cd <https://builds.apache.org/job/Hadoop-Yarn-trunk/ws/trunk/hadoop-yarn-project/hadoop-yarn/hadoop-yarn-server/hadoop-yarn-server-nodemanager/target/native>
&& /usr/bin/cmake -E cmake_depends "Unix Makefiles" <https://builds.apache.org/job/Hadoop-Yarn-trunk/ws/trunk/hadoop-yarn-project/hadoop-yarn/hadoop-yarn-server/hadoop-yarn-server-nodemanager/src>
<https://builds.apache.org/job/Hadoop-Yarn-trunk/ws/trunk/hadoop-yarn-project/hadoop-yarn/hadoop-yarn-server/hadoop-yarn-server-nodemanager/src>
<https://builds.apache.org/job/Hadoop-Yarn-trunk/ws/trunk/hadoop-yarn-project/hadoop-yarn/hadoop-yarn-server/hadoop-yarn-server-nodemanager/target/native>
<https://builds.apache.org/job/Hadoop-Yarn-trunk/ws/trunk/hadoop-yarn-project/hadoop-yarn/hadoop-yarn-server/hadoop-yarn-server-nodemanager/target/native>
<https://builds.apache.org/job/Hadoop-Yarn-trunk/ws/trunk/hadoop-yarn-project/hadoop-yarn/hadoop-yarn-server/hadoop-yarn-server-nodemanager/target/native/CMakeFiles/container-executor.dir/DependInfo.cmake>
--color=
     [exec] Dependee "<https://builds.apache.org/job/Hadoop-Yarn-trunk/ws/trunk/hadoop-yarn-project/hadoop-yarn/hadoop-yarn-server/hadoop-yarn-server-nodemanager/target/native/CMakeFiles/container-executor.dir/DependInfo.cmake">
is newer than depender "<https://builds.apache.org/job/Hadoop-Yarn-trunk/ws/trunk/hadoop-yarn-project/hadoop-yarn/hadoop-yarn-server/hadoop-yarn-server-nodemanager/target/native/CMakeFiles/container-executor.dir/depend.internal".>
     [exec] Dependee "<https://builds.apache.org/job/Hadoop-Yarn-trunk/ws/trunk/hadoop-yarn-project/hadoop-yarn/hadoop-yarn-server/hadoop-yarn-server-nodemanager/target/native/CMakeFiles/CMakeDirectoryInformation.cmake">
is newer than depender "<https://builds.apache.org/job/Hadoop-Yarn-trunk/ws/trunk/hadoop-yarn-project/hadoop-yarn/hadoop-yarn-server/hadoop-yarn-server-nodemanager/target/native/CMakeFiles/container-executor.dir/depend.internal".>
     [exec] Scanning dependencies of target container-executor
     [exec] make[2]: Leaving directory `<https://builds.apache.org/job/Hadoop-Yarn-trunk/ws/trunk/hadoop-yarn-project/hadoop-yarn/hadoop-yarn-server/hadoop-yarn-server-nodemanager/target/native'>
     [exec] make -f CMakeFiles/container-executor.dir/build.make CMakeFiles/container-executor.dir/build
     [exec] make[2]: Entering directory `<https://builds.apache.org/job/Hadoop-Yarn-trunk/ws/trunk/hadoop-yarn-project/hadoop-yarn/hadoop-yarn-server/hadoop-yarn-server-nodemanager/target/native'>
     [exec] /usr/bin/cmake -E cmake_progress_report <https://builds.apache.org/job/Hadoop-Yarn-trunk/ws/trunk/hadoop-yarn-project/hadoop-yarn/hadoop-yarn-server/hadoop-yarn-server-nodemanager/target/native/CMakeFiles>
3
     [exec] [ 75%] Building C object CMakeFiles/container-executor.dir/main/native/container-executor/impl/main.c.o
     [exec] /usr/bin/gcc   -m32 -g -Wall -O2 -D_GNU_SOURCE -D_REENTRANT -I<https://builds.apache.org/job/Hadoop-Yarn-trunk/ws/trunk/hadoop-yarn-project/hadoop-yarn/hadoop-yarn-server/hadoop-yarn-server-nodemanager/src>
-I<https://builds.apache.org/job/Hadoop-Yarn-trunk/ws/trunk/hadoop-yarn-project/hadoop-yarn/hadoop-yarn-server/hadoop-yarn-server-nodemanager/target/native>
-I<https://builds.apache.org/job/Hadoop-Yarn-trunk/ws/trunk/hadoop-yarn-project/hadoop-yarn/hadoop-yarn-server/hadoop-yarn-server-nodemanager/src/main/native/container-executor>
-I<https://builds.apache.org/job/Hadoop-Yarn-trunk/ws/trunk/hadoop-yarn-project/hadoop-yarn/hadoop-yarn-server/hadoop-yarn-server-nodemanager/src/main/native/container-executor/impl>
  -o CMakeFiles/container-executor.dir/main/native/container-executor/impl/main.c.o   -c <https://builds.apache.org/job/Hadoop-Yarn-trunk/ws/trunk/hadoop-yarn-project/hadoop-yarn/hadoop-yarn-server/hadoop-yarn-server-nodemanager/src/main/native/container-executor/impl/main.c>
     [exec] Linking C executable target/usr/local/bin/container-executor
     [exec] /usr/bin/cmake -E cmake_link_script CMakeFiles/container-executor.dir/link.txt
--verbose=1
     [exec] /usr/bin/gcc   -m32 -g -Wall -O2 -D_GNU_SOURCE -D_REENTRANT   CMakeFiles/container-executor.dir/main/native/container-executor/impl/main.c.o
 -o target/usr/local/bin/container-executor -rdynamic libcontainer.a 
     [exec] make[2]: Leaving directory `<https://builds.apache.org/job/Hadoop-Yarn-trunk/ws/trunk/hadoop-yarn-project/hadoop-yarn/hadoop-yarn-server/hadoop-yarn-server-nodemanager/target/native'>
     [exec] /usr/bin/cmake -E cmake_progress_report <https://builds.apache.org/job/Hadoop-Yarn-trunk/ws/trunk/hadoop-yarn-project/hadoop-yarn/hadoop-yarn-server/hadoop-yarn-server-nodemanager/target/native/CMakeFiles>
 3
     [exec] [ 75%] Built target container-executor
     [exec] make -f CMakeFiles/test-container-executor.dir/build.make CMakeFiles/test-container-executor.dir/depend
     [exec] make[2]: Entering directory `<https://builds.apache.org/job/Hadoop-Yarn-trunk/ws/trunk/hadoop-yarn-project/hadoop-yarn/hadoop-yarn-server/hadoop-yarn-server-nodemanager/target/native'>
     [exec] cd <https://builds.apache.org/job/Hadoop-Yarn-trunk/ws/trunk/hadoop-yarn-project/hadoop-yarn/hadoop-yarn-server/hadoop-yarn-server-nodemanager/target/native>
&& /usr/bin/cmake -E cmake_depends "Unix Makefiles" <https://builds.apache.org/job/Hadoop-Yarn-trunk/ws/trunk/hadoop-yarn-project/hadoop-yarn/hadoop-yarn-server/hadoop-yarn-server-nodemanager/src>
<https://builds.apache.org/job/Hadoop-Yarn-trunk/ws/trunk/hadoop-yarn-project/hadoop-yarn/hadoop-yarn-server/hadoop-yarn-server-nodemanager/src>
<https://builds.apache.org/job/Hadoop-Yarn-trunk/ws/trunk/hadoop-yarn-project/hadoop-yarn/hadoop-yarn-server/hadoop-yarn-server-nodemanager/target/native>
<https://builds.apache.org/job/Hadoop-Yarn-trunk/ws/trunk/hadoop-yarn-project/hadoop-yarn/hadoop-yarn-server/hadoop-yarn-server-nodemanager/target/native>
<https://builds.apache.org/job/Hadoop-Yarn-trunk/ws/trunk/hadoop-yarn-project/hadoop-yarn/hadoop-yarn-server/hadoop-yarn-server-nodemanager/target/native/CMakeFiles/test-container-executor.dir/DependInfo.cmake>
--color=
     [exec] Dependee "<https://builds.apache.org/job/Hadoop-Yarn-trunk/ws/trunk/hadoop-yarn-project/hadoop-yarn/hadoop-yarn-server/hadoop-yarn-server-nodemanager/target/native/CMakeFiles/test-container-executor.dir/DependInfo.cmake">
is newer than depender "<https://builds.apache.org/job/Hadoop-Yarn-trunk/ws/trunk/hadoop-yarn-project/hadoop-yarn/hadoop-yarn-server/hadoop-yarn-server-nodemanager/target/native/CMakeFiles/test-container-executor.dir/depend.internal".>
     [exec] Dependee "<https://builds.apache.org/job/Hadoop-Yarn-trunk/ws/trunk/hadoop-yarn-project/hadoop-yarn/hadoop-yarn-server/hadoop-yarn-server-nodemanager/target/native/CMakeFiles/CMakeDirectoryInformation.cmake">
is newer than depender "<https://builds.apache.org/job/Hadoop-Yarn-trunk/ws/trunk/hadoop-yarn-project/hadoop-yarn/hadoop-yarn-server/hadoop-yarn-server-nodemanager/target/native/CMakeFiles/test-container-executor.dir/depend.internal".>
     [exec] Scanning dependencies of target test-container-executor
     [exec] make[2]: Leaving directory `<https://builds.apache.org/job/Hadoop-Yarn-trunk/ws/trunk/hadoop-yarn-project/hadoop-yarn/hadoop-yarn-server/hadoop-yarn-server-nodemanager/target/native'>
     [exec] make -f CMakeFiles/test-container-executor.dir/build.make CMakeFiles/test-container-executor.dir/build
     [exec] make[2]: Entering directory `<https://builds.apache.org/job/Hadoop-Yarn-trunk/ws/trunk/hadoop-yarn-project/hadoop-yarn/hadoop-yarn-server/hadoop-yarn-server-nodemanager/target/native'>
     [exec] /usr/bin/cmake -E cmake_progress_report <https://builds.apache.org/job/Hadoop-Yarn-trunk/ws/trunk/hadoop-yarn-project/hadoop-yarn/hadoop-yarn-server/hadoop-yarn-server-nodemanager/target/native/CMakeFiles>
4
     [exec] [100%] Building C object CMakeFiles/test-container-executor.dir/main/native/container-executor/test/test-container-executor.c.o
     [exec] /usr/bin/gcc   -m32 -g -Wall -O2 -D_GNU_SOURCE -D_REENTRANT -I<https://builds.apache.org/job/Hadoop-Yarn-trunk/ws/trunk/hadoop-yarn-project/hadoop-yarn/hadoop-yarn-server/hadoop-yarn-server-nodemanager/src>
-I<https://builds.apache.org/job/Hadoop-Yarn-trunk/ws/trunk/hadoop-yarn-project/hadoop-yarn/hadoop-yarn-server/hadoop-yarn-server-nodemanager/target/native>
-I<https://builds.apache.org/job/Hadoop-Yarn-trunk/ws/trunk/hadoop-yarn-project/hadoop-yarn/hadoop-yarn-server/hadoop-yarn-server-nodemanager/src/main/native/container-executor>
-I<https://builds.apache.org/job/Hadoop-Yarn-trunk/ws/trunk/hadoop-yarn-project/hadoop-yarn/hadoop-yarn-server/hadoop-yarn-server-nodemanager/src/main/native/container-executor/impl>
  -o CMakeFiles/test-container-executor.dir/main/native/container-executor/test/test-container-executor.c.o
  -c <https://builds.apache.org/job/Hadoop-Yarn-trunk/ws/trunk/hadoop-yarn-project/hadoop-yarn/hadoop-yarn-server/hadoop-yarn-server-nodemanager/src/main/native/container-executor/test/test-container-executor.c>
     [exec] Linking C executable target/usr/local/bin/test-container-executor
     [exec] /usr/bin/cmake -E cmake_link_script CMakeFiles/test-container-executor.dir/link.txt
--verbose=1
     [exec] /usr/bin/gcc   -m32 -g -Wall -O2 -D_GNU_SOURCE -D_REENTRANT   CMakeFiles/test-container-executor.dir/main/native/container-executor/test/test-container-executor.c.o
 -o target/usr/local/bin/test-container-executor -rdynamic libcontainer.a 
     [exec] make[2]: Leaving directory `<https://builds.apache.org/job/Hadoop-Yarn-trunk/ws/trunk/hadoop-yarn-project/hadoop-yarn/hadoop-yarn-server/hadoop-yarn-server-nodemanager/target/native'>
     [exec] /usr/bin/cmake -E cmake_progress_report <https://builds.apache.org/job/Hadoop-Yarn-trunk/ws/trunk/hadoop-yarn-project/hadoop-yarn/hadoop-yarn-server/hadoop-yarn-server-nodemanager/target/native/CMakeFiles>
 4
     [exec] [100%] Built target test-container-executor
     [exec] make[1]: Leaving directory `<https://builds.apache.org/job/Hadoop-Yarn-trunk/ws/trunk/hadoop-yarn-project/hadoop-yarn/hadoop-yarn-server/hadoop-yarn-server-nodemanager/target/native'>
     [exec] /usr/bin/cmake -E cmake_progress_start <https://builds.apache.org/job/Hadoop-Yarn-trunk/ws/trunk/hadoop-yarn-project/hadoop-yarn/hadoop-yarn-server/hadoop-yarn-server-nodemanager/target/native/CMakeFiles>
0
[INFO] Executed tasks
[INFO] 
[INFO] --- maven-resources-plugin:2.2:testResources (default-testResources) @ hadoop-yarn-server-nodemanager
---
[INFO] Using default encoding to copy filtered resources.
[INFO] 
[INFO] --- maven-compiler-plugin:2.5.1:testCompile (default-testCompile) @ hadoop-yarn-server-nodemanager
---
[INFO] Compiling 48 source files to <https://builds.apache.org/job/Hadoop-Yarn-trunk/ws/trunk/hadoop-yarn-project/hadoop-yarn/hadoop-yarn-server/hadoop-yarn-server-nodemanager/target/test-classes>
[INFO] 
[INFO] --- maven-surefire-plugin:2.12.3:test (default-test) @ hadoop-yarn-server-nodemanager
---
[INFO] Surefire report directory: <https://builds.apache.org/job/Hadoop-Yarn-trunk/ws/trunk/hadoop-yarn-project/hadoop-yarn/hadoop-yarn-server/hadoop-yarn-server-nodemanager/target/surefire-reports>

-------------------------------------------------------
 T E S T S
-------------------------------------------------------

-------------------------------------------------------
 T E S T S
-------------------------------------------------------
Running org.apache.hadoop.yarn.server.nodemanager.TestNodeHealthService
Tests run: 2, Failures: 0, Errors: 0, Skipped: 0, Time elapsed: 4.605 sec
Running org.apache.hadoop.yarn.server.nodemanager.TestNMAuditLogger
Tests run: 3, Failures: 0, Errors: 0, Skipped: 0, Time elapsed: 0.698 sec
Running org.apache.hadoop.yarn.server.nodemanager.TestDirectoryCollection
Tests run: 2, Failures: 0, Errors: 0, Skipped: 0, Time elapsed: 0.403 sec
Running org.apache.hadoop.yarn.server.nodemanager.TestDefaultContainerExecutor
Tests run: 1, Failures: 0, Errors: 0, Skipped: 0, Time elapsed: 0.555 sec
Running org.apache.hadoop.yarn.server.nodemanager.TestNodeStatusUpdater
Running org.apache.hadoop.yarn.server.nodemanager.TestRecordFactory
Tests run: 1, Failures: 0, Errors: 0, Skipped: 0, Time elapsed: 0.161 sec
Running org.apache.hadoop.yarn.server.nodemanager.TestContainerManagerWithLCE
Tests run: 6, Failures: 0, Errors: 0, Skipped: 0, Time elapsed: 0.954 sec
Running org.apache.hadoop.yarn.server.nodemanager.TestEventFlow
Tests run: 1, Failures: 0, Errors: 0, Skipped: 0, Time elapsed: 1.235 sec
Running org.apache.hadoop.yarn.server.nodemanager.containermanager.monitor.TestContainersMonitor
Tests run: 2, Failures: 0, Errors: 0, Skipped: 0, Time elapsed: 4.243 sec
Running org.apache.hadoop.yarn.server.nodemanager.containermanager.container.TestContainer
Tests run: 12, Failures: 0, Errors: 0, Skipped: 0, Time elapsed: 1.062 sec
Running org.apache.hadoop.yarn.server.nodemanager.containermanager.loghandler.TestNonAggregatingLogHandler
Tests run: 3, Failures: 0, Errors: 0, Skipped: 0, Time elapsed: 0.779 sec
Running org.apache.hadoop.yarn.server.nodemanager.containermanager.TestAuxServices
Tests run: 4, Failures: 0, Errors: 0, Skipped: 0, Time elapsed: 0.361 sec
Running org.apache.hadoop.yarn.server.nodemanager.containermanager.launcher.TestContainerLaunch
Tests run: 3, Failures: 0, Errors: 0, Skipped: 0, Time elapsed: 6.355 sec
Running org.apache.hadoop.yarn.server.nodemanager.containermanager.localizer.TestContainerLocalizer
Tests run: 2, Failures: 0, Errors: 0, Skipped: 0, Time elapsed: 1.126 sec
Running org.apache.hadoop.yarn.server.nodemanager.containermanager.localizer.TestLocalResource
Tests run: 2, Failures: 0, Errors: 0, Skipped: 0, Time elapsed: 0.245 sec
Running org.apache.hadoop.yarn.server.nodemanager.containermanager.localizer.TestLocalizedResource
Tests run: 2, Failures: 0, Errors: 0, Skipped: 0, Time elapsed: 0.499 sec
Running org.apache.hadoop.yarn.server.nodemanager.containermanager.localizer.TestLocalResourcesTrackerImpl
Tests run: 2, Failures: 0, Errors: 0, Skipped: 0, Time elapsed: 0.511 sec
Running org.apache.hadoop.yarn.server.nodemanager.containermanager.localizer.TestResourceLocalizationService
Tests run: 3, Failures: 0, Errors: 0, Skipped: 0, Time elapsed: 2.236 sec
Running org.apache.hadoop.yarn.server.nodemanager.containermanager.localizer.TestResourceRetention
Tests run: 1, Failures: 0, Errors: 0, Skipped: 0, Time elapsed: 0.365 sec
Running org.apache.hadoop.yarn.server.nodemanager.containermanager.logaggregation.TestLogAggregationService
Tests run: 8, Failures: 0, Errors: 0, Skipped: 0, Time elapsed: 8.603 sec
Running org.apache.hadoop.yarn.server.nodemanager.containermanager.application.TestApplication
Tests run: 5, Failures: 0, Errors: 0, Skipped: 0, Time elapsed: 0.803 sec
Running org.apache.hadoop.yarn.server.nodemanager.containermanager.TestContainerManager
Tests run: 6, Failures: 0, Errors: 0, Skipped: 0, Time elapsed: 18.885 sec
Running org.apache.hadoop.yarn.server.nodemanager.TestLocalDirsHandlerService
Tests run: 2, Failures: 0, Errors: 0, Skipped: 0, Time elapsed: 0.486 sec
Running org.apache.hadoop.yarn.server.nodemanager.TestRPCFactories
Tests run: 1, Failures: 0, Errors: 0, Skipped: 0, Time elapsed: 0.449 sec
Running org.apache.hadoop.yarn.server.nodemanager.TestLinuxContainerExecutorWithMocks
Tests run: 3, Failures: 0, Errors: 0, Skipped: 0, Time elapsed: 0.61 sec
Running org.apache.hadoop.yarn.server.nodemanager.api.protocolrecords.impl.pb.TestPBRecordImpl
Tests run: 3, Failures: 0, Errors: 0, Skipped: 0, Time elapsed: 0.33 sec
Running org.apache.hadoop.yarn.server.nodemanager.api.protocolrecords.impl.pb.TestPBLocalizerRPC
Tests run: 1, Failures: 0, Errors: 0, Skipped: 0, Time elapsed: 0.799 sec
Running org.apache.hadoop.yarn.server.nodemanager.util.TestProcessIdFileReader
Tests run: 3, Failures: 0, Errors: 0, Skipped: 0, Time elapsed: 0.135 sec
Running org.apache.hadoop.yarn.server.nodemanager.TestLinuxContainerExecutor
Tests run: 2, Failures: 0, Errors: 0, Skipped: 0, Time elapsed: 0.476 sec
Running org.apache.hadoop.yarn.server.nodemanager.TestNodeManager
Tests run: 1, Failures: 0, Errors: 0, Skipped: 0, Time elapsed: 0.531 sec
Running org.apache.hadoop.yarn.server.nodemanager.TestDeletionService
Tests run: 4, Failures: 0, Errors: 0, Skipped: 0, Time elapsed: 21.278 sec
Running org.apache.hadoop.yarn.server.nodemanager.metrics.TestNodeManagerMetrics
Tests run: 1, Failures: 0, Errors: 0, Skipped: 0, Time elapsed: 0.459 sec
Running org.apache.hadoop.yarn.server.nodemanager.webapp.TestNMWebServicesApps
Tests run: 19, Failures: 0, Errors: 0, Skipped: 0, Time elapsed: 7.597 sec
Running org.apache.hadoop.yarn.server.nodemanager.webapp.TestContainerLogsPage
Tests run: 1, Failures: 0, Errors: 0, Skipped: 0, Time elapsed: 0.577 sec
Running org.apache.hadoop.yarn.server.nodemanager.webapp.TestNMWebServicesContainers
Tests run: 12, Failures: 0, Errors: 0, Skipped: 0, Time elapsed: 5.787 sec
Running org.apache.hadoop.yarn.server.nodemanager.webapp.TestNMWebServices
Tests run: 10, Failures: 0, Errors: 0, Skipped: 0, Time elapsed: 5.122 sec
Running org.apache.hadoop.yarn.server.nodemanager.webapp.TestNMWebServer
Tests run: 3, Failures: 0, Errors: 0, Skipped: 0, Time elapsed: 2.819 sec

Results :

Tests run: 137, Failures: 0, Errors: 0, Skipped: 0

[INFO] ------------------------------------------------------------------------
[INFO] Reactor Summary:
[INFO] 
[INFO] hadoop-yarn ....................................... SUCCESS [2.993s]
[INFO] hadoop-yarn-api ................................... SUCCESS [1:39.322s]
[INFO] hadoop-yarn-common ................................ SUCCESS [1:45.543s]
[INFO] hadoop-yarn-server ................................ SUCCESS [0.110s]
[INFO] hadoop-yarn-server-common ......................... SUCCESS [22.666s]
[INFO] hadoop-yarn-server-nodemanager .................... FAILURE [2:03.870s]
[INFO] hadoop-yarn-server-web-proxy ...................... SKIPPED
[INFO] hadoop-yarn-server-resourcemanager ................ SKIPPED
[INFO] hadoop-yarn-server-tests .......................... SKIPPED
[INFO] hadoop-yarn-client ................................ SKIPPED
[INFO] hadoop-yarn-applications .......................... SKIPPED
[INFO] hadoop-yarn-applications-distributedshell ......... SKIPPED
[INFO] hadoop-yarn-applications-unmanaged-am-launcher .... SKIPPED
[INFO] hadoop-yarn-site .................................. SKIPPED
[INFO] hadoop-yarn-project ............................... SKIPPED
[INFO] ------------------------------------------------------------------------
[INFO] BUILD FAILURE
[INFO] ------------------------------------------------------------------------
[INFO] Total time: 5:55.763s
[INFO] Finished at: Sun Oct 21 10:39:49 UTC 2012
[INFO] Final Memory: 46M/776M
[INFO] ------------------------------------------------------------------------
[ERROR] Failed to execute goal org.apache.maven.plugins:maven-surefire-plugin:2.12.3:test
(default-test) on project hadoop-yarn-server-nodemanager: ExecutionException; nested exception
is java.util.concurrent.ExecutionException: java.lang.RuntimeException: The forked VM terminated
without saying properly goodbye. VM crash or System.exit called ? -> [Help 1]
[ERROR] 
[ERROR] To see the full stack trace of the errors, re-run Maven with the -e switch.
[ERROR] Re-run Maven using the -X switch to enable full debug logging.
[ERROR] 
[ERROR] For more information about the errors and possible solutions, please read the following
articles:
[ERROR] [Help 1] http://cwiki.apache.org/confluence/display/MAVEN/MojoExecutionException
[ERROR] 
[ERROR] After correcting the problems, you can resume the build with the command
[ERROR]   mvn <goals> -rf :hadoop-yarn-server-nodemanager
Build step 'Execute shell' marked build as failure
Archiving artifacts
Updating HDFS-4022
Updating HADOOP-8932
Updating HADOOP-8923

Mime
View raw message