hadoop-yarn-dev mailing list archives

Site index · List index
Message view « Date » · « Thread »
Top « Date » · « Thread »
From Apache Jenkins Server <jenk...@builds.apache.org>
Subject Hadoop-Yarn-trunk - Build # 12 - Still Failing
Date Tue, 23 Oct 2012 10:46:04 GMT
See https://builds.apache.org/job/Hadoop-Yarn-trunk/12/

###################################################################################
########################## LAST 60 LINES OF THE CONSOLE ###########################
[...truncated 14423 lines...]
Tests run: 8, Failures: 0, Errors: 0, Skipped: 0, Time elapsed: 0.947 sec

Results :

Tests in error: 
  testClientStop(org.apache.hadoop.yarn.client.TestYarnClient): Can only configure with YarnConfiguration
  org.apache.hadoop.yarn.client.TestGetGroups: Queue configuration missing child queue names
for root
  org.apache.hadoop.yarn.client.TestGetGroups

Tests run: 12, Failures: 0, Errors: 3, Skipped: 0

[INFO] ------------------------------------------------------------------------
[INFO] Reactor Summary:
[INFO] 
[INFO] hadoop-yarn ....................................... SUCCESS [3.008s]
[INFO] hadoop-yarn-api ................................... SUCCESS [1:42.690s]
[INFO] hadoop-yarn-common ................................ SUCCESS [1:46.745s]
[INFO] hadoop-yarn-server ................................ SUCCESS [0.180s]
[INFO] hadoop-yarn-server-common ......................... SUCCESS [23.781s]
[INFO] hadoop-yarn-server-nodemanager .................... SUCCESS [2:55.923s]
[INFO] hadoop-yarn-server-web-proxy ...................... SUCCESS [15.925s]
[INFO] hadoop-yarn-server-resourcemanager ................ SUCCESS [4:11.718s]
[INFO] hadoop-yarn-server-tests .......................... SUCCESS [43.245s]
[INFO] hadoop-yarn-client ................................ FAILURE [2.981s]
[INFO] hadoop-yarn-applications .......................... SKIPPED
[INFO] hadoop-yarn-applications-distributedshell ......... SKIPPED
[INFO] hadoop-yarn-applications-unmanaged-am-launcher .... SKIPPED
[INFO] hadoop-yarn-site .................................. SKIPPED
[INFO] hadoop-yarn-project ............................... SKIPPED
[INFO] ------------------------------------------------------------------------
[INFO] BUILD FAILURE
[INFO] ------------------------------------------------------------------------
[INFO] Total time: 12:07.453s
[INFO] Finished at: Tue Oct 23 10:46:01 UTC 2012
[INFO] Final Memory: 50M/776M
[INFO] ------------------------------------------------------------------------
[ERROR] Failed to execute goal org.apache.maven.plugins:maven-surefire-plugin:2.12.3:test
(default-test) on project hadoop-yarn-client: There are test failures.
[ERROR] 
[ERROR] Please refer to /home/jenkins/jenkins-slave/workspace/Hadoop-Yarn-trunk/trunk/hadoop-yarn-project/hadoop-yarn/hadoop-yarn-client/target/surefire-reports
for the individual test results.
[ERROR] -> [Help 1]
[ERROR] 
[ERROR] To see the full stack trace of the errors, re-run Maven with the -e switch.
[ERROR] Re-run Maven using the -X switch to enable full debug logging.
[ERROR] 
[ERROR] For more information about the errors and possible solutions, please read the following
articles:
[ERROR] [Help 1] http://cwiki.apache.org/confluence/display/MAVEN/MojoFailureException
[ERROR] 
[ERROR] After correcting the problems, you can resume the build with the command
[ERROR]   mvn <goals> -rf :hadoop-yarn-client
Build step 'Execute shell' marked build as failure
Archiving artifacts
Updating HADOOP-8900
Updating HDFS-4099
Updating MAPREDUCE-4740
Updating YARN-174
Updating HADOOP-8951
Sending e-mails to: yarn-dev@hadoop.apache.org
Email was triggered for: Failure
Sending email for trigger: Failure



###################################################################################
############################## FAILED TESTS (if any) ##############################
No tests ran.
Mime
  • Unnamed multipart/mixed (inline, None, 0 bytes)
View raw message