hadoop-yarn-dev mailing list archives

Site index · List index
Message view « Date » · « Thread »
Top « Date » · « Thread »
From Apache Jenkins Server <jenk...@builds.apache.org>
Subject Hadoop-Yarn-trunk - Build # 9 - Still Failing
Date Sat, 20 Oct 2012 10:41:00 GMT
See https://builds.apache.org/job/Hadoop-Yarn-trunk/9/

###################################################################################
########################## LAST 60 LINES OF THE CONSOLE ###########################
[...truncated 12984 lines...]
Running org.apache.hadoop.yarn.server.nodemanager.webapp.TestNMWebServices
Tests run: 10, Failures: 0, Errors: 0, Skipped: 0, Time elapsed: 5.574 sec
Running org.apache.hadoop.yarn.server.nodemanager.webapp.TestContainerLogsPage
Tests run: 1, Failures: 0, Errors: 0, Skipped: 0, Time elapsed: 0.59 sec
Running org.apache.hadoop.yarn.server.nodemanager.webapp.TestNMWebServer
Tests run: 3, Failures: 0, Errors: 0, Skipped: 0, Time elapsed: 2.843 sec

Results :

Tests run: 137, Failures: 0, Errors: 0, Skipped: 0

[INFO] ------------------------------------------------------------------------
[INFO] Reactor Summary:
[INFO] 
[INFO] hadoop-yarn ....................................... SUCCESS [3.433s]
[INFO] hadoop-yarn-api ................................... SUCCESS [1:50.356s]
[INFO] hadoop-yarn-common ................................ SUCCESS [2:01.103s]
[INFO] hadoop-yarn-server ................................ SUCCESS [0.136s]
[INFO] hadoop-yarn-server-common ......................... SUCCESS [25.257s]
[INFO] hadoop-yarn-server-nodemanager .................... FAILURE [2:08.463s]
[INFO] hadoop-yarn-server-web-proxy ...................... SKIPPED
[INFO] hadoop-yarn-server-resourcemanager ................ SKIPPED
[INFO] hadoop-yarn-server-tests .......................... SKIPPED
[INFO] hadoop-yarn-client ................................ SKIPPED
[INFO] hadoop-yarn-applications .......................... SKIPPED
[INFO] hadoop-yarn-applications-distributedshell ......... SKIPPED
[INFO] hadoop-yarn-applications-unmanaged-am-launcher .... SKIPPED
[INFO] hadoop-yarn-site .................................. SKIPPED
[INFO] hadoop-yarn-project ............................... SKIPPED
[INFO] ------------------------------------------------------------------------
[INFO] BUILD FAILURE
[INFO] ------------------------------------------------------------------------
[INFO] Total time: 6:30.107s
[INFO] Finished at: Sat Oct 20 10:40:56 UTC 2012
[INFO] Final Memory: 46M/787M
[INFO] ------------------------------------------------------------------------
[ERROR] Failed to execute goal org.apache.maven.plugins:maven-surefire-plugin:2.12.3:test
(default-test) on project hadoop-yarn-server-nodemanager: ExecutionException; nested exception
is java.util.concurrent.ExecutionException: java.lang.RuntimeException: The forked VM terminated
without saying properly goodbye. VM crash or System.exit called ? -> [Help 1]
[ERROR] 
[ERROR] To see the full stack trace of the errors, re-run Maven with the -e switch.
[ERROR] Re-run Maven using the -X switch to enable full debug logging.
[ERROR] 
[ERROR] For more information about the errors and possible solutions, please read the following
articles:
[ERROR] [Help 1] http://cwiki.apache.org/confluence/display/MAVEN/MojoExecutionException
[ERROR] 
[ERROR] After correcting the problems, you can resume the build with the command
[ERROR]   mvn <goals> -rf :hadoop-yarn-server-nodemanager
Build step 'Execute shell' marked build as failure
Archiving artifacts
Updating HDFS-4088
Updating YARN-136
Updating YARN-163
Updating MAPREDUCE-4736
Updating MAPREDUCE-4733
Updating MAPREDUCE-4479
Updating YARN-140
Updating HADOOP-8948
Sending e-mails to: yarn-dev@hadoop.apache.org
Email was triggered for: Failure
Sending email for trigger: Failure



###################################################################################
############################## FAILED TESTS (if any) ##############################
No tests ran.
Mime
  • Unnamed multipart/mixed (inline, None, 0 bytes)
View raw message