hadoop-pig-dev mailing list archives

Site index · List index
Message view « Date » · « Thread »
Top « Date » · « Thread »
From Apache Hudson Server <hud...@hudson.zones.apache.org>
Subject Build failed in Hudson: Pig-trunk #436
Date Sun, 17 May 2009 07:22:06 GMT
See http://hudson.zones.apache.org/hudson/job/Pig-trunk/436/

------------------------------------------
[...truncated 1896 lines...]
ivy-init:
:: loading settings :: file = http://hudson.zones.apache.org/hudson/job/Pig-trunk/ws/trunk/ivy/ivysettings.xml


ivy-buildJar:
[ivy:resolve] :: resolving dependencies :: org.apache.pig#Pig;2009-05-17_05-37-33
[ivy:resolve] 	confs: [buildJar]
[ivy:resolve] 	found com.jcraft#jsch;0.1.38 in maven2
[ivy:resolve] 	found jline#jline;0.9.94 in maven2
[ivy:resolve] 	found net.java.dev.javacc#javacc;4.2 in maven2
[ivy:resolve] 	found junit#junit;4.5 in maven2
[ivy:resolve] :: resolution report :: resolve 43ms :: artifacts dl 2ms
	---------------------------------------------------------------------
	|                  |            modules            ||   artifacts   |
	|       conf       | number| search|dwnlded|evicted|| number|dwnlded|
	---------------------------------------------------------------------
	|     buildJar     |   4   |   0   |   0   |   0   ||   4   |   0   |
	---------------------------------------------------------------------
[ivy:retrieve] :: retrieving :: org.apache.pig#Pig
[ivy:retrieve] 	confs: [buildJar]
[ivy:retrieve] 	0 artifacts copied, 4 already retrieved (0kB/3ms)
No ivy:settings found for the default reference 'ivy.instance'.  A default instance will be
used
DEPRECATED: 'ivy.conf.file' is deprecated, use 'ivy.settings.file' instead
:: loading settings :: file = http://hudson.zones.apache.org/hudson/job/Pig-trunk/ws/trunk/ivy/ivysettings.xml


buildJar:
     [echo] svnString 775580

jarWithOutSvn:

test-core:
    [mkdir] Created dir: http://hudson.zones.apache.org/hudson/job/Pig-trunk/ws/trunk/build/test/logs

    [junit] Running org.apache.pig.test.TestAdd
    [junit] Tests run: 1, Failures: 0, Errors: 0, Time elapsed: 0.077 sec
    [junit] Running org.apache.pig.test.TestAlgebraicEval
    [junit] Tests run: 6, Failures: 0, Errors: 0, Time elapsed: 237.522 sec
    [junit] Running org.apache.pig.test.TestAlgebraicEvalLocal
    [junit] Tests run: 6, Failures: 0, Errors: 0, Time elapsed: 11.011 sec
    [junit] Running org.apache.pig.test.TestBZip
    [junit] Tests run: 3, Failures: 0, Errors: 0, Time elapsed: 26.826 sec
    [junit] Running org.apache.pig.test.TestBestFitCast
    [junit] Tests run: 26, Failures: 0, Errors: 0, Time elapsed: 161.942 sec
    [junit] Running org.apache.pig.test.TestBinaryStorage
    [junit] Tests run: 2, Failures: 0, Errors: 0, Time elapsed: 0.492 sec
    [junit] Running org.apache.pig.test.TestBoolean
    [junit] Tests run: 13, Failures: 0, Errors: 0, Time elapsed: 0.111 sec
    [junit] Running org.apache.pig.test.TestBuiltin
    [junit] Tests run: 28, Failures: 0, Errors: 0, Time elapsed: 0.426 sec
    [junit] Running org.apache.pig.test.TestCmdLineParser
    [junit] Tests run: 17, Failures: 0, Errors: 0, Time elapsed: 0.057 sec
    [junit] Running org.apache.pig.test.TestCombiner
    [junit] Tests run: 7, Failures: 0, Errors: 0, Time elapsed: 74.829 sec
    [junit] Running org.apache.pig.test.TestCompressedFiles
    [junit] Tests run: 1, Failures: 0, Errors: 0, Time elapsed: 22.205 sec
    [junit] Running org.apache.pig.test.TestConstExpr
    [junit] Tests run: 10, Failures: 0, Errors: 0, Time elapsed: 0.057 sec
    [junit] Running org.apache.pig.test.TestConversions
    [junit] Tests run: 16, Failures: 0, Errors: 0, Time elapsed: 0.183 sec
    [junit] Running org.apache.pig.test.TestCounters
    [junit] Tests run: 8, Failures: 0, Errors: 0, Time elapsed: 139.227 sec
    [junit] Running org.apache.pig.test.TestCustomSlicer
    [junit] Tests run: 1, Failures: 0, Errors: 1, Time elapsed: 145.968 sec
    [junit] Test org.apache.pig.test.TestCustomSlicer FAILED
    [junit] Running org.apache.pig.test.TestDataBag
    [junit] Tests run: 24, Failures: 0, Errors: 0, Time elapsed: 0.512 sec
    [junit] Running org.apache.pig.test.TestDataBagAccess
    [junit] Tests run: 7, Failures: 0, Errors: 0, Time elapsed: 108.268 sec
    [junit] Running org.apache.pig.test.TestDataModel
    [junit] Tests run: 20, Failures: 0, Errors: 0, Time elapsed: 0.13 sec
    [junit] Running org.apache.pig.test.TestDeleteOnFail
    [junit] Tests run: 5, Failures: 0, Errors: 0, Time elapsed: 0.069 sec
    [junit] Running org.apache.pig.test.TestDivide
    [junit] Tests run: 1, Failures: 0, Errors: 0, Time elapsed: 0.052 sec
    [junit] Running org.apache.pig.test.TestEqualTo
    [junit] Tests run: 18, Failures: 0, Errors: 0, Time elapsed: 0.131 sec
    [junit] Running org.apache.pig.test.TestEvalPipeline
    [junit] Tests run: 26, Failures: 0, Errors: 0, Time elapsed: 429.062 sec
    [junit] Running org.apache.pig.test.TestEvalPipeline2
    [junit] Tests run: 5, Failures: 0, Errors: 0, Time elapsed: 45.691 sec
    [junit] Running org.apache.pig.test.TestEvalPipelineLocal
    [junit] Tests run: 23, Failures: 0, Errors: 0, Time elapsed: 3.303 sec
    [junit] Running org.apache.pig.test.TestExampleGenerator
    [junit] Tests run: 7, Failures: 0, Errors: 0, Time elapsed: 1.322 sec
    [junit] Running org.apache.pig.test.TestFRJoin
    [junit] Tests run: 14, Failures: 0, Errors: 0, Time elapsed: 270.959 sec
    [junit] Running org.apache.pig.test.TestFilter
    [junit] Tests run: 3, Failures: 0, Errors: 0, Time elapsed: 0.145 sec
    [junit] Running org.apache.pig.test.TestFilterOpNumeric
    [junit] Tests run: 8, Failures: 0, Errors: 0, Time elapsed: 53.96 sec
    [junit] Running org.apache.pig.test.TestFilterOpString
    [junit] Tests run: 6, Failures: 0, Errors: 0, Time elapsed: 40.818 sec
    [junit] Running org.apache.pig.test.TestFilterUDF
    [junit] Tests run: 2, Failures: 0, Errors: 0, Time elapsed: 13.867 sec
    [junit] Running org.apache.pig.test.TestFinish
    [junit] Tests run: 4, Failures: 0, Errors: 0, Time elapsed: 13.96 sec
    [junit] Running org.apache.pig.test.TestForEach
    [junit] Tests run: 1, Failures: 0, Errors: 0, Time elapsed: 0.14 sec
    [junit] Running org.apache.pig.test.TestForEachNestedPlan
    [junit] Tests run: 1, Failures: 0, Errors: 0, Time elapsed: 13.437 sec
    [junit] Running org.apache.pig.test.TestForEachNestedPlanLocal
    [junit] Tests run: 2, Failures: 0, Errors: 0, Time elapsed: 0.412 sec
    [junit] Running org.apache.pig.test.TestFuncSpec
    [junit] Tests run: 4, Failures: 0, Errors: 0, Time elapsed: 0.116 sec
    [junit] Running org.apache.pig.test.TestGTOrEqual
    [junit] Tests run: 24, Failures: 0, Errors: 0, Time elapsed: 0.127 sec
    [junit] Running org.apache.pig.test.TestGreaterThan
    [junit] Tests run: 24, Failures: 0, Errors: 0, Time elapsed: 0.127 sec
    [junit] Running org.apache.pig.test.TestGrunt
    [junit] Tests run: 33, Failures: 0, Errors: 0, Time elapsed: 195.197 sec
    [junit] Running org.apache.pig.test.TestHBaseStorage
    [junit] Tests run: 2, Failures: 0, Errors: 0, Time elapsed: 107.817 sec
    [junit] Running org.apache.pig.test.TestImplicitSplit
    [junit] Tests run: 3, Failures: 0, Errors: 0, Time elapsed: 0.695 sec
    [junit] Running org.apache.pig.test.TestInfixArithmetic
    [junit] Tests run: 4, Failures: 0, Errors: 0, Time elapsed: 53.699 sec
    [junit] Running org.apache.pig.test.TestInputOutputFileValidator
    [junit] Tests run: 4, Failures: 0, Errors: 0, Time elapsed: 0.289 sec
    [junit] Running org.apache.pig.test.TestInstantiateFunc
    [junit] Tests run: 5, Failures: 0, Errors: 0, Time elapsed: 0.055 sec
    [junit] Running org.apache.pig.test.TestJobSubmission
    [junit] Tests run: 1, Failures: 0, Errors: 0, Time elapsed: 1.278 sec
    [junit] Running org.apache.pig.test.TestKeyTypeDiscoveryVisitor
    [junit] Tests run: 1, Failures: 0, Errors: 0, Time elapsed: 35.288 sec
    [junit] Running org.apache.pig.test.TestLTOrEqual
    [junit] Tests run: 24, Failures: 0, Errors: 0, Time elapsed: 0.125 sec
    [junit] Running org.apache.pig.test.TestLessThan
    [junit] Tests run: 24, Failures: 0, Errors: 0, Time elapsed: 0.125 sec
    [junit] Running org.apache.pig.test.TestLoad
    [junit] Tests run: 9, Failures: 0, Errors: 0, Time elapsed: 0.583 sec
    [junit] Running org.apache.pig.test.TestLocal
    [junit] Tests run: 10, Failures: 0, Errors: 0, Time elapsed: 1.152 sec
    [junit] Running org.apache.pig.test.TestLocal2
    [junit] Tests run: 6, Failures: 0, Errors: 0, Time elapsed: 0.507 sec
    [junit] Running org.apache.pig.test.TestLocalJobSubmission
    [junit] Tests run: 1, Failures: 0, Errors: 0, Time elapsed: 6.826 sec
    [junit] Running org.apache.pig.test.TestLocalPOSplit
    [junit] Tests run: 1, Failures: 0, Errors: 0, Time elapsed: 0.31 sec
    [junit] Running org.apache.pig.test.TestLocalRearrange
    [junit] Tests run: 2, Failures: 0, Errors: 0, Time elapsed: 0.129 sec
    [junit] Running org.apache.pig.test.TestLogToPhyCompiler
    [junit] Tests run: 16, Failures: 0, Errors: 0, Time elapsed: 0.631 sec
    [junit] Running org.apache.pig.test.TestLogicalOptimizer
    [junit] Tests run: 14, Failures: 0, Errors: 0, Time elapsed: 1.185 sec
    [junit] Running org.apache.pig.test.TestLogicalPlanBuilder
    [junit] Tests run: 137, Failures: 0, Errors: 0, Time elapsed: 1.991 sec
    [junit] Running org.apache.pig.test.TestMRCompiler
    [junit] Tests run: 20, Failures: 0, Errors: 0, Time elapsed: 0.4 sec
    [junit] Running org.apache.pig.test.TestMapReduce
    [junit] Tests run: 12, Failures: 0, Errors: 0, Time elapsed: 301.483 sec
    [junit] Running org.apache.pig.test.TestMapReduce2
    [junit] Tests run: 4, Failures: 0, Errors: 0, Time elapsed: 26.467 sec
    [junit] Running org.apache.pig.test.TestMod
    [junit] Tests run: 1, Failures: 0, Errors: 0, Time elapsed: 0.05 sec
    [junit] Running org.apache.pig.test.TestMultiQuery
    [junit] Running org.apache.pig.test.TestMultiQuery
    [junit] Tests run: 1, Failures: 0, Errors: 1, Time elapsed: 0 sec
    [junit] Test org.apache.pig.test.TestMultiQuery FAILED (timeout)
    [junit] Running org.apache.pig.test.TestMultiQueryLocal
    [junit] Tests run: 15, Failures: 0, Errors: 0, Time elapsed: 1.233 sec
    [junit] Running org.apache.pig.test.TestMultiply
    [junit] Tests run: 1, Failures: 0, Errors: 0, Time elapsed: 0.051 sec
    [junit] Running org.apache.pig.test.TestNotEqualTo
    [junit] Tests run: 18, Failures: 0, Errors: 0, Time elapsed: 0.121 sec
    [junit] Running org.apache.pig.test.TestNull
    [junit] Tests run: 1, Failures: 0, Errors: 0, Time elapsed: 0.14 sec
    [junit] Running org.apache.pig.test.TestNullConstant
    [junit] Tests run: 8, Failures: 0, Errors: 0, Time elapsed: 64.118 sec
    [junit] Running org.apache.pig.test.TestOperatorPlan
    [junit] Tests run: 43, Failures: 0, Errors: 0, Time elapsed: 0.502 sec
    [junit] Running org.apache.pig.test.TestPOBinCond
    [junit] Tests run: 7, Failures: 0, Errors: 0, Time elapsed: 0.071 sec
    [junit] Running org.apache.pig.test.TestPOCast
    [junit] Tests run: 11, Failures: 0, Errors: 0, Time elapsed: 0.142 sec
    [junit] Running org.apache.pig.test.TestPOCogroup
    [junit] Tests run: 2, Failures: 0, Errors: 0, Time elapsed: 0.123 sec
    [junit] Running org.apache.pig.test.TestPOCross
    [junit] Tests run: 1, Failures: 0, Errors: 0, Time elapsed: 0.113 sec
    [junit] Running org.apache.pig.test.TestPODistinct
    [junit] Tests run: 6, Failures: 0, Errors: 0, Time elapsed: 0.057 sec
    [junit] Running org.apache.pig.test.TestPOGenerate
    [junit] Tests run: 3, Failures: 0, Errors: 0, Time elapsed: 0.059 sec
    [junit] Running org.apache.pig.test.TestPOMapLookUp
    [junit] Tests run: 1, Failures: 0, Errors: 0, Time elapsed: 0.115 sec
    [junit] Running org.apache.pig.test.TestPONegative
    [junit] Tests run: 9, Failures: 0, Errors: 0, Time elapsed: 7.117 sec
    [junit] Running org.apache.pig.test.TestPOSort
    [junit] Tests run: 14, Failures: 0, Errors: 0, Time elapsed: 0.144 sec
    [junit] Running org.apache.pig.test.TestPOUserFunc
    [junit] Tests run: 6, Failures: 0, Errors: 0, Time elapsed: 0.135 sec
    [junit] Running org.apache.pig.test.TestPackage
    [junit] Tests run: 1, Failures: 0, Errors: 0, Time elapsed: 19.395 sec
    [junit] Running org.apache.pig.test.TestParamSubPreproc
    [junit] Tests run: 28, Failures: 0, Errors: 0, Time elapsed: 0.134 sec
    [junit] Running org.apache.pig.test.TestParser
    [junit] Tests run: 1, Failures: 0, Errors: 0, Time elapsed: 51.988 sec
    [junit] Running org.apache.pig.test.TestPhyOp
    [junit] Tests run: 1, Failures: 0, Errors: 0, Time elapsed: 0.133 sec
    [junit] Running org.apache.pig.test.TestPigContext
    [junit] Tests run: 4, Failures: 0, Errors: 0, Time elapsed: 0.52 sec
    [junit] Running org.apache.pig.test.TestPigScriptParser
    [junit] Tests run: 1, Failures: 0, Errors: 0, Time elapsed: 0.282 sec
    [junit] Running org.apache.pig.test.TestPigServer
    [junit] Tests run: 17, Failures: 0, Errors: 0, Time elapsed: 1.152 sec
    [junit] Running org.apache.pig.test.TestPigSplit
    [junit] Tests run: 2, Failures: 0, Errors: 0, Time elapsed: 0.511 sec
    [junit] Running org.apache.pig.test.TestProject
    [junit] Tests run: 8, Failures: 0, Errors: 0, Time elapsed: 0.134 sec
    [junit] Running org.apache.pig.test.TestRegexp
    [junit] Tests run: 2, Failures: 0, Errors: 0, Time elapsed: 0.098 sec
    [junit] Running org.apache.pig.test.TestRelationToExprProject
    [junit] Tests run: 5, Failures: 0, Errors: 1, Time elapsed: 395.551 sec
    [junit] Test org.apache.pig.test.TestRelationToExprProject FAILED
    [junit] Running org.apache.pig.test.TestSample
    [junit] Tests run: 3, Failures: 0, Errors: 0, Time elapsed: 0.699 sec
    [junit] Running org.apache.pig.test.TestSchema
    [junit] Tests run: 12, Failures: 0, Errors: 0, Time elapsed: 0.112 sec
    [junit] Running org.apache.pig.test.TestSchemaParser
    [junit] Tests run: 4, Failures: 0, Errors: 0, Time elapsed: 0.159 sec
    [junit] Running org.apache.pig.test.TestSchemaUtil
    [junit] Tests run: 2, Failures: 0, Errors: 0, Time elapsed: 0.108 sec
    [junit] Running org.apache.pig.test.TestSplitStore
    [junit] Tests run: 9, Failures: 0, Errors: 0, Time elapsed: 119.107 sec
    [junit] Running org.apache.pig.test.TestStore
    [junit] Tests run: 9, Failures: 0, Errors: 0, Time elapsed: 0.365 sec
    [junit] Running org.apache.pig.test.TestStoreOld
    [junit] Tests run: 3, Failures: 0, Errors: 0, Time elapsed: 79.33 sec
    [junit] Running org.apache.pig.test.TestStreaming
    [junit] Tests run: 13, Failures: 0, Errors: 0, Time elapsed: 1.158 sec
    [junit] Running org.apache.pig.test.TestStreamingLocal
    [junit] Tests run: 6, Failures: 0, Errors: 0, Time elapsed: 1.253 sec
    [junit] Running org.apache.pig.test.TestSubtract
    [junit] Tests run: 1, Failures: 0, Errors: 0, Time elapsed: 0.051 sec
    [junit] Running org.apache.pig.test.TestTypeChecking
    [junit] Tests run: 8, Failures: 0, Errors: 0, Time elapsed: 0.572 sec
    [junit] Running org.apache.pig.test.TestTypeCheckingValidator
    [junit] Tests run: 113, Failures: 0, Errors: 0, Time elapsed: 2.101 sec
    [junit] Running org.apache.pig.test.TestTypeCheckingValidatorNoSchema
    [junit] Tests run: 13, Failures: 0, Errors: 0, Time elapsed: 0.185 sec
    [junit] Running org.apache.pig.test.TestUTF8
    [junit] Tests run: 4, Failures: 0, Errors: 0, Time elapsed: 13.862 sec
    [junit] Running org.apache.pig.test.TestUnion
    [junit] Tests run: 3, Failures: 0, Errors: 0, Time elapsed: 29.153 sec

BUILD FAILED
http://hudson.zones.apache.org/hudson/job/Pig-trunk/ws/trunk/build.xml :469: The following
error occurred while executing this line:
http://hudson.zones.apache.org/hudson/job/Pig-trunk/ws/trunk/build.xml :465: Tests failed!

Total time: 103 minutes 24 seconds
Publishing Javadoc
Recording test results


Mime
View raw message