hadoop-pig-dev mailing list archives

Site index · List index
Message view « Date » · « Thread »
Top « Date » · « Thread »
From "Daniel Dai (JIRA)" <j...@apache.org>
Subject [jira] Assigned: (PIG-631) 4 Unit test failures on Windows
Date Sun, 01 Feb 2009 19:43:59 GMT

     [ https://issues.apache.org/jira/browse/PIG-631?page=com.atlassian.jira.plugin.system.issuetabpanels:all-tabpanel
]

Daniel Dai reassigned PIG-631:
------------------------------

    Assignee: Daniel Dai

> 4 Unit test failures on Windows 
> --------------------------------
>
>                 Key: PIG-631
>                 URL: https://issues.apache.org/jira/browse/PIG-631
>             Project: Pig
>          Issue Type: Bug
>    Affects Versions: types_branch
>         Environment: Windows
>            Reporter: Lee Tucker
>            Assignee: Daniel Dai
>         Attachments: PIG-631.temp.patch
>
>
> 4 Windows unit test failures.  All timeouts.  Errors occur at tip of branch and have
for several days.
>     [junit] Running org.apache.pig.test.TestAlgebraicEval
>     [junit] Tests run: 1, Failures: 0, Errors: 1, Time elapsed: 0 sec
>     [junit] Test org.apache.pig.test.TestAlgebraicEval FAILED (timeout)
>     [junit] Running org.apache.pig.test.TestEvalPipeline
>     [junit] Tests run: 1, Failures: 0, Errors: 1, Time elapsed: 0 sec
>     [junit] Test org.apache.pig.test.TestEvalPipeline FAILED (timeout)
>     [junit] Running org.apache.pig.test.TestHBaseStorage
>     [junit] Tests run: 1, Failures: 0, Errors: 1, Time elapsed: 0 sec
>     [junit] Test org.apache.pig.test.TestHBaseStorage FAILED (timeout)
>     [junit] Running org.apache.pig.test.TestMapReduce
>     [junit] Tests run: 1, Failures: 0, Errors: 1, Time elapsed: 0 sec
>     [junit] Test org.apache.pig.test.TestMapReduce FAILED (timeout)

-- 
This message is automatically generated by JIRA.
-
You can reply to this email to add a comment to the issue online.


Mime
View raw message