hadoop-pig-dev mailing list archives

Site index · List index
Message view « Date » · « Thread »
Top « Date » · « Thread »
From "Lee Tucker (JIRA)" <j...@apache.org>
Subject [jira] Created: (PIG-631) 4 Unit test failures on Windows
Date Fri, 23 Jan 2009 22:29:59 GMT
4 Unit test failures on Windows 
--------------------------------

                 Key: PIG-631
                 URL: https://issues.apache.org/jira/browse/PIG-631
             Project: Pig
          Issue Type: Bug
    Affects Versions: types_branch
         Environment: Windows
            Reporter: Lee Tucker


4 Windows unit test failures.  All timeouts.  Errors occur at tip of branch and have for several
days.

    [junit] Running org.apache.pig.test.TestAlgebraicEval
    [junit] Tests run: 1, Failures: 0, Errors: 1, Time elapsed: 0 sec
    [junit] Test org.apache.pig.test.TestAlgebraicEval FAILED (timeout)

    [junit] Running org.apache.pig.test.TestEvalPipeline
    [junit] Tests run: 1, Failures: 0, Errors: 1, Time elapsed: 0 sec
    [junit] Test org.apache.pig.test.TestEvalPipeline FAILED (timeout)

    [junit] Running org.apache.pig.test.TestHBaseStorage
    [junit] Tests run: 1, Failures: 0, Errors: 1, Time elapsed: 0 sec
    [junit] Test org.apache.pig.test.TestHBaseStorage FAILED (timeout)

    [junit] Running org.apache.pig.test.TestMapReduce
    [junit] Tests run: 1, Failures: 0, Errors: 1, Time elapsed: 0 sec
    [junit] Test org.apache.pig.test.TestMapReduce FAILED (timeout)


-- 
This message is automatically generated by JIRA.
-
You can reply to this email to add a comment to the issue online.


Mime
View raw message