hadoop-pig-dev mailing list archives

Site index · List index
Message view « Date » · « Thread »
Top « Date » · « Thread »
From Apache Hudson Server <hud...@hudson.zones.apache.org>
Subject Build failed in Hudson: Pig-trunk #224
Date Mon, 30 Jun 2008 10:08:40 GMT
See http://hudson.zones.apache.org/hudson/job/Pig-trunk/224/changes

------------------------------------------
[...truncated 804 lines...]
    [junit] 	at sun.reflect.NativeConstructorAccessorImpl.newInstance(NativeConstructorAccessorImpl.java:39)
    [junit] 	at sun.reflect.DelegatingConstructorAccessorImpl.newInstance(DelegatingConstructorAccessorImpl.java:27)
    [junit] 	at java.lang.reflect.Constructor.newInstance(Constructor.java:513)
    [junit] 	at junit.framework.TestSuite.createTest(TestSuite.java:56)
    [junit] 	at junit.framework.TestSuite.addTestMethod(TestSuite.java:279)
    [junit] 	at junit.framework.TestSuite.<init>(TestSuite.java:142)
    [junit] 	at org.junit.internal.runners.OldTestClassRunner.<init>(OldTestClassRunner.java:23)
    [junit] 	at sun.reflect.NativeConstructorAccessorImpl.newInstance0(Native Method)
    [junit] 	at sun.reflect.NativeConstructorAccessorImpl.newInstance(NativeConstructorAccessorImpl.java:39)
    [junit] 	at sun.reflect.DelegatingConstructorAccessorImpl.newInstance(DelegatingConstructorAccessorImpl.java:27)
    [junit] 	at java.lang.reflect.Constructor.newInstance(Constructor.java:513)
    [junit] 	at org.junit.internal.requests.ClassRequest.getRunner(ClassRequest.java:26)
    [junit] 	at junit.framework.JUnit4TestAdapter.<init>(JUnit4TestAdapter.java:24)
    [junit] 	at junit.framework.JUnit4TestAdapter.<init>(JUnit4TestAdapter.java:17)
    [junit] 	at sun.reflect.NativeConstructorAccessorImpl.newInstance0(Native Method)
    [junit] 	at sun.reflect.NativeConstructorAccessorImpl.newInstance(NativeConstructorAccessorImpl.java:39)
    [junit] 	at sun.reflect.DelegatingConstructorAccessorImpl.newInstance(DelegatingConstructorAccessorImpl.java:27)
    [junit] 	at java.lang.reflect.Constructor.newInstance(Constructor.java:513)
    [junit] 	at org.apache.tools.ant.taskdefs.optional.junit.JUnitTestRunner.run(JUnitTestRunner.java:387)
    [junit] 	at org.apache.tools.ant.taskdefs.optional.junit.JUnitTestRunner.launch(JUnitTestRunner.java:912)
    [junit] 	at org.apache.tools.ant.taskdefs.optional.junit.JUnitTestRunner.main(JUnitTestRunner.java:766)
    [junit] ))
    [junit] 	at org.apache.pig.test.TestInfixArithmetic.<init>(TestInfixArithmetic.java:43)
    [junit] 	at sun.reflect.NativeConstructorAccessorImpl.newInstance0(Native Method)
    [junit] 	at sun.reflect.NativeConstructorAccessorImpl.newInstance(NativeConstructorAccessorImpl.java:39)
    [junit] 	at sun.reflect.DelegatingConstructorAccessorImpl.newInstance(DelegatingConstructorAccessorImpl.java:27)
    [junit] 	at java.lang.reflect.Constructor.newInstance(Constructor.java:513)
    [junit] 	at junit.framework.TestSuite.createTest(TestSuite.java:56)
    [junit] 	at junit.framework.TestSuite.addTestMethod(TestSuite.java:279)
    [junit] 	at junit.framework.TestSuite.<init>(TestSuite.java:142)
    [junit] 	at org.junit.internal.runners.OldTestClassRunner.<init>(OldTestClassRunner.java:23)
    [junit] 	at sun.reflect.NativeConstructorAccessorImpl.newInstance0(Native Method)
    [junit] 	at sun.reflect.NativeConstructorAccessorImpl.newInstance(NativeConstructorAccessorImpl.java:39)
    [junit] 	at sun.reflect.DelegatingConstructorAccessorImpl.newInstance(DelegatingConstructorAccessorImpl.java:27)
    [junit] 	at java.lang.reflect.Constructor.newInstance(Constructor.java:513)
    [junit] 	at org.junit.internal.requests.ClassRequest.getRunner(ClassRequest.java:26)
    [junit] 	at junit.framework.JUnit4TestAdapter.<init>(JUnit4TestAdapter.java:24)
    [junit] 	at junit.framework.JUnit4TestAdapter.<init>(JUnit4TestAdapter.java:17)
    [junit] 	at sun.reflect.NativeConstructorAccessorImpl.newInstance0(Native Method)
    [junit] 	at sun.reflect.NativeConstructorAccessorImpl.newInstance(NativeConstructorAccessorImpl.java:39)
    [junit] 	at sun.reflect.DelegatingConstructorAccessorImpl.newInstance(DelegatingConstructorAccessorImpl.java:27)
    [junit] 	at java.lang.reflect.Constructor.newInstance(Constructor.java:513)
    [junit] 	at org.apache.tools.ant.taskdefs.optional.junit.JUnitTestRunner.run(JUnitTestRunner.java:387)
    [junit] 	at org.apache.tools.ant.taskdefs.optional.junit.JUnitTestRunner.launch(JUnitTestRunner.java:912)
    [junit] 	at org.apache.tools.ant.taskdefs.optional.junit.JUnitTestRunner.main(JUnitTestRunner.java:766)
    [junit] ))
    [junit] 	at org.apache.pig.test.TestInfixArithmetic.<init>(TestInfixArithmetic.java:43)
    [junit] 	at sun.reflect.NativeConstructorAccessorImpl.newInstance0(Native Method)
    [junit] 	at sun.reflect.NativeConstructorAccessorImpl.newInstance(NativeConstructorAccessorImpl.java:39)
    [junit] 	at sun.reflect.DelegatingConstructorAccessorImpl.newInstance(DelegatingConstructorAccessorImpl.java:27)
    [junit] 	at java.lang.reflect.Constructor.newInstance(Constructor.java:513)
    [junit] 	at junit.framework.TestSuite.createTest(TestSuite.java:56)
    [junit] 	at junit.framework.TestSuite.addTestMethod(TestSuite.java:279)
    [junit] 	at junit.framework.TestSuite.<init>(TestSuite.java:142)
    [junit] 	at org.junit.internal.runners.OldTestClassRunner.<init>(OldTestClassRunner.java:23)
    [junit] 	at sun.reflect.NativeConstructorAccessorImpl.newInstance0(Native Method)
    [junit] 	at sun.reflect.NativeConstructorAccessorImpl.newInstance(NativeConstructorAccessorImpl.java:39)
    [junit] 	at sun.reflect.DelegatingConstructorAccessorImpl.newInstance(DelegatingConstructorAccessorImpl.java:27)
    [junit] 	at java.lang.reflect.Constructor.newInstance(Constructor.java:513)
    [junit] 	at org.junit.internal.requests.ClassRequest.getRunner(ClassRequest.java:26)
    [junit] 	at junit.framework.JUnit4TestAdapter.<init>(JUnit4TestAdapter.java:24)
    [junit] 	at junit.framework.JUnit4TestAdapter.<init>(JUnit4TestAdapter.java:17)
    [junit] 	at sun.reflect.NativeConstructorAccessorImpl.newInstance0(Native Method)
    [junit] 	at sun.reflect.NativeConstructorAccessorImpl.newInstance(NativeConstructorAccessorImpl.java:39)
    [junit] 	at sun.reflect.DelegatingConstructorAccessorImpl.newInstance(DelegatingConstructorAccessorImpl.java:27)
    [junit] 	at java.lang.reflect.Constructor.newInstance(Constructor.java:513)
    [junit] 	at org.apache.tools.ant.taskdefs.optional.junit.JUnitTestRunner.run(JUnitTestRunner.java:387)
    [junit] 	at org.apache.tools.ant.taskdefs.optional.junit.JUnitTestRunner.launch(JUnitTestRunner.java:912)
    [junit] 	at org.apache.tools.ant.taskdefs.optional.junit.JUnitTestRunner.main(JUnitTestRunner.java:766)
    [junit] ))
    [junit] Tests run: 4, Failures: 4, Errors: 0, Time elapsed: 0.029 sec
    [junit] Test org.apache.pig.test.TestInfixArithmetic FAILED
    [junit] Running org.apache.pig.test.TestInstantiateFunc
    [junit] Tests run: 5, Failures: 0, Errors: 0, Time elapsed: 0.064 sec
    [junit] Running org.apache.pig.test.TestLogicalPlanBuilder
    [junit] Tests run: 49, Failures: 0, Errors: 0, Time elapsed: 0.78 sec
    [junit] Running org.apache.pig.test.TestMapReduce
    [junit] 	at org.apache.pig.test.TestMapReduce.<init>(TestMapReduce.java:56)
    [junit] 	at sun.reflect.NativeConstructorAccessorImpl.newInstance0(Native Method)
    [junit] 	at sun.reflect.NativeConstructorAccessorImpl.newInstance(NativeConstructorAccessorImpl.java:39)
    [junit] 	at sun.reflect.DelegatingConstructorAccessorImpl.newInstance(DelegatingConstructorAccessorImpl.java:27)
    [junit] 	at java.lang.reflect.Constructor.newInstance(Constructor.java:513)
    [junit] 	at junit.framework.TestSuite.createTest(TestSuite.java:56)
    [junit] 	at junit.framework.TestSuite.addTestMethod(TestSuite.java:279)
    [junit] 	at junit.framework.TestSuite.<init>(TestSuite.java:142)
    [junit] 	at org.junit.internal.runners.OldTestClassRunner.<init>(OldTestClassRunner.java:23)
    [junit] 	at sun.reflect.NativeConstructorAccessorImpl.newInstance0(Native Method)
    [junit] 	at sun.reflect.NativeConstructorAccessorImpl.newInstance(NativeConstructorAccessorImpl.java:39)
    [junit] 	at sun.reflect.DelegatingConstructorAccessorImpl.newInstance(DelegatingConstructorAccessorImpl.java:27)
    [junit] 	at java.lang.reflect.Constructor.newInstance(Constructor.java:513)
    [junit] 	at org.junit.internal.requests.ClassRequest.getRunner(ClassRequest.java:26)
    [junit] 	at junit.framework.JUnit4TestAdapter.<init>(JUnit4TestAdapter.java:24)
    [junit] 	at junit.framework.JUnit4TestAdapter.<init>(JUnit4TestAdapter.java:17)
    [junit] 	at sun.reflect.NativeConstructorAccessorImpl.newInstance0(Native Method)
    [junit] 	at sun.reflect.NativeConstructorAccessorImpl.newInstance(NativeConstructorAccessorImpl.java:39)
    [junit] 	at sun.reflect.DelegatingConstructorAccessorImpl.newInstance(DelegatingConstructorAccessorImpl.java:27)
    [junit] 	at java.lang.reflect.Constructor.newInstance(Constructor.java:513)
    [junit] 	at org.apache.tools.ant.taskdefs.optional.junit.JUnitTestRunner.run(JUnitTestRunner.java:387)
    [junit] 	at org.apache.tools.ant.taskdefs.optional.junit.JUnitTestRunner.launch(JUnitTestRunner.java:912)
    [junit] 	at org.apache.tools.ant.taskdefs.optional.junit.JUnitTestRunner.main(JUnitTestRunner.java:766)
    [junit] Caused by: java.lang.RuntimeException: java.io.IOException: Mkdirs failed to create
/tmp/hadoop-hudson/mapred/local/0_0
    [junit] 	at org.apache.pig.test.MiniCluster.setupMiniDfsAndMrClusters(MiniCluster.java:78)
    [junit] 	at org.apache.pig.test.MiniCluster.<init>(MiniCluster.java:47)
    [junit] 	at org.apache.pig.test.MiniCluster.<clinit>(MiniCluster.java:44)
    [junit] 	... 23 more
    [junit] Caused by: java.io.IOException: Mkdirs failed to create /tmp/hadoop-hudson/mapred/local/0_0
    [junit] 	at org.apache.hadoop.mapred.MiniMRCluster$TaskTrackerRunner.<init>(MiniMRCluster.java:135)
    [junit] 	at org.apache.hadoop.mapred.MiniMRCluster.<init>(MiniMRCluster.java:372)
    [junit] 	at org.apache.hadoop.mapred.MiniMRCluster.<init>(MiniMRCluster.java:314)
    [junit] 	at org.apache.hadoop.mapred.MiniMRCluster.<init>(MiniMRCluster.java:304)
    [junit] 	at org.apache.hadoop.mapred.MiniMRCluster.<init>(MiniMRCluster.java:294)
    [junit] 	at org.apache.hadoop.mapred.MiniMRCluster.<init>(MiniMRCluster.java:285)
    [junit] 	at org.apache.pig.test.MiniCluster.setupMiniDfsAndMrClusters(MiniCluster.java:59)
    [junit] 	... 25 more
    [junit] ))
    [junit] 	at org.apache.pig.test.TestMapReduce.<init>(TestMapReduce.java:56)
    [junit] 	at sun.reflect.NativeConstructorAccessorImpl.newInstance0(Native Method)
    [junit] 	at sun.reflect.NativeConstructorAccessorImpl.newInstance(NativeConstructorAccessorImpl.java:39)
    [junit] 	at sun.reflect.DelegatingConstructorAccessorImpl.newInstance(DelegatingConstructorAccessorImpl.java:27)
    [junit] 	at java.lang.reflect.Constructor.newInstance(Constructor.java:513)
    [junit] 	at junit.framework.TestSuite.createTest(TestSuite.java:56)
    [junit] 	at junit.framework.TestSuite.addTestMethod(TestSuite.java:279)
    [junit] 	at junit.framework.TestSuite.<init>(TestSuite.java:142)
    [junit] 	at org.junit.internal.runners.OldTestClassRunner.<init>(OldTestClassRunner.java:23)
    [junit] 	at sun.reflect.NativeConstructorAccessorImpl.newInstance0(Native Method)
    [junit] 	at sun.reflect.NativeConstructorAccessorImpl.newInstance(NativeConstructorAccessorImpl.java:39)
    [junit] 	at sun.reflect.DelegatingConstructorAccessorImpl.newInstance(DelegatingConstructorAccessorImpl.java:27)
    [junit] 	at java.lang.reflect.Constructor.newInstance(Constructor.java:513)
    [junit] 	at org.junit.internal.requests.ClassRequest.getRunner(ClassRequest.java:26)
    [junit] 	at junit.framework.JUnit4TestAdapter.<init>(JUnit4TestAdapter.java:24)
    [junit] 	at junit.framework.JUnit4TestAdapter.<init>(JUnit4TestAdapter.java:17)
    [junit] 	at sun.reflect.NativeConstructorAccessorImpl.newInstance0(Native Method)
    [junit] 	at sun.reflect.NativeConstructorAccessorImpl.newInstance(NativeConstructorAccessorImpl.java:39)
    [junit] 	at sun.reflect.DelegatingConstructorAccessorImpl.newInstance(DelegatingConstructorAccessorImpl.java:27)
    [junit] 	at java.lang.reflect.Constructor.newInstance(Constructor.java:513)
    [junit] 	at org.apache.tools.ant.taskdefs.optional.junit.JUnitTestRunner.run(JUnitTestRunner.java:387)
    [junit] 	at org.apache.tools.ant.taskdefs.optional.junit.JUnitTestRunner.launch(JUnitTestRunner.java:912)
    [junit] 	at org.apache.tools.ant.taskdefs.optional.junit.JUnitTestRunner.main(JUnitTestRunner.java:766)
    [junit] ))
    [junit] 	at org.apache.pig.test.TestMapReduce.<init>(TestMapReduce.java:56)
    [junit] 	at sun.reflect.NativeConstructorAccessorImpl.newInstance0(Native Method)
    [junit] 	at sun.reflect.NativeConstructorAccessorImpl.newInstance(NativeConstructorAccessorImpl.java:39)
    [junit] 	at sun.reflect.DelegatingConstructorAccessorImpl.newInstance(DelegatingConstructorAccessorImpl.java:27)
    [junit] 	at java.lang.reflect.Constructor.newInstance(Constructor.java:513)
    [junit] 	at junit.framework.TestSuite.createTest(TestSuite.java:56)
    [junit] 	at junit.framework.TestSuite.addTestMethod(TestSuite.java:279)
    [junit] 	at junit.framework.TestSuite.<init>(TestSuite.java:142)
    [junit] 	at org.junit.internal.runners.OldTestClassRunner.<init>(OldTestClassRunner.java:23)
    [junit] 	at sun.reflect.NativeConstructorAccessorImpl.newInstance0(Native Method)
    [junit] 	at sun.reflect.NativeConstructorAccessorImpl.newInstance(NativeConstructorAccessorImpl.java:39)
    [junit] 	at sun.reflect.DelegatingConstructorAccessorImpl.newInstance(DelegatingConstructorAccessorImpl.java:27)
    [junit] 	at java.lang.reflect.Constructor.newInstance(Constructor.java:513)
    [junit] 	at org.junit.internal.requests.ClassRequest.getRunner(ClassRequest.java:26)
    [junit] 	at junit.framework.JUnit4TestAdapter.<init>(JUnit4TestAdapter.java:24)
    [junit] 	at junit.framework.JUnit4TestAdapter.<init>(JUnit4TestAdapter.java:17)
    [junit] 	at sun.reflect.NativeConstructorAccessorImpl.newInstance0(Native Method)
    [junit] 	at sun.reflect.NativeConstructorAccessorImpl.newInstance(NativeConstructorAccessorImpl.java:39)
    [junit] 	at sun.reflect.DelegatingConstructorAccessorImpl.newInstance(DelegatingConstructorAccessorImpl.java:27)
    [junit] 	at java.lang.reflect.Constructor.newInstance(Constructor.java:513)
    [junit] 	at org.apache.tools.ant.taskdefs.optional.junit.JUnitTestRunner.run(JUnitTestRunner.java:387)
    [junit] 	at org.apache.tools.ant.taskdefs.optional.junit.JUnitTestRunner.launch(JUnitTestRunner.java:912)
    [junit] 	at org.apache.tools.ant.taskdefs.optional.junit.JUnitTestRunner.main(JUnitTestRunner.java:766)
    [junit] ))
    [junit] 	at org.apache.pig.test.TestMapReduce.<init>(TestMapReduce.java:56)
    [junit] 	at sun.reflect.NativeConstructorAccessorImpl.newInstance0(Native Method)
    [junit] 	at sun.reflect.NativeConstructorAccessorImpl.newInstance(NativeConstructorAccessorImpl.java:39)
    [junit] 	at sun.reflect.DelegatingConstructorAccessorImpl.newInstance(DelegatingConstructorAccessorImpl.java:27)
    [junit] 	at java.lang.reflect.Constructor.newInstance(Constructor.java:513)
    [junit] 	at junit.framework.TestSuite.createTest(TestSuite.java:56)
    [junit] 	at junit.framework.TestSuite.addTestMethod(TestSuite.java:279)
    [junit] 	at junit.framework.TestSuite.<init>(TestSuite.java:142)
    [junit] 	at org.junit.internal.runners.OldTestClassRunner.<init>(OldTestClassRunner.java:23)
    [junit] 	at sun.reflect.NativeConstructorAccessorImpl.newInstance0(Native Method)
    [junit] 	at sun.reflect.NativeConstructorAccessorImpl.newInstance(NativeConstructorAccessorImpl.java:39)
    [junit] 	at sun.reflect.DelegatingConstructorAccessorImpl.newInstance(DelegatingConstructorAccessorImpl.java:27)
    [junit] 	at java.lang.reflect.Constructor.newInstance(Constructor.java:513)
    [junit] 	at org.junit.internal.requests.ClassRequest.getRunner(ClassRequest.java:26)
    [junit] 	at junit.framework.JUnit4TestAdapter.<init>(JUnit4TestAdapter.java:24)
    [junit] 	at junit.framework.JUnit4TestAdapter.<init>(JUnit4TestAdapter.java:17)
    [junit] 	at sun.reflect.NativeConstructorAccessorImpl.newInstance0(Native Method)
    [junit] 	at sun.reflect.NativeConstructorAccessorImpl.newInstance(NativeConstructorAccessorImpl.java:39)
    [junit] 	at sun.reflect.DelegatingConstructorAccessorImpl.newInstance(DelegatingConstructorAccessorImpl.java:27)
    [junit] 	at java.lang.reflect.Constructor.newInstance(Constructor.java:513)
    [junit] 	at org.apache.tools.ant.taskdefs.optional.junit.JUnitTestRunner.run(JUnitTestRunner.java:387)
    [junit] 	at org.apache.tools.ant.taskdefs.optional.junit.JUnitTestRunner.launch(JUnitTestRunner.java:912)
    [junit] 	at org.apache.tools.ant.taskdefs.optional.junit.JUnitTestRunner.main(JUnitTestRunner.java:766)
    [junit] ))
    [junit] 	at org.apache.pig.test.TestMapReduce.<init>(TestMapReduce.java:56)
    [junit] 	at sun.reflect.NativeConstructorAccessorImpl.newInstance0(Native Method)
    [junit] 	at sun.reflect.NativeConstructorAccessorImpl.newInstance(NativeConstructorAccessorImpl.java:39)
    [junit] 	at sun.reflect.DelegatingConstructorAccessorImpl.newInstance(DelegatingConstructorAccessorImpl.java:27)
    [junit] 	at java.lang.reflect.Constructor.newInstance(Constructor.java:513)
    [junit] 	at junit.framework.TestSuite.createTest(TestSuite.java:56)
    [junit] 	at junit.framework.TestSuite.addTestMethod(TestSuite.java:279)
    [junit] 	at junit.framework.TestSuite.<init>(TestSuite.java:142)
    [junit] 	at org.junit.internal.runners.OldTestClassRunner.<init>(OldTestClassRunner.java:23)
    [junit] 	at sun.reflect.NativeConstructorAccessorImpl.newInstance0(Native Method)
    [junit] 	at sun.reflect.NativeConstructorAccessorImpl.newInstance(NativeConstructorAccessorImpl.java:39)
    [junit] 	at sun.reflect.DelegatingConstructorAccessorImpl.newInstance(DelegatingConstructorAccessorImpl.java:27)
    [junit] 	at java.lang.reflect.Constructor.newInstance(Constructor.java:513)
    [junit] 	at org.junit.internal.requests.ClassRequest.getRunner(ClassRequest.java:26)
    [junit] 	at junit.framework.JUnit4TestAdapter.<init>(JUnit4TestAdapter.java:24)
    [junit] 	at junit.framework.JUnit4TestAdapter.<init>(JUnit4TestAdapter.java:17)
    [junit] 	at sun.reflect.NativeConstructorAccessorImpl.newInstance0(Native Method)
    [junit] 	at sun.reflect.NativeConstructorAccessorImpl.newInstance(NativeConstructorAccessorImpl.java:39)
    [junit] 	at sun.reflect.DelegatingConstructorAccessorImpl.newInstance(DelegatingConstructorAccessorImpl.java:27)
    [junit] 	at java.lang.reflect.Constructor.newInstance(Constructor.java:513)
    [junit] 	at org.apache.tools.ant.taskdefs.optional.junit.JUnitTestRunner.run(JUnitTestRunner.java:387)
    [junit] 	at org.apache.tools.ant.taskdefs.optional.junit.JUnitTestRunner.launch(JUnitTestRunner.java:912)
    [junit] 	at org.apache.tools.ant.taskdefs.optional.junit.JUnitTestRunner.main(JUnitTestRunner.java:766)
    [junit] ))
    [junit] Tests run: 5, Failures: 5, Errors: 0, Time elapsed: 0.097 sec
    [junit] Test org.apache.pig.test.TestMapReduce FAILED
    [junit] Running org.apache.pig.test.TestMapReduceResultRecycling
    [junit] Tests run: 1, Failures: 0, Errors: 0, Time elapsed: 0.485 sec
    [junit] Running org.apache.pig.test.TestParamSubPreproc
    [junit] Tests run: 28, Failures: 0, Errors: 0, Time elapsed: 0.209 sec
    [junit] Running org.apache.pig.test.TestParser
    [junit] Tests run: 1, Failures: 0, Errors: 0, Time elapsed: 0.196 sec
    [junit] Running org.apache.pig.test.TestPigContext
    [junit] Tests run: 3, Failures: 0, Errors: 0, Time elapsed: 0.741 sec
    [junit] Running org.apache.pig.test.TestPigFile
    [junit] Tests run: 3, Failures: 0, Errors: 1, Time elapsed: 3.294 sec
    [junit] Test org.apache.pig.test.TestPigFile FAILED
    [junit] Running org.apache.pig.test.TestPigScriptParser
    [junit] Tests run: 1, Failures: 0, Errors: 0, Time elapsed: 0.394 sec
    [junit] Running org.apache.pig.test.TestPigServer
    [junit] Tests run: 4, Failures: 0, Errors: 0, Time elapsed: 0.995 sec
    [junit] Running org.apache.pig.test.TestPigSplit
    [junit] Tests run: 1, Failures: 0, Errors: 0, Time elapsed: 0.499 sec
    [junit] Running org.apache.pig.test.TestReversibleLoadStore
    [junit] Tests run: 2, Failures: 0, Errors: 2, Time elapsed: 0.394 sec
    [junit] Test org.apache.pig.test.TestReversibleLoadStore FAILED
    [junit] Running org.apache.pig.test.TestStore
    [junit] Tests run: 4, Failures: 0, Errors: 4, Time elapsed: 0.389 sec
    [junit] Test org.apache.pig.test.TestStore FAILED
    [junit] Running org.apache.pig.test.TestStreaming
    [junit] Tests run: 10, Failures: 0, Errors: 0, Time elapsed: 1.136 sec
    [junit] Running org.apache.pig.test.TestUDF
    [junit] Tests run: 1, Failures: 0, Errors: 1, Time elapsed: 5.877 sec
    [junit] Test org.apache.pig.test.TestUDF FAILED

BUILD FAILED
/zonestorage/hudson/home/hudson/hudson/jobs/Pig-trunk/workspace/trunk/build.xml:253: The following
error occurred while executing this line:
/zonestorage/hudson/home/hudson/hudson/jobs/Pig-trunk/workspace/trunk/build.xml:293: Tests
failed!

Total time: 1 minute 24 seconds
Publishing Javadoc
Recording test results


Mime
View raw message