hadoop-pig-dev mailing list archives

Site index · List index
Message view « Date » · « Thread »
Top « Date » · « Thread »
From "pi song" <pi.so...@gmail.com>
Subject Re: Build failed in Hudson: Pig-trunk #190
Date Wed, 21 May 2008 15:32:46 GMT
Most of the failing tests seem to share the same pattern:-

java.io.IOException: Mkdirs failed to create /tmp/temp2005294356
Mkdirs failed to create /tmp/temp-1116126646
java.io.FileNotFoundException: /tmp/testPigOutput (Permission denied)


Any problem with disk space or permission?

Pi

On Wed, May 21, 2008 at 8:09 PM, Apache Hudson Server <
hudson@hudson.zones.apache.org> wrote:

> See http://hudson.zones.apache.org/hudson/job/Pig-trunk/190/changes
>
> ------------------------------------------
> [...truncated 695 lines...]
>    [junit]     at
> org.apache.hadoop.mapred.MiniMRCluster.<init>(MiniMRCluster.java:281)
>    [junit]     at
> org.apache.hadoop.mapred.MiniMRCluster.<init>(MiniMRCluster.java:258)
>    [junit]     at
> org.apache.pig.test.MiniCluster.setupMiniDfsAndMrClusters(MiniCluster.java:59)
>    [junit]     ... 25 more
>    [junit] ))
>    [junit]     at
> org.apache.pig.test.TestInfixArithmetic.<init>(TestInfixArithmetic.java:43)
>    [junit]     at
> sun.reflect.NativeConstructorAccessorImpl.newInstance0(Native Method)
>    [junit]     at
> sun.reflect.NativeConstructorAccessorImpl.newInstance(NativeConstructorAccessorImpl.java:39)
>    [junit]     at
> sun.reflect.DelegatingConstructorAccessorImpl.newInstance(DelegatingConstructorAccessorImpl.java:27)
>    [junit]     at
> java.lang.reflect.Constructor.newInstance(Constructor.java:513)
>    [junit]     at junit.framework.TestSuite.createTest(TestSuite.java:56)
>    [junit]     at
> junit.framework.TestSuite.addTestMethod(TestSuite.java:279)
>    [junit]     at junit.framework.TestSuite.<init>(TestSuite.java:142)
>    [junit]     at
> org.junit.internal.runners.OldTestClassRunner.<init>(OldTestClassRunner.java:23)
>    [junit]     at
> sun.reflect.NativeConstructorAccessorImpl.newInstance0(Native Method)
>    [junit]     at
> sun.reflect.NativeConstructorAccessorImpl.newInstance(NativeConstructorAccessorImpl.java:39)
>    [junit]     at
> sun.reflect.DelegatingConstructorAccessorImpl.newInstance(DelegatingConstructorAccessorImpl.java:27)
>    [junit]     at
> java.lang.reflect.Constructor.newInstance(Constructor.java:513)
>    [junit]     at
> org.junit.internal.requests.ClassRequest.getRunner(ClassRequest.java:26)
>    [junit]     at
> junit.framework.JUnit4TestAdapter.<init>(JUnit4TestAdapter.java:24)
>    [junit]     at
> junit.framework.JUnit4TestAdapter.<init>(JUnit4TestAdapter.java:17)
>    [junit]     at
> sun.reflect.NativeConstructorAccessorImpl.newInstance0(Native Method)
>    [junit]     at
> sun.reflect.NativeConstructorAccessorImpl.newInstance(NativeConstructorAccessorImpl.java:39)
>    [junit]     at
> sun.reflect.DelegatingConstructorAccessorImpl.newInstance(DelegatingConstructorAccessorImpl.java:27)
>    [junit]     at
> java.lang.reflect.Constructor.newInstance(Constructor.java:513)
>    [junit]     at
> org.apache.tools.ant.taskdefs.optional.junit.JUnitTestRunner.run(JUnitTestRunner.java:387)
>    [junit]     at
> org.apache.tools.ant.taskdefs.optional.junit.JUnitTestRunner.launch(JUnitTestRunner.java:912)
>    [junit]     at
> org.apache.tools.ant.taskdefs.optional.junit.JUnitTestRunner.main(JUnitTestRunner.java:766)
>    [junit] ))
>    [junit]     at
> org.apache.pig.test.TestInfixArithmetic.<init>(TestInfixArithmetic.java:43)
>    [junit]     at
> sun.reflect.NativeConstructorAccessorImpl.newInstance0(Native Method)
>    [junit]     at
> sun.reflect.NativeConstructorAccessorImpl.newInstance(NativeConstructorAccessorImpl.java:39)
>    [junit]     at
> sun.reflect.DelegatingConstructorAccessorImpl.newInstance(DelegatingConstructorAccessorImpl.java:27)
>    [junit]     at
> java.lang.reflect.Constructor.newInstance(Constructor.java:513)
>    [junit]     at junit.framework.TestSuite.createTest(TestSuite.java:56)
>    [junit]     at
> junit.framework.TestSuite.addTestMethod(TestSuite.java:279)
>    [junit]     at junit.framework.TestSuite.<init>(TestSuite.java:142)
>    [junit]     at
> org.junit.internal.runners.OldTestClassRunner.<init>(OldTestClassRunner.java:23)
>    [junit]     at
> sun.reflect.NativeConstructorAccessorImpl.newInstance0(Native Method)
>    [junit]     at
> sun.reflect.NativeConstructorAccessorImpl.newInstance(NativeConstructorAccessorImpl.java:39)
>    [junit]     at
> sun.reflect.DelegatingConstructorAccessorImpl.newInstance(DelegatingConstructorAccessorImpl.java:27)
>    [junit]     at
> java.lang.reflect.Constructor.newInstance(Constructor.java:513)
>    [junit]     at
> org.junit.internal.requests.ClassRequest.getRunner(ClassRequest.java:26)
>    [junit]     at
> junit.framework.JUnit4TestAdapter.<init>(JUnit4TestAdapter.java:24)
>    [junit]     at
> junit.framework.JUnit4TestAdapter.<init>(JUnit4TestAdapter.java:17)
>    [junit]     at
> sun.reflect.NativeConstructorAccessorImpl.newInstance0(Native Method)
>    [junit]     at
> sun.reflect.NativeConstructorAccessorImpl.newInstance(NativeConstructorAccessorImpl.java:39)
>    [junit]     at
> sun.reflect.DelegatingConstructorAccessorImpl.newInstance(DelegatingConstructorAccessorImpl.java:27)
>    [junit]     at
> java.lang.reflect.Constructor.newInstance(Constructor.java:513)
>    [junit]     at
> org.apache.tools.ant.taskdefs.optional.junit.JUnitTestRunner.run(JUnitTestRunner.java:387)
>    [junit]     at
> org.apache.tools.ant.taskdefs.optional.junit.JUnitTestRunner.launch(JUnitTestRunner.java:912)
>    [junit]     at
> org.apache.tools.ant.taskdefs.optional.junit.JUnitTestRunner.main(JUnitTestRunner.java:766)
>    [junit] ))
>    [junit]     at
> org.apache.pig.test.TestInfixArithmetic.<init>(TestInfixArithmetic.java:43)
>    [junit]     at
> sun.reflect.NativeConstructorAccessorImpl.newInstance0(Native Method)
>    [junit]     at
> sun.reflect.NativeConstructorAccessorImpl.newInstance(NativeConstructorAccessorImpl.java:39)
>    [junit]     at
> sun.reflect.DelegatingConstructorAccessorImpl.newInstance(DelegatingConstructorAccessorImpl.java:27)
>    [junit]     at
> java.lang.reflect.Constructor.newInstance(Constructor.java:513)
>    [junit]     at junit.framework.TestSuite.createTest(TestSuite.java:56)
>    [junit]     at
> junit.framework.TestSuite.addTestMethod(TestSuite.java:279)
>    [junit]     at junit.framework.TestSuite.<init>(TestSuite.java:142)
>    [junit]     at
> org.junit.internal.runners.OldTestClassRunner.<init>(OldTestClassRunner.java:23)
>    [junit]     at
> sun.reflect.NativeConstructorAccessorImpl.newInstance0(Native Method)
>    [junit]     at
> sun.reflect.NativeConstructorAccessorImpl.newInstance(NativeConstructorAccessorImpl.java:39)
>    [junit]     at
> sun.reflect.DelegatingConstructorAccessorImpl.newInstance(DelegatingConstructorAccessorImpl.java:27)
>    [junit]     at
> java.lang.reflect.Constructor.newInstance(Constructor.java:513)
>    [junit]     at
> org.junit.internal.requests.ClassRequest.getRunner(ClassRequest.java:26)
>    [junit]     at
> junit.framework.JUnit4TestAdapter.<init>(JUnit4TestAdapter.java:24)
>    [junit]     at
> junit.framework.JUnit4TestAdapter.<init>(JUnit4TestAdapter.java:17)
>    [junit]     at
> sun.reflect.NativeConstructorAccessorImpl.newInstance0(Native Method)
>    [junit]     at
> sun.reflect.NativeConstructorAccessorImpl.newInstance(NativeConstructorAccessorImpl.java:39)
>    [junit]     at
> sun.reflect.DelegatingConstructorAccessorImpl.newInstance(DelegatingConstructorAccessorImpl.java:27)
>    [junit]     at
> java.lang.reflect.Constructor.newInstance(Constructor.java:513)
>    [junit]     at
> org.apache.tools.ant.taskdefs.optional.junit.JUnitTestRunner.run(JUnitTestRunner.java:387)
>    [junit]     at
> org.apache.tools.ant.taskdefs.optional.junit.JUnitTestRunner.launch(JUnitTestRunner.java:912)
>    [junit]     at
> org.apache.tools.ant.taskdefs.optional.junit.JUnitTestRunner.main(JUnitTestRunner.java:766)
>    [junit] ))
>    [junit] Tests run: 4, Failures: 4, Errors: 0, Time elapsed: 0.03 sec
>    [junit] Test org.apache.pig.test.TestInfixArithmetic FAILED
>    [junit] Running org.apache.pig.test.TestLogicalPlanBuilder
>    [junit] Tests run: 49, Failures: 0, Errors: 0, Time elapsed: 0.794 sec
>    [junit] Running org.apache.pig.test.TestMapReduce
>    [junit]     at
> org.apache.pig.test.TestMapReduce.<init>(TestMapReduce.java:56)
>    [junit]     at
> sun.reflect.NativeConstructorAccessorImpl.newInstance0(Native Method)
>    [junit]     at
> sun.reflect.NativeConstructorAccessorImpl.newInstance(NativeConstructorAccessorImpl.java:39)
>    [junit]     at
> sun.reflect.DelegatingConstructorAccessorImpl.newInstance(DelegatingConstructorAccessorImpl.java:27)
>    [junit]     at
> java.lang.reflect.Constructor.newInstance(Constructor.java:513)
>    [junit]     at junit.framework.TestSuite.createTest(TestSuite.java:56)
>    [junit]     at
> junit.framework.TestSuite.addTestMethod(TestSuite.java:279)
>    [junit]     at junit.framework.TestSuite.<init>(TestSuite.java:142)
>    [junit]     at
> org.junit.internal.runners.OldTestClassRunner.<init>(OldTestClassRunner.java:23)
>    [junit]     at
> sun.reflect.NativeConstructorAccessorImpl.newInstance0(Native Method)
>    [junit]     at
> sun.reflect.NativeConstructorAccessorImpl.newInstance(NativeConstructorAccessorImpl.java:39)
>    [junit]     at
> sun.reflect.DelegatingConstructorAccessorImpl.newInstance(DelegatingConstructorAccessorImpl.java:27)
>    [junit]     at
> java.lang.reflect.Constructor.newInstance(Constructor.java:513)
>    [junit]     at
> org.junit.internal.requests.ClassRequest.getRunner(ClassRequest.java:26)
>    [junit]     at
> junit.framework.JUnit4TestAdapter.<init>(JUnit4TestAdapter.java:24)
>    [junit]     at
> junit.framework.JUnit4TestAdapter.<init>(JUnit4TestAdapter.java:17)
>    [junit]     at
> sun.reflect.NativeConstructorAccessorImpl.newInstance0(Native Method)
>    [junit]     at
> sun.reflect.NativeConstructorAccessorImpl.newInstance(NativeConstructorAccessorImpl.java:39)
>    [junit]     at
> sun.reflect.DelegatingConstructorAccessorImpl.newInstance(DelegatingConstructorAccessorImpl.java:27)
>    [junit]     at
> java.lang.reflect.Constructor.newInstance(Constructor.java:513)
>    [junit]     at
> org.apache.tools.ant.taskdefs.optional.junit.JUnitTestRunner.run(JUnitTestRunner.java:387)
>    [junit]     at
> org.apache.tools.ant.taskdefs.optional.junit.JUnitTestRunner.launch(JUnitTestRunner.java:912)
>    [junit]     at
> org.apache.tools.ant.taskdefs.optional.junit.JUnitTestRunner.main(JUnitTestRunner.java:766)
>    [junit] Caused by: java.lang.RuntimeException: java.io.IOException:
> Mkdirs failed to create /tmp/hadoop-hudson/mapred/local/0_0
>    [junit]     at
> org.apache.pig.test.MiniCluster.setupMiniDfsAndMrClusters(MiniCluster.java:78)
>    [junit]     at
> org.apache.pig.test.MiniCluster.<init>(MiniCluster.java:47)
>    [junit]     at
> org.apache.pig.test.MiniCluster.<clinit>(MiniCluster.java:44)
>    [junit]     ... 23 more
>    [junit] Caused by: java.io.IOException: Mkdirs failed to create
> /tmp/hadoop-hudson/mapred/local/0_0
>    [junit]     at
> org.apache.hadoop.mapred.MiniMRCluster$TaskTrackerRunner.<init>(MiniMRCluster.java:125)
>    [junit]     at
> org.apache.hadoop.mapred.MiniMRCluster.<init>(MiniMRCluster.java:314)
>    [junit]     at
> org.apache.hadoop.mapred.MiniMRCluster.<init>(MiniMRCluster.java:281)
>    [junit]     at
> org.apache.hadoop.mapred.MiniMRCluster.<init>(MiniMRCluster.java:258)
>    [junit]     at
> org.apache.pig.test.MiniCluster.setupMiniDfsAndMrClusters(MiniCluster.java:59)
>    [junit]     ... 25 more
>    [junit] ))
>    [junit]     at
> org.apache.pig.test.TestMapReduce.<init>(TestMapReduce.java:56)
>    [junit]     at
> sun.reflect.NativeConstructorAccessorImpl.newInstance0(Native Method)
>    [junit]     at
> sun.reflect.NativeConstructorAccessorImpl.newInstance(NativeConstructorAccessorImpl.java:39)
>    [junit]     at
> sun.reflect.DelegatingConstructorAccessorImpl.newInstance(DelegatingConstructorAccessorImpl.java:27)
>    [junit]     at
> java.lang.reflect.Constructor.newInstance(Constructor.java:513)
>    [junit]     at junit.framework.TestSuite.createTest(TestSuite.java:56)
>    [junit]     at
> junit.framework.TestSuite.addTestMethod(TestSuite.java:279)
>    [junit]     at junit.framework.TestSuite.<init>(TestSuite.java:142)
>    [junit]     at
> org.junit.internal.runners.OldTestClassRunner.<init>(OldTestClassRunner.java:23)
>    [junit]     at
> sun.reflect.NativeConstructorAccessorImpl.newInstance0(Native Method)
>    [junit]     at
> sun.reflect.NativeConstructorAccessorImpl.newInstance(NativeConstructorAccessorImpl.java:39)
>    [junit]     at
> sun.reflect.DelegatingConstructorAccessorImpl.newInstance(DelegatingConstructorAccessorImpl.java:27)
>    [junit]     at
> java.lang.reflect.Constructor.newInstance(Constructor.java:513)
>    [junit]     at
> org.junit.internal.requests.ClassRequest.getRunner(ClassRequest.java:26)
>    [junit]     at
> junit.framework.JUnit4TestAdapter.<init>(JUnit4TestAdapter.java:24)
>    [junit]     at
> junit.framework.JUnit4TestAdapter.<init>(JUnit4TestAdapter.java:17)
>    [junit]     at
> sun.reflect.NativeConstructorAccessorImpl.newInstance0(Native Method)
>    [junit]     at
> sun.reflect.NativeConstructorAccessorImpl.newInstance(NativeConstructorAccessorImpl.java:39)
>    [junit]     at
> sun.reflect.DelegatingConstructorAccessorImpl.newInstance(DelegatingConstructorAccessorImpl.java:27)
>    [junit]     at
> java.lang.reflect.Constructor.newInstance(Constructor.java:513)
>    [junit]     at
> org.apache.tools.ant.taskdefs.optional.junit.JUnitTestRunner.run(JUnitTestRunner.java:387)
>    [junit]     at
> org.apache.tools.ant.taskdefs.optional.junit.JUnitTestRunner.launch(JUnitTestRunner.java:912)
>    [junit]     at
> org.apache.tools.ant.taskdefs.optional.junit.JUnitTestRunner.main(JUnitTestRunner.java:766)
>    [junit] ))
>    [junit]     at
> org.apache.pig.test.TestMapReduce.<init>(TestMapReduce.java:56)
>    [junit]     at
> sun.reflect.NativeConstructorAccessorImpl.newInstance0(Native Method)
>    [junit]     at
> sun.reflect.NativeConstructorAccessorImpl.newInstance(NativeConstructorAccessorImpl.java:39)
>    [junit]     at
> sun.reflect.DelegatingConstructorAccessorImpl.newInstance(DelegatingConstructorAccessorImpl.java:27)
>    [junit]     at
> java.lang.reflect.Constructor.newInstance(Constructor.java:513)
>    [junit]     at junit.framework.TestSuite.createTest(TestSuite.java:56)
>    [junit]     at
> junit.framework.TestSuite.addTestMethod(TestSuite.java:279)
>    [junit]     at junit.framework.TestSuite.<init>(TestSuite.java:142)
>    [junit]     at
> org.junit.internal.runners.OldTestClassRunner.<init>(OldTestClassRunner.java:23)
>    [junit]     at
> sun.reflect.NativeConstructorAccessorImpl.newInstance0(Native Method)
>    [junit]     at
> sun.reflect.NativeConstructorAccessorImpl.newInstance(NativeConstructorAccessorImpl.java:39)
>    [junit]     at
> sun.reflect.DelegatingConstructorAccessorImpl.newInstance(DelegatingConstructorAccessorImpl.java:27)
>    [junit]     at
> java.lang.reflect.Constructor.newInstance(Constructor.java:513)
>    [junit]     at
> org.junit.internal.requests.ClassRequest.getRunner(ClassRequest.java:26)
>    [junit]     at
> junit.framework.JUnit4TestAdapter.<init>(JUnit4TestAdapter.java:24)
>    [junit]     at
> junit.framework.JUnit4TestAdapter.<init>(JUnit4TestAdapter.java:17)
>    [junit]     at
> sun.reflect.NativeConstructorAccessorImpl.newInstance0(Native Method)
>    [junit]     at
> sun.reflect.NativeConstructorAccessorImpl.newInstance(NativeConstructorAccessorImpl.java:39)
>    [junit]     at
> sun.reflect.DelegatingConstructorAccessorImpl.newInstance(DelegatingConstructorAccessorImpl.java:27)
>    [junit]     at
> java.lang.reflect.Constructor.newInstance(Constructor.java:513)
>    [junit]     at
> org.apache.tools.ant.taskdefs.optional.junit.JUnitTestRunner.run(JUnitTestRunner.java:387)
>    [junit]     at
> org.apache.tools.ant.taskdefs.optional.junit.JUnitTestRunner.launch(JUnitTestRunner.java:912)
>    [junit]     at
> org.apache.tools.ant.taskdefs.optional.junit.JUnitTestRunner.main(JUnitTestRunner.java:766)
>    [junit] ))
>    [junit]     at
> org.apache.pig.test.TestMapReduce.<init>(TestMapReduce.java:56)
>    [junit]     at
> sun.reflect.NativeConstructorAccessorImpl.newInstance0(Native Method)
>    [junit]     at
> sun.reflect.NativeConstructorAccessorImpl.newInstance(NativeConstructorAccessorImpl.java:39)
>    [junit]     at
> sun.reflect.DelegatingConstructorAccessorImpl.newInstance(DelegatingConstructorAccessorImpl.java:27)
>    [junit]     at
> java.lang.reflect.Constructor.newInstance(Constructor.java:513)
>    [junit]     at junit.framework.TestSuite.createTest(TestSuite.java:56)
>    [junit]     at
> junit.framework.TestSuite.addTestMethod(TestSuite.java:279)
>    [junit]     at junit.framework.TestSuite.<init>(TestSuite.java:142)
>    [junit]     at
> org.junit.internal.runners.OldTestClassRunner.<init>(OldTestClassRunner.java:23)
>    [junit]     at
> sun.reflect.NativeConstructorAccessorImpl.newInstance0(Native Method)
>    [junit]     at
> sun.reflect.NativeConstructorAccessorImpl.newInstance(NativeConstructorAccessorImpl.java:39)
>    [junit]     at
> sun.reflect.DelegatingConstructorAccessorImpl.newInstance(DelegatingConstructorAccessorImpl.java:27)
>    [junit]     at
> java.lang.reflect.Constructor.newInstance(Constructor.java:513)
>    [junit]     at
> org.junit.internal.requests.ClassRequest.getRunner(ClassRequest.java:26)
>    [junit]     at
> junit.framework.JUnit4TestAdapter.<init>(JUnit4TestAdapter.java:24)
>    [junit]     at
> junit.framework.JUnit4TestAdapter.<init>(JUnit4TestAdapter.java:17)
>    [junit]     at
> sun.reflect.NativeConstructorAccessorImpl.newInstance0(Native Method)
>    [junit]     at
> sun.reflect.NativeConstructorAccessorImpl.newInstance(NativeConstructorAccessorImpl.java:39)
>    [junit]     at
> sun.reflect.DelegatingConstructorAccessorImpl.newInstance(DelegatingConstructorAccessorImpl.java:27)
>    [junit]     at
> java.lang.reflect.Constructor.newInstance(Constructor.java:513)
>    [junit]     at
> org.apache.tools.ant.taskdefs.optional.junit.JUnitTestRunner.run(JUnitTestRunner.java:387)
>    [junit]     at
> org.apache.tools.ant.taskdefs.optional.junit.JUnitTestRunner.launch(JUnitTestRunner.java:912)
>    [junit]     at
> org.apache.tools.ant.taskdefs.optional.junit.JUnitTestRunner.main(JUnitTestRunner.java:766)
>    [junit] ))
>    [junit]     at
> org.apache.pig.test.TestMapReduce.<init>(TestMapReduce.java:56)
>    [junit]     at
> sun.reflect.NativeConstructorAccessorImpl.newInstance0(Native Method)
>    [junit]     at
> sun.reflect.NativeConstructorAccessorImpl.newInstance(NativeConstructorAccessorImpl.java:39)
>    [junit]     at
> sun.reflect.DelegatingConstructorAccessorImpl.newInstance(DelegatingConstructorAccessorImpl.java:27)
>    [junit]     at
> java.lang.reflect.Constructor.newInstance(Constructor.java:513)
>    [junit]     at junit.framework.TestSuite.createTest(TestSuite.java:56)
>    [junit]     at
> junit.framework.TestSuite.addTestMethod(TestSuite.java:279)
>    [junit]     at junit.framework.TestSuite.<init>(TestSuite.java:142)
>    [junit]     at
> org.junit.internal.runners.OldTestClassRunner.<init>(OldTestClassRunner.java:23)
>    [junit]     at
> sun.reflect.NativeConstructorAccessorImpl.newInstance0(Native Method)
>    [junit]     at
> sun.reflect.NativeConstructorAccessorImpl.newInstance(NativeConstructorAccessorImpl.java:39)
>    [junit]     at
> sun.reflect.DelegatingConstructorAccessorImpl.newInstance(DelegatingConstructorAccessorImpl.java:27)
>    [junit]     at
> java.lang.reflect.Constructor.newInstance(Constructor.java:513)
>    [junit]     at
> org.junit.internal.requests.ClassRequest.getRunner(ClassRequest.java:26)
>    [junit]     at
> junit.framework.JUnit4TestAdapter.<init>(JUnit4TestAdapter.java:24)
>    [junit]     at
> junit.framework.JUnit4TestAdapter.<init>(JUnit4TestAdapter.java:17)
>    [junit]     at
> sun.reflect.NativeConstructorAccessorImpl.newInstance0(Native Method)
>    [junit]     at
> sun.reflect.NativeConstructorAccessorImpl.newInstance(NativeConstructorAccessorImpl.java:39)
>    [junit]     at
> sun.reflect.DelegatingConstructorAccessorImpl.newInstance(DelegatingConstructorAccessorImpl.java:27)
>    [junit]     at
> java.lang.reflect.Constructor.newInstance(Constructor.java:513)
>    [junit]     at
> org.apache.tools.ant.taskdefs.optional.junit.JUnitTestRunner.run(JUnitTestRunner.java:387)
>    [junit]     at
> org.apache.tools.ant.taskdefs.optional.junit.JUnitTestRunner.launch(JUnitTestRunner.java:912)
>    [junit]     at
> org.apache.tools.ant.taskdefs.optional.junit.JUnitTestRunner.main(JUnitTestRunner.java:766)
>    [junit] ))
>    [junit] Tests run: 5, Failures: 5, Errors: 0, Time elapsed: 0.033 sec
>    [junit] Test org.apache.pig.test.TestMapReduce FAILED
>    [junit] Running org.apache.pig.test.TestMapReduceResultRecycling
>    [junit] Tests run: 1, Failures: 0, Errors: 0, Time elapsed: 0.492 sec
>    [junit] Running org.apache.pig.test.TestParamSubPreproc
>    [junit] Tests run: 28, Failures: 0, Errors: 0, Time elapsed: 0.449 sec
>    [junit] Running org.apache.pig.test.TestParser
>    [junit] Tests run: 1, Failures: 0, Errors: 0, Time elapsed: 0.167 sec
>    [junit] Running org.apache.pig.test.TestPigContext
>    [junit] Tests run: 3, Failures: 0, Errors: 0, Time elapsed: 0.786 sec
>    [junit] Running org.apache.pig.test.TestPigFile
>    [junit] Tests run: 3, Failures: 0, Errors: 1, Time elapsed: 2.339 sec
>    [junit] Test org.apache.pig.test.TestPigFile FAILED
>    [junit] Running org.apache.pig.test.TestPigScriptParser
>    [junit] Tests run: 1, Failures: 0, Errors: 0, Time elapsed: 0.446 sec
>    [junit] Running org.apache.pig.test.TestPigServer
>    [junit] Tests run: 4, Failures: 0, Errors: 0, Time elapsed: 1.02 sec
>    [junit] Running org.apache.pig.test.TestPigSplit
>    [junit] Tests run: 1, Failures: 0, Errors: 0, Time elapsed: 0.531 sec
>    [junit] Running org.apache.pig.test.TestReversibleLoadStore
>    [junit] Tests run: 2, Failures: 0, Errors: 2, Time elapsed: 0.373 sec
>    [junit] Test org.apache.pig.test.TestReversibleLoadStore FAILED
>    [junit] Running org.apache.pig.test.TestStore
>    [junit] Tests run: 3, Failures: 0, Errors: 3, Time elapsed: 0.351 sec
>    [junit] Test org.apache.pig.test.TestStore FAILED
>    [junit] Running org.apache.pig.test.TestStreaming
>    [junit] Tests run: 10, Failures: 0, Errors: 0, Time elapsed: 1.221 sec
>
> BUILD FAILED
> /zonestorage/hudson/home/hudson/hudson/jobs/Pig-trunk/workspace/trunk/build.xml:253:
> The following error occurred while executing this line:
> /zonestorage/hudson/home/hudson/hudson/jobs/Pig-trunk/workspace/trunk/build.xml:293:
> Tests failed!
>
> Total time: 1 minute 24 seconds
> Publishing Javadoc
> Recording test results
>
>

Mime
  • Unnamed multipart/alternative (inline, None, 0 bytes)
View raw message