hadoop-pig-dev mailing list archives

Site index · List index
Message view « Date » · « Thread »
Top « Date » · « Thread »
From Apache Hudson Server <hud...@hudson.zones.apache.org>
Subject Build failed in Hudson: Pig-trunk #139
Date Mon, 31 Mar 2008 10:10:21 GMT
See http://hudson.zones.apache.org/hudson/job/Pig-trunk/139/changes

------------------------------------------
[...truncated 1762 lines...]
    [junit] 	... 23 more
    [junit] Caused by: java.io.IOException: Mkdirs failed to create /tmp/hadoop-hudson/mapred/local/0_0
    [junit] 	at org.apache.hadoop.mapred.MiniMRCluster$TaskTrackerRunner.<init>(MiniMRCluster.java:125)
    [junit] 	at org.apache.hadoop.mapred.MiniMRCluster.<init>(MiniMRCluster.java:314)
    [junit] 	at org.apache.hadoop.mapred.MiniMRCluster.<init>(MiniMRCluster.java:281)
    [junit] 	at org.apache.hadoop.mapred.MiniMRCluster.<init>(MiniMRCluster.java:258)
    [junit] 	at org.apache.pig.test.MiniCluster.setupMiniDfsAndMrClusters(MiniCluster.java:57)
    [junit] 	... 25 more
    [junit] ))
    [junit] 	at org.apache.pig.test.TestStore.<init>(TestStore.java:36)
    [junit] 	at sun.reflect.NativeConstructorAccessorImpl.newInstance0(Native Method)
    [junit] 	at sun.reflect.NativeConstructorAccessorImpl.newInstance(NativeConstructorAccessorImpl.java:39)
    [junit] 	at sun.reflect.DelegatingConstructorAccessorImpl.newInstance(DelegatingConstructorAccessorImpl.java:27)
    [junit] 	at java.lang.reflect.Constructor.newInstance(Constructor.java:513)
    [junit] 	at junit.framework.TestSuite.createTest(TestSuite.java:56)
    [junit] 	at junit.framework.TestSuite.addTestMethod(TestSuite.java:279)
    [junit] 	at junit.framework.TestSuite.<init>(TestSuite.java:142)
    [junit] 	at org.junit.internal.runners.OldTestClassRunner.<init>(OldTestClassRunner.java:23)
    [junit] 	at sun.reflect.NativeConstructorAccessorImpl.newInstance0(Native Method)
    [junit] 	at sun.reflect.NativeConstructorAccessorImpl.newInstance(NativeConstructorAccessorImpl.java:39)
    [junit] 	at sun.reflect.DelegatingConstructorAccessorImpl.newInstance(DelegatingConstructorAccessorImpl.java:27)
    [junit] 	at java.lang.reflect.Constructor.newInstance(Constructor.java:513)
    [junit] 	at org.junit.internal.requests.ClassRequest.getRunner(ClassRequest.java:26)
    [junit] 	at junit.framework.JUnit4TestAdapter.<init>(JUnit4TestAdapter.java:24)
    [junit] 	at junit.framework.JUnit4TestAdapter.<init>(JUnit4TestAdapter.java:17)
    [junit] 	at sun.reflect.NativeConstructorAccessorImpl.newInstance0(Native Method)
    [junit] 	at sun.reflect.NativeConstructorAccessorImpl.newInstance(NativeConstructorAccessorImpl.java:39)
    [junit] 	at sun.reflect.DelegatingConstructorAccessorImpl.newInstance(DelegatingConstructorAccessorImpl.java:27)
    [junit] 	at java.lang.reflect.Constructor.newInstance(Constructor.java:513)
    [junit] 	at org.apache.tools.ant.taskdefs.optional.junit.JUnitTestRunner.run(JUnitTestRunner.java:387)
    [junit] 	at org.apache.tools.ant.taskdefs.optional.junit.JUnitTestRunner.launch(JUnitTestRunner.java:912)
    [junit] 	at org.apache.tools.ant.taskdefs.optional.junit.JUnitTestRunner.main(JUnitTestRunner.java:766)
    [junit] ))
    [junit] 	at org.apache.pig.test.TestStore.<init>(TestStore.java:36)
    [junit] 	at sun.reflect.NativeConstructorAccessorImpl.newInstance0(Native Method)
    [junit] 	at sun.reflect.NativeConstructorAccessorImpl.newInstance(NativeConstructorAccessorImpl.java:39)
    [junit] 	at sun.reflect.DelegatingConstructorAccessorImpl.newInstance(DelegatingConstructorAccessorImpl.java:27)
    [junit] 	at java.lang.reflect.Constructor.newInstance(Constructor.java:513)
    [junit] 	at junit.framework.TestSuite.createTest(TestSuite.java:56)
    [junit] 	at junit.framework.TestSuite.addTestMethod(TestSuite.java:279)
    [junit] 	at junit.framework.TestSuite.<init>(TestSuite.java:142)
    [junit] 	at org.junit.internal.runners.OldTestClassRunner.<init>(OldTestClassRunner.java:23)
    [junit] 	at sun.reflect.NativeConstructorAccessorImpl.newInstance0(Native Method)
    [junit] 	at sun.reflect.NativeConstructorAccessorImpl.newInstance(NativeConstructorAccessorImpl.java:39)
    [junit] 	at sun.reflect.DelegatingConstructorAccessorImpl.newInstance(DelegatingConstructorAccessorImpl.java:27)
    [junit] 	at java.lang.reflect.Constructor.newInstance(Constructor.java:513)
    [junit] 	at org.junit.internal.requests.ClassRequest.getRunner(ClassRequest.java:26)
    [junit] 	at junit.framework.JUnit4TestAdapter.<init>(JUnit4TestAdapter.java:24)
    [junit] 	at junit.framework.JUnit4TestAdapter.<init>(JUnit4TestAdapter.java:17)
    [junit] 	at sun.reflect.NativeConstructorAccessorImpl.newInstance0(Native Method)
    [junit] 	at sun.reflect.NativeConstructorAccessorImpl.newInstance(NativeConstructorAccessorImpl.java:39)
    [junit] 	at sun.reflect.DelegatingConstructorAccessorImpl.newInstance(DelegatingConstructorAccessorImpl.java:27)
    [junit] 	at java.lang.reflect.Constructor.newInstance(Constructor.java:513)
    [junit] 	at org.apache.tools.ant.taskdefs.optional.junit.JUnitTestRunner.run(JUnitTestRunner.java:387)
    [junit] 	at org.apache.tools.ant.taskdefs.optional.junit.JUnitTestRunner.launch(JUnitTestRunner.java:912)
    [junit] 	at org.apache.tools.ant.taskdefs.optional.junit.JUnitTestRunner.main(JUnitTestRunner.java:766)
    [junit] ))
    [junit] Tests run: 3, Failures: 3, Errors: 0, Time elapsed: 0.028 sec
    [junit] Test org.apache.pig.test.TestStore FAILED
    [junit] Running org.apache.pig.test.TestStreaming
    [junit] 	at org.apache.pig.test.TestStreaming.<init>(TestStreaming.java:40)
    [junit] 	at sun.reflect.NativeConstructorAccessorImpl.newInstance0(Native Method)
    [junit] 	at sun.reflect.NativeConstructorAccessorImpl.newInstance(NativeConstructorAccessorImpl.java:39)
    [junit] 	at sun.reflect.DelegatingConstructorAccessorImpl.newInstance(DelegatingConstructorAccessorImpl.java:27)
    [junit] 	at java.lang.reflect.Constructor.newInstance(Constructor.java:513)
    [junit] 	at junit.framework.TestSuite.createTest(TestSuite.java:56)
    [junit] 	at junit.framework.TestSuite.addTestMethod(TestSuite.java:279)
    [junit] 	at junit.framework.TestSuite.<init>(TestSuite.java:142)
    [junit] 	at org.junit.internal.runners.OldTestClassRunner.<init>(OldTestClassRunner.java:23)
    [junit] 	at sun.reflect.NativeConstructorAccessorImpl.newInstance0(Native Method)
    [junit] 	at sun.reflect.NativeConstructorAccessorImpl.newInstance(NativeConstructorAccessorImpl.java:39)
    [junit] 	at sun.reflect.DelegatingConstructorAccessorImpl.newInstance(DelegatingConstructorAccessorImpl.java:27)
    [junit] 	at java.lang.reflect.Constructor.newInstance(Constructor.java:513)
    [junit] 	at org.junit.internal.requests.ClassRequest.getRunner(ClassRequest.java:26)
    [junit] 	at junit.framework.JUnit4TestAdapter.<init>(JUnit4TestAdapter.java:24)
    [junit] 	at junit.framework.JUnit4TestAdapter.<init>(JUnit4TestAdapter.java:17)
    [junit] 	at sun.reflect.NativeConstructorAccessorImpl.newInstance0(Native Method)
    [junit] 	at sun.reflect.NativeConstructorAccessorImpl.newInstance(NativeConstructorAccessorImpl.java:39)
    [junit] 	at sun.reflect.DelegatingConstructorAccessorImpl.newInstance(DelegatingConstructorAccessorImpl.java:27)
    [junit] 	at java.lang.reflect.Constructor.newInstance(Constructor.java:513)
    [junit] 	at org.apache.tools.ant.taskdefs.optional.junit.JUnitTestRunner.run(JUnitTestRunner.java:387)
    [junit] 	at org.apache.tools.ant.taskdefs.optional.junit.JUnitTestRunner.launch(JUnitTestRunner.java:912)
    [junit] 	at org.apache.tools.ant.taskdefs.optional.junit.JUnitTestRunner.main(JUnitTestRunner.java:766)
    [junit] Caused by: java.lang.RuntimeException: java.io.IOException: Mkdirs failed to create
/tmp/hadoop-hudson/mapred/local/0_0
    [junit] 	at org.apache.pig.test.MiniCluster.setupMiniDfsAndMrClusters(MiniCluster.java:76)
    [junit] 	at org.apache.pig.test.MiniCluster.<init>(MiniCluster.java:45)
    [junit] 	at org.apache.pig.test.MiniCluster.<clinit>(MiniCluster.java:42)
    [junit] 	... 23 more
    [junit] Caused by: java.io.IOException: Mkdirs failed to create /tmp/hadoop-hudson/mapred/local/0_0
    [junit] 	at org.apache.hadoop.mapred.MiniMRCluster$TaskTrackerRunner.<init>(MiniMRCluster.java:125)
    [junit] 	at org.apache.hadoop.mapred.MiniMRCluster.<init>(MiniMRCluster.java:314)
    [junit] 	at org.apache.hadoop.mapred.MiniMRCluster.<init>(MiniMRCluster.java:281)
    [junit] 	at org.apache.hadoop.mapred.MiniMRCluster.<init>(MiniMRCluster.java:258)
    [junit] 	at org.apache.pig.test.MiniCluster.setupMiniDfsAndMrClusters(MiniCluster.java:57)
    [junit] 	... 25 more
    [junit] ))
    [junit] 	at org.apache.pig.test.TestStreaming.<init>(TestStreaming.java:40)
    [junit] 	at sun.reflect.NativeConstructorAccessorImpl.newInstance0(Native Method)
    [junit] 	at sun.reflect.NativeConstructorAccessorImpl.newInstance(NativeConstructorAccessorImpl.java:39)
    [junit] 	at sun.reflect.DelegatingConstructorAccessorImpl.newInstance(DelegatingConstructorAccessorImpl.java:27)
    [junit] 	at java.lang.reflect.Constructor.newInstance(Constructor.java:513)
    [junit] 	at junit.framework.TestSuite.createTest(TestSuite.java:56)
    [junit] 	at junit.framework.TestSuite.addTestMethod(TestSuite.java:279)
    [junit] 	at junit.framework.TestSuite.<init>(TestSuite.java:142)
    [junit] 	at org.junit.internal.runners.OldTestClassRunner.<init>(OldTestClassRunner.java:23)
    [junit] 	at sun.reflect.NativeConstructorAccessorImpl.newInstance0(Native Method)
    [junit] 	at sun.reflect.NativeConstructorAccessorImpl.newInstance(NativeConstructorAccessorImpl.java:39)
    [junit] 	at sun.reflect.DelegatingConstructorAccessorImpl.newInstance(DelegatingConstructorAccessorImpl.java:27)
    [junit] 	at java.lang.reflect.Constructor.newInstance(Constructor.java:513)
    [junit] 	at org.junit.internal.requests.ClassRequest.getRunner(ClassRequest.java:26)
    [junit] 	at junit.framework.JUnit4TestAdapter.<init>(JUnit4TestAdapter.java:24)
    [junit] 	at junit.framework.JUnit4TestAdapter.<init>(JUnit4TestAdapter.java:17)
    [junit] 	at sun.reflect.NativeConstructorAccessorImpl.newInstance0(Native Method)
    [junit] 	at sun.reflect.NativeConstructorAccessorImpl.newInstance(NativeConstructorAccessorImpl.java:39)
    [junit] 	at sun.reflect.DelegatingConstructorAccessorImpl.newInstance(DelegatingConstructorAccessorImpl.java:27)
    [junit] 	at java.lang.reflect.Constructor.newInstance(Constructor.java:513)
    [junit] 	at org.apache.tools.ant.taskdefs.optional.junit.JUnitTestRunner.run(JUnitTestRunner.java:387)
    [junit] 	at org.apache.tools.ant.taskdefs.optional.junit.JUnitTestRunner.launch(JUnitTestRunner.java:912)
    [junit] 	at org.apache.tools.ant.taskdefs.optional.junit.JUnitTestRunner.main(JUnitTestRunner.java:766)
    [junit] ))
    [junit] 	at org.apache.pig.test.TestStreaming.<init>(TestStreaming.java:40)
    [junit] 	at sun.reflect.NativeConstructorAccessorImpl.newInstance0(Native Method)
    [junit] 	at sun.reflect.NativeConstructorAccessorImpl.newInstance(NativeConstructorAccessorImpl.java:39)
    [junit] 	at sun.reflect.DelegatingConstructorAccessorImpl.newInstance(DelegatingConstructorAccessorImpl.java:27)
    [junit] 	at java.lang.reflect.Constructor.newInstance(Constructor.java:513)
    [junit] 	at junit.framework.TestSuite.createTest(TestSuite.java:56)
    [junit] 	at junit.framework.TestSuite.addTestMethod(TestSuite.java:279)
    [junit] 	at junit.framework.TestSuite.<init>(TestSuite.java:142)
    [junit] 	at org.junit.internal.runners.OldTestClassRunner.<init>(OldTestClassRunner.java:23)
    [junit] 	at sun.reflect.NativeConstructorAccessorImpl.newInstance0(Native Method)
    [junit] 	at sun.reflect.NativeConstructorAccessorImpl.newInstance(NativeConstructorAccessorImpl.java:39)
    [junit] 	at sun.reflect.DelegatingConstructorAccessorImpl.newInstance(DelegatingConstructorAccessorImpl.java:27)
    [junit] 	at java.lang.reflect.Constructor.newInstance(Constructor.java:513)
    [junit] 	at org.junit.internal.requests.ClassRequest.getRunner(ClassRequest.java:26)
    [junit] 	at junit.framework.JUnit4TestAdapter.<init>(JUnit4TestAdapter.java:24)
    [junit] 	at junit.framework.JUnit4TestAdapter.<init>(JUnit4TestAdapter.java:17)
    [junit] 	at sun.reflect.NativeConstructorAccessorImpl.newInstance0(Native Method)
    [junit] 	at sun.reflect.NativeConstructorAccessorImpl.newInstance(NativeConstructorAccessorImpl.java:39)
    [junit] 	at sun.reflect.DelegatingConstructorAccessorImpl.newInstance(DelegatingConstructorAccessorImpl.java:27)
    [junit] 	at java.lang.reflect.Constructor.newInstance(Constructor.java:513)
    [junit] 	at org.apache.tools.ant.taskdefs.optional.junit.JUnitTestRunner.run(JUnitTestRunner.java:387)
    [junit] 	at org.apache.tools.ant.taskdefs.optional.junit.JUnitTestRunner.launch(JUnitTestRunner.java:912)
    [junit] 	at org.apache.tools.ant.taskdefs.optional.junit.JUnitTestRunner.main(JUnitTestRunner.java:766)
    [junit] ))
    [junit] 	at org.apache.pig.test.TestStreaming.<init>(TestStreaming.java:40)
    [junit] 	at sun.reflect.NativeConstructorAccessorImpl.newInstance0(Native Method)
    [junit] 	at sun.reflect.NativeConstructorAccessorImpl.newInstance(NativeConstructorAccessorImpl.java:39)
    [junit] 	at sun.reflect.DelegatingConstructorAccessorImpl.newInstance(DelegatingConstructorAccessorImpl.java:27)
    [junit] 	at java.lang.reflect.Constructor.newInstance(Constructor.java:513)
    [junit] 	at junit.framework.TestSuite.createTest(TestSuite.java:56)
    [junit] 	at junit.framework.TestSuite.addTestMethod(TestSuite.java:279)
    [junit] 	at junit.framework.TestSuite.<init>(TestSuite.java:142)
    [junit] 	at org.junit.internal.runners.OldTestClassRunner.<init>(OldTestClassRunner.java:23)
    [junit] 	at sun.reflect.NativeConstructorAccessorImpl.newInstance0(Native Method)
    [junit] 	at sun.reflect.NativeConstructorAccessorImpl.newInstance(NativeConstructorAccessorImpl.java:39)
    [junit] 	at sun.reflect.DelegatingConstructorAccessorImpl.newInstance(DelegatingConstructorAccessorImpl.java:27)
    [junit] 	at java.lang.reflect.Constructor.newInstance(Constructor.java:513)
    [junit] 	at org.junit.internal.requests.ClassRequest.getRunner(ClassRequest.java:26)
    [junit] 	at junit.framework.JUnit4TestAdapter.<init>(JUnit4TestAdapter.java:24)
    [junit] 	at junit.framework.JUnit4TestAdapter.<init>(JUnit4TestAdapter.java:17)
    [junit] 	at sun.reflect.NativeConstructorAccessorImpl.newInstance0(Native Method)
    [junit] 	at sun.reflect.NativeConstructorAccessorImpl.newInstance(NativeConstructorAccessorImpl.java:39)
    [junit] 	at sun.reflect.DelegatingConstructorAccessorImpl.newInstance(DelegatingConstructorAccessorImpl.java:27)
    [junit] 	at java.lang.reflect.Constructor.newInstance(Constructor.java:513)
    [junit] 	at org.apache.tools.ant.taskdefs.optional.junit.JUnitTestRunner.run(JUnitTestRunner.java:387)
    [junit] 	at org.apache.tools.ant.taskdefs.optional.junit.JUnitTestRunner.launch(JUnitTestRunner.java:912)
    [junit] 	at org.apache.tools.ant.taskdefs.optional.junit.JUnitTestRunner.main(JUnitTestRunner.java:766)
    [junit] ))
    [junit] 	at org.apache.pig.test.TestStreaming.<init>(TestStreaming.java:40)
    [junit] 	at sun.reflect.NativeConstructorAccessorImpl.newInstance0(Native Method)
    [junit] 	at sun.reflect.NativeConstructorAccessorImpl.newInstance(NativeConstructorAccessorImpl.java:39)
    [junit] 	at sun.reflect.DelegatingConstructorAccessorImpl.newInstance(DelegatingConstructorAccessorImpl.java:27)
    [junit] 	at java.lang.reflect.Constructor.newInstance(Constructor.java:513)
    [junit] 	at junit.framework.TestSuite.createTest(TestSuite.java:56)
    [junit] 	at junit.framework.TestSuite.addTestMethod(TestSuite.java:279)
    [junit] 	at junit.framework.TestSuite.<init>(TestSuite.java:142)
    [junit] 	at org.junit.internal.runners.OldTestClassRunner.<init>(OldTestClassRunner.java:23)
    [junit] 	at sun.reflect.NativeConstructorAccessorImpl.newInstance0(Native Method)
    [junit] 	at sun.reflect.NativeConstructorAccessorImpl.newInstance(NativeConstructorAccessorImpl.java:39)
    [junit] 	at sun.reflect.DelegatingConstructorAccessorImpl.newInstance(DelegatingConstructorAccessorImpl.java:27)
    [junit] 	at java.lang.reflect.Constructor.newInstance(Constructor.java:513)
    [junit] 	at org.junit.internal.requests.ClassRequest.getRunner(ClassRequest.java:26)
    [junit] 	at junit.framework.JUnit4TestAdapter.<init>(JUnit4TestAdapter.java:24)
    [junit] 	at junit.framework.JUnit4TestAdapter.<init>(JUnit4TestAdapter.java:17)
    [junit] 	at sun.reflect.NativeConstructorAccessorImpl.newInstance0(Native Method)
    [junit] 	at sun.reflect.NativeConstructorAccessorImpl.newInstance(NativeConstructorAccessorImpl.java:39)
    [junit] 	at sun.reflect.DelegatingConstructorAccessorImpl.newInstance(DelegatingConstructorAccessorImpl.java:27)
    [junit] 	at java.lang.reflect.Constructor.newInstance(Constructor.java:513)
    [junit] 	at org.apache.tools.ant.taskdefs.optional.junit.JUnitTestRunner.run(JUnitTestRunner.java:387)
    [junit] 	at org.apache.tools.ant.taskdefs.optional.junit.JUnitTestRunner.launch(JUnitTestRunner.java:912)
    [junit] 	at org.apache.tools.ant.taskdefs.optional.junit.JUnitTestRunner.main(JUnitTestRunner.java:766)
    [junit] ))
    [junit] 	at org.apache.pig.test.TestStreaming.<init>(TestStreaming.java:40)
    [junit] 	at sun.reflect.NativeConstructorAccessorImpl.newInstance0(Native Method)
    [junit] 	at sun.reflect.NativeConstructorAccessorImpl.newInstance(NativeConstructorAccessorImpl.java:39)
    [junit] 	at sun.reflect.DelegatingConstructorAccessorImpl.newInstance(DelegatingConstructorAccessorImpl.java:27)
    [junit] 	at java.lang.reflect.Constructor.newInstance(Constructor.java:513)
    [junit] 	at junit.framework.TestSuite.createTest(TestSuite.java:56)
    [junit] 	at junit.framework.TestSuite.addTestMethod(TestSuite.java:279)
    [junit] 	at junit.framework.TestSuite.<init>(TestSuite.java:142)
    [junit] 	at org.junit.internal.runners.OldTestClassRunner.<init>(OldTestClassRunner.java:23)
    [junit] 	at sun.reflect.NativeConstructorAccessorImpl.newInstance0(Native Method)
    [junit] 	at sun.reflect.NativeConstructorAccessorImpl.newInstance(NativeConstructorAccessorImpl.java:39)
    [junit] 	at sun.reflect.DelegatingConstructorAccessorImpl.newInstance(DelegatingConstructorAccessorImpl.java:27)
    [junit] 	at java.lang.reflect.Constructor.newInstance(Constructor.java:513)
    [junit] 	at org.junit.internal.requests.ClassRequest.getRunner(ClassRequest.java:26)
    [junit] 	at junit.framework.JUnit4TestAdapter.<init>(JUnit4TestAdapter.java:24)
    [junit] 	at junit.framework.JUnit4TestAdapter.<init>(JUnit4TestAdapter.java:17)
    [junit] 	at sun.reflect.NativeConstructorAccessorImpl.newInstance0(Native Method)
    [junit] 	at sun.reflect.NativeConstructorAccessorImpl.newInstance(NativeConstructorAccessorImpl.java:39)
    [junit] 	at sun.reflect.DelegatingConstructorAccessorImpl.newInstance(DelegatingConstructorAccessorImpl.java:27)
    [junit] 	at java.lang.reflect.Constructor.newInstance(Constructor.java:513)
    [junit] 	at org.apache.tools.ant.taskdefs.optional.junit.JUnitTestRunner.run(JUnitTestRunner.java:387)
    [junit] 	at org.apache.tools.ant.taskdefs.optional.junit.JUnitTestRunner.launch(JUnitTestRunner.java:912)
    [junit] 	at org.apache.tools.ant.taskdefs.optional.junit.JUnitTestRunner.main(JUnitTestRunner.java:766)
    [junit] ))
    [junit] 	at org.apache.pig.test.TestStreaming.<init>(TestStreaming.java:40)
    [junit] 	at sun.reflect.NativeConstructorAccessorImpl.newInstance0(Native Method)
    [junit] 	at sun.reflect.NativeConstructorAccessorImpl.newInstance(NativeConstructorAccessorImpl.java:39)
    [junit] 	at sun.reflect.DelegatingConstructorAccessorImpl.newInstance(DelegatingConstructorAccessorImpl.java:27)
    [junit] 	at java.lang.reflect.Constructor.newInstance(Constructor.java:513)
    [junit] 	at junit.framework.TestSuite.createTest(TestSuite.java:56)
    [junit] 	at junit.framework.TestSuite.addTestMethod(TestSuite.java:279)
    [junit] 	at junit.framework.TestSuite.<init>(TestSuite.java:142)
    [junit] 	at org.junit.internal.runners.OldTestClassRunner.<init>(OldTestClassRunner.java:23)
    [junit] 	at sun.reflect.NativeConstructorAccessorImpl.newInstance0(Native Method)
    [junit] 	at sun.reflect.NativeConstructorAccessorImpl.newInstance(NativeConstructorAccessorImpl.java:39)
    [junit] 	at sun.reflect.DelegatingConstructorAccessorImpl.newInstance(DelegatingConstructorAccessorImpl.java:27)
    [junit] 	at java.lang.reflect.Constructor.newInstance(Constructor.java:513)
    [junit] 	at org.junit.internal.requests.ClassRequest.getRunner(ClassRequest.java:26)
    [junit] 	at junit.framework.JUnit4TestAdapter.<init>(JUnit4TestAdapter.java:24)
    [junit] 	at junit.framework.JUnit4TestAdapter.<init>(JUnit4TestAdapter.java:17)
    [junit] 	at sun.reflect.NativeConstructorAccessorImpl.newInstance0(Native Method)
    [junit] 	at sun.reflect.NativeConstructorAccessorImpl.newInstance(NativeConstructorAccessorImpl.java:39)
    [junit] 	at sun.reflect.DelegatingConstructorAccessorImpl.newInstance(DelegatingConstructorAccessorImpl.java:27)
    [junit] 	at java.lang.reflect.Constructor.newInstance(Constructor.java:513)
    [junit] 	at org.apache.tools.ant.taskdefs.optional.junit.JUnitTestRunner.run(JUnitTestRunner.java:387)
    [junit] 	at org.apache.tools.ant.taskdefs.optional.junit.JUnitTestRunner.launch(JUnitTestRunner.java:912)
    [junit] 	at org.apache.tools.ant.taskdefs.optional.junit.JUnitTestRunner.main(JUnitTestRunner.java:766)
    [junit] ))
    [junit] Tests run: 7, Failures: 7, Errors: 0, Time elapsed: 0.045 sec
    [junit] Test org.apache.pig.test.TestStreaming FAILED

BUILD FAILED
/zonestorage/hudson/home/hudson/hudson/jobs/Pig-trunk/workspace/trunk/build.xml:271: Tests
failed!

Total time: 2 minutes 9 seconds
Publishing Javadoc
Recording test results


Mime
View raw message