hadoop-mapreduce-user mailing list archives

Site index · List index
Message view « Date » · « Thread »
Top « Date » · « Thread »
From Binglin Chang <decst...@gmail.com>
Subject Re: hadoop 2.4.1 build failure on CentOS 6
Date Tue, 05 Aug 2014 10:13:55 GMT
Could you attach the entire log?


On Tue, Aug 5, 2014 at 3:43 PM, Romu <huruomu@gmail.com> wrote:

> Yes, cmake is installed.
>
> # rpm -qa|grep cmake
> cmake-2.6.4-5.el6.x86_64
>
>
> Regards,
> Romu
>
>
> 2014-08-05 15:36 GMT+08:00 Binglin Chang <decstery@gmail.com>:
>
> do you install cmake? if not, do not use -Pnative to build hadoop:)
>>
>>
>> On Tue, Aug 5, 2014 at 2:57 PM, Romu <huruomu@gmail.com> wrote:
>>
>>> Hi,
>>>
>>> I tried to build hadoop 2.4.1 in a CentOS 6 x86_64 vm but failed.  Maven
>>> 3.2.2 (installed from official bin tar ball)
>>>
>>>
>>>    - Maven: 3.2.2
>>>    - Java: Oracle jdk 1.8.0_11
>>>    - Build command: mvn package -X -e -Pdist,native,docs -Dskiptests
>>>    -Dadditionalparam=-Xdoclint:none
>>>
>>> Error message:
>>>
>>> [INFO]
>>> ------------------------------------------------------------------------
>>>
>>> [INFO] Reactor Summary:
>>>
>>> [INFO]
>>>
>>> [INFO] Apache Hadoop Main ................................. SUCCESS [
>>>  1.993 s]
>>>
>>> [INFO] Apache Hadoop Project POM .......................... SUCCESS [
>>>  1.130 s]
>>>
>>> [INFO] Apache Hadoop Annotations .......................... SUCCESS [
>>>  3.706 s]
>>>
>>> [INFO] Apache Hadoop Assemblies ........................... SUCCESS [
>>>  0.193 s]
>>>
>>> [INFO] Apache Hadoop Project Dist POM ..................... SUCCESS [
>>>  3.118 s]
>>>
>>> [INFO] Apache Hadoop Maven Plugins ........................ SUCCESS [
>>>  6.921 s]
>>>
>>> [INFO] Apache Hadoop MiniKDC .............................. SUCCESS [
>>> 11.463 s]
>>>
>>> [INFO] Apache Hadoop Auth ................................. SUCCESS [
>>> 52.770 s]
>>>
>>> [INFO] Apache Hadoop Auth Examples ........................ SUCCESS [
>>>  2.185 s]
>>>
>>> [INFO] Apache Hadoop Common ............................... FAILURE [
>>> 13.456 s]
>>>
>>> [INFO] Apache Hadoop NFS .................................. SKIPPED
>>>
>>> [INFO] Apache Hadoop Common Project ....................... SKIPPED
>>>
>>> [INFO] Apache Hadoop HDFS ................................. SKIPPED
>>>
>>> [INFO] Apache Hadoop HttpFS ............................... SKIPPED
>>>
>>> [INFO] Apache Hadoop HDFS BookKeeper Journal .............. SKIPPED
>>>
>>> [INFO] Apache Hadoop HDFS-NFS ............................. SKIPPED
>>>
>>> [INFO] Apache Hadoop HDFS Project ......................... SKIPPED
>>>
>>> [INFO] hadoop-yarn ........................................ SKIPPED
>>>
>>> [INFO] hadoop-yarn-api .................................... SKIPPED
>>>
>>> [INFO] hadoop-yarn-common ................................. SKIPPED
>>>
>>> [INFO] hadoop-yarn-server ................................. SKIPPED
>>>
>>> [INFO] hadoop-yarn-server-common .......................... SKIPPED
>>>
>>> [INFO] hadoop-yarn-server-nodemanager ..................... SKIPPED
>>>
>>> [INFO] hadoop-yarn-server-web-proxy ....................... SKIPPED
>>>
>>> [INFO] hadoop-yarn-server-applicationhistoryservice ....... SKIPPED
>>>
>>> [INFO] hadoop-yarn-server-resourcemanager ................. SKIPPED
>>>
>>> [INFO] hadoop-yarn-server-tests ........................... SKIPPED
>>>
>>> [INFO] hadoop-yarn-client ................................. SKIPPED
>>>
>>> [INFO] hadoop-yarn-applications ........................... SKIPPED
>>>
>>> [INFO] hadoop-yarn-applications-distributedshell .......... SKIPPED
>>>
>>> [INFO] hadoop-yarn-applications-unmanaged-am-launcher ..... SKIPPED
>>>
>>> [INFO] hadoop-yarn-site ................................... SKIPPED
>>>
>>> [INFO] hadoop-yarn-project ................................ SKIPPED
>>>
>>> [INFO] hadoop-mapreduce-client ............................ SKIPPED
>>>
>>> [INFO] hadoop-mapreduce-client-core ....................... SKIPPED
>>>
>>> [INFO] hadoop-mapreduce-client-common ..................... SKIPPED
>>>
>>> [INFO] hadoop-mapreduce-client-shuffle .................... SKIPPED
>>>
>>> [INFO] hadoop-mapreduce-client-app ........................ SKIPPED
>>>
>>> [INFO] hadoop-mapreduce-client-hs ......................... SKIPPED
>>>
>>> [INFO] hadoop-mapreduce-client-jobclient .................. SKIPPED
>>>
>>> [INFO] hadoop-mapreduce-client-hs-plugins ................. SKIPPED
>>>
>>> [INFO] Apache Hadoop MapReduce Examples ................... SKIPPED
>>>
>>> [INFO] hadoop-mapreduce ................................... SKIPPED
>>>
>>> [INFO] Apache Hadoop MapReduce Streaming .................. SKIPPED
>>>
>>> [INFO] Apache Hadoop Distributed Copy ..................... SKIPPED
>>>
>>> [INFO] Apache Hadoop Archives ............................. SKIPPED
>>>
>>> [INFO] Apache Hadoop Rumen ................................ SKIPPED
>>>
>>> [INFO] Apache Hadoop Gridmix .............................. SKIPPED
>>>
>>> [INFO] Apache Hadoop Data Join ............................ SKIPPED
>>>
>>> [INFO] Apache Hadoop Extras ............................... SKIPPED
>>>
>>> [INFO] Apache Hadoop Pipes ................................ SKIPPED
>>>
>>> [INFO] Apache Hadoop OpenStack support .................... SKIPPED
>>>
>>> [INFO] Apache Hadoop Client ............................... SKIPPED
>>>
>>> [INFO] Apache Hadoop Mini-Cluster ......................... SKIPPED
>>>
>>> [INFO] Apache Hadoop Scheduler Load Simulator ............. SKIPPED
>>>
>>> [INFO] Apache Hadoop Tools Dist ........................... SKIPPED
>>>
>>> [INFO] Apache Hadoop Tools ................................ SKIPPED
>>>
>>> [INFO] Apache Hadoop Distribution ......................... SKIPPED
>>>
>>> [INFO]
>>> ------------------------------------------------------------------------
>>>
>>> [INFO] BUILD FAILURE
>>>
>>> [INFO]
>>> ------------------------------------------------------------------------
>>>
>>> [INFO] Total time: 01:38 min
>>>
>>> [INFO] Finished at: 2014-08-05T14:01:49+08:00
>>>
>>> [INFO] Final Memory: 77M/316M
>>>
>>> [INFO]
>>> ------------------------------------------------------------------------
>>>
>>> [ERROR] Failed to execute goal
>>> org.apache.maven.plugins:maven-antrun-plugin:1.7:run (make) on project
>>> hadoop-common: An Ant BuildException has occured: exec returned: 1
>>>
>>> [ERROR] around Ant part ...<exec failonerror="true"
>>> dir="/dev/shm/hadoop-2.4.1-src/hadoop-common-project/hadoop-common/target/native"
>>> executable="cmake">... @ 4:129 in
>>> /dev/shm/hadoop-2.4.1-src/hadoop-common-project/hadoop-common/target/antrun/build-main.xml
>>>
>>> [ERROR] -> [Help 1]
>>>
>>> org.apache.maven.lifecycle.LifecycleExecutionException: Failed to
>>> execute goal org.apache.maven.plugins:maven-antrun-plugin:1.7:run (make) on
>>> project hadoop-common: An Ant BuildException has occured: exec returned: 1
>>>
>>> around Ant part ...<exec failonerror="true"
>>> dir="/dev/shm/hadoop-2.4.1-src/hadoop-common-project/hadoop-common/target/native"
>>> executable="cmake">... @ 4:129 in
>>> /dev/shm/hadoop-2.4.1-src/hadoop-common-project/hadoop-common/target/antrun/build-main.xml
>>>
>>>         at
>>> org.apache.maven.lifecycle.internal.MojoExecutor.execute(MojoExecutor.java:216)
>>>
>>>         at
>>> org.apache.maven.lifecycle.internal.MojoExecutor.execute(MojoExecutor.java:153)
>>>
>>>         at
>>> org.apache.maven.lifecycle.internal.MojoExecutor.execute(MojoExecutor.java:145)
>>>
>>>         at
>>> org.apache.maven.lifecycle.internal.LifecycleModuleBuilder.buildProject(LifecycleModuleBuilder.java:116)
>>>
>>>         at
>>> org.apache.maven.lifecycle.internal.LifecycleModuleBuilder.buildProject(LifecycleModuleBuilder.java:80)
>>>
>>>         at
>>> org.apache.maven.lifecycle.internal.builder.singlethreaded.SingleThreadedBuilder.build(SingleThreadedBuilder.java:51)
>>>
>>>         at
>>> org.apache.maven.lifecycle.internal.LifecycleStarter.execute(LifecycleStarter.java:120)
>>>
>>>         at org.apache.maven.DefaultMaven.doExecute(DefaultMaven.java:347)
>>>
>>>         at org.apache.maven.DefaultMaven.execute(DefaultMaven.java:154)
>>>
>>>         at org.apache.maven.cli.MavenCli.execute(MavenCli.java:584)
>>>
>>>         at org.apache.maven.cli.MavenCli.doMain(MavenCli.java:213)
>>>
>>>         at org.apache.maven.cli.MavenCli.main(MavenCli.java:157)
>>>
>>>         at sun.reflect.NativeMethodAccessorImpl.invoke0(Native Method)
>>>
>>>         at
>>> sun.reflect.NativeMethodAccessorImpl.invoke(NativeMethodAccessorImpl.java:62)
>>>
>>>         at
>>> sun.reflect.DelegatingMethodAccessorImpl.invoke(DelegatingMethodAccessorImpl.java:43)
>>>
>>>         at java.lang.reflect.Method.invoke(Method.java:483)
>>>
>>>         at
>>> org.codehaus.plexus.classworlds.launcher.Launcher.launchEnhanced(Launcher.java:289)
>>>
>>>         at
>>> org.codehaus.plexus.classworlds.launcher.Launcher.launch(Launcher.java:229)
>>>
>>>         at
>>> org.codehaus.plexus.classworlds.launcher.Launcher.mainWithExitCode(Launcher.java:415)
>>>
>>>         at
>>> org.codehaus.plexus.classworlds.launcher.Launcher.main(Launcher.java:356)
>>>
>>> Caused by: org.apache.maven.plugin.MojoExecutionException: An Ant
>>> BuildException has occured: exec returned: 1
>>>
>>> around Ant part ...<exec failonerror="true"
>>> dir="/dev/shm/hadoop-2.4.1-src/hadoop-common-project/hadoop-common/target/native"
>>> executable="cmake">... @ 4:129 in
>>> /dev/shm/hadoop-2.4.1-src/hadoop-common-project/hadoop-common/target/antrun/build-main.xml
>>>
>>>         at
>>> org.apache.maven.plugin.antrun.AntRunMojo.execute(AntRunMojo.java:355)
>>>
>>>         at
>>> org.apache.maven.plugin.DefaultBuildPluginManager.executeMojo(DefaultBuildPluginManager.java:132)
>>>
>>>         at
>>> org.apache.maven.lifecycle.internal.MojoExecutor.execute(MojoExecutor.java:208)
>>>
>>>         ... 19 more
>>>
>>> Caused by:
>>> /dev/shm/hadoop-2.4.1-src/hadoop-common-project/hadoop-common/target/antrun/build-main.xml:4:
>>> exec returned: 1
>>>
>>>         at
>>> org.apache.tools.ant.taskdefs.ExecTask.runExecute(ExecTask.java:646)
>>>
>>>         at
>>> org.apache.tools.ant.taskdefs.ExecTask.runExec(ExecTask.java:672)
>>>
>>>         at
>>> org.apache.tools.ant.taskdefs.ExecTask.execute(ExecTask.java:498)
>>>
>>>         at
>>> org.apache.tools.ant.UnknownElement.execute(UnknownElement.java:291)
>>>
>>>         at sun.reflect.GeneratedMethodAccessor18.invoke(Unknown Source)
>>>
>>>         at
>>> sun.reflect.DelegatingMethodAccessorImpl.invoke(DelegatingMethodAccessorImpl.java:43)
>>>
>>>         at java.lang.reflect.Method.invoke(Method.java:483)
>>>
>>>         at
>>> org.apache.tools.ant.dispatch.DispatchUtils.execute(DispatchUtils.java:106)
>>>
>>>         at org.apache.tools.ant.Task.perform(Task.java:348)
>>>
>>>         at org.apache.tools.ant.Target.execute(Target.java:390)
>>>
>>>         at org.apache.tools.ant.Target.performTasks(Target.java:411)
>>>
>>>         at
>>> org.apache.tools.ant.Project.executeSortedTargets(Project.java:1399)
>>>
>>>         at org.apache.tools.ant.Project.executeTarget(Project.java:1368)
>>>
>>>         at
>>> org.apache.maven.plugin.antrun.AntRunMojo.execute(AntRunMojo.java:327)
>>>
>>>         ... 21 more
>>>
>>> [ERROR]
>>>
>>> [ERROR]
>>>
>>> [ERROR] For more information about the errors and possible solutions,
>>> please read the following articles:
>>>
>>> [ERROR] [Help 1]
>>> http://cwiki.apache.org/confluence/display/MAVEN/MojoExecutionException
>>>
>>> [ERROR]
>>>
>>> [ERROR] After correcting the problems, you can resume the build with the
>>> command
>>>
>>> [ERROR]   mvn <goals> -rf :hadoop-common
>>>
>>>
>>> Any idea?
>>>
>>>
>>> Regards,
>>>
>>> Romu
>>>
>>
>>
>

Mime
View raw message