hadoop-mapreduce-user mailing list archives

Site index · List index
Message view « Date » · « Thread »
Top « Date » · « Thread »
From rajesh putta <rajesh.p...@gmail.com>
Subject while creating binary distribution without native code and without documentation: i came across this issue.Can anyone suggest what is the workaround for this.
Date Tue, 24 Jan 2012 05:21:05 GMT
Hi,
while creating binary distribution without native code and without
documentation:
i came across this issue.Can anyone suggest what is the workaround for this.

  $ mvn package -Pdist -DskipTests -Dtar
 [mkdir] Created dir:
/home/rajesh/Hadoop-trunk/trunk/hadoop-hdfs-project/hadoop-hdfs-httpfs/target/tomcat.exp
     [exec]
     [exec] gzip: stdin: unexpected end of file
     [exec] tar: Unexpected EOF in archive
     [exec] tar: Unexpected EOF in archive
     [exec] tar: Error is not recoverable: exiting now
[INFO] ------------------------------------------------------------------------
[INFO] Reactor Summary:
[INFO]
[INFO] Apache Hadoop Main ................................ SUCCESS [2:21.793s]
[INFO] Apache Hadoop Project POM ......................... SUCCESS [6.817s]
[INFO] Apache Hadoop Annotations ......................... SUCCESS [10.019s]
[INFO] Apache Hadoop Assemblies .......................... SUCCESS [0.644s]
[INFO] Apache Hadoop Project Dist POM .................... SUCCESS [22.303s]
[INFO] Apache Hadoop Auth ................................ SUCCESS [8.442s]
[INFO] Apache Hadoop Auth Examples ....................... SUCCESS [6.686s]
[INFO] Apache Hadoop Common .............................. SUCCESS [1:49.166s]
[INFO] Apache Hadoop Common Project ...................... SUCCESS [0.105s]
[INFO] Apache Hadoop HDFS ................................ SUCCESS [2:24.712s]
[INFO] Apache Hadoop HttpFS .............................. FAILURE [42.251s]
[INFO] Apache Hadoop HDFS BookKeeper Journal ............. SKIPPED
[INFO] Apache Hadoop HDFS Project ........................ SKIPPED
[INFO] hadoop-yarn ....................................... SKIPPED
[INFO] hadoop-yarn-api ................................... SKIPPED
[INFO] hadoop-yarn-common ................................ SKIPPED
[INFO] hadoop-yarn-server ................................ SKIPPED
[INFO] hadoop-yarn-server-common ......................... SKIPPED
[INFO] hadoop-yarn-server-nodemanager .................... SKIPPED
[INFO] hadoop-yarn-server-web-proxy ...................... SKIPPED
[INFO] hadoop-yarn-server-resourcemanager ................ SKIPPED
[INFO] hadoop-yarn-server-tests .......................... SKIPPED
[INFO] hadoop-mapreduce-client ........................... SKIPPED
[INFO] hadoop-mapreduce-client-core ...................... SKIPPED
[INFO] hadoop-yarn-applications .......................... SKIPPED
[INFO] hadoop-yarn-applications-distributedshell ......... SKIPPED
[INFO] hadoop-yarn-site .................................. SKIPPED
[INFO] hadoop-mapreduce-client-common .................... SKIPPED
[INFO] hadoop-mapreduce-client-shuffle ................... SKIPPED
[INFO] hadoop-mapreduce-client-app ....................... SKIPPED
[INFO] hadoop-mapreduce-client-hs ........................ SKIPPED
[INFO] hadoop-mapreduce-client-jobclient ................. SKIPPED
[INFO] Apache Hadoop MapReduce Examples .................. SKIPPED
[INFO] hadoop-mapreduce .................................. SKIPPED
[INFO] Apache Hadoop MapReduce Streaming ................. SKIPPED
[INFO] Apache Hadoop Archives ............................ SKIPPED
[INFO] Apache Hadoop Rumen ............................... SKIPPED
[INFO] Apache Hadoop Extras .............................. SKIPPED
[INFO] Apache Hadoop Tools Dist .......................... SKIPPED
[INFO] Apache Hadoop Tools ............................... SKIPPED
[INFO] Apache Hadoop Distribution ........................ SKIPPED
[INFO] ------------------------------------------------------------------------
[INFO] BUILD FAILURE
[INFO] ------------------------------------------------------------------------
[INFO] Total time: 8:16.832s
[INFO] Finished at: Tue Jan 24 10:37:45 IST 2012
[INFO] Final Memory: 45M/344M
[INFO] ------------------------------------------------------------------------
[ERROR] Failed to execute goal
org.apache.maven.plugins:maven-antrun-plugin:1.6:run (dist) on project
hadoop-hdfs-httpfs: An Ant BuildException has occured: exec returned:
2 -> [Help 1]
[ERROR]
[ERROR] To see the full stack trace of the errors, re-run Maven with
the -e switch.
[ERROR] Re-run Maven using the -X switch to enable full debug logging.
[ERROR]
[ERROR] For more information about the errors and possible solutions,
please read the following articles:
[ERROR] [Help 1]
http://cwiki.apache.org/confluence/display/MAVEN/MojoExecutionException
[ERROR]
[ERROR] After correcting the problems, you can resume the build with the command
[ERROR]   mvn <goals> -rf :hadoop-hdfs-httpfs

Mime
View raw message