hadoop-mapreduce-issues mailing list archives

Site index · List index
Message view « Date » · « Thread »
Top « Date » · « Thread »
From "Hadoop QA (JIRA)" <j...@apache.org>
Subject [jira] [Commented] (MAPREDUCE-7048) AM can still crash after MAPREDUCE-7020
Date Wed, 07 Feb 2018 12:57:00 GMT

    [ https://issues.apache.org/jira/browse/MAPREDUCE-7048?page=com.atlassian.jira.plugin.system.issuetabpanels:comment-tabpanel&focusedCommentId=16355407#comment-16355407
] 

Hadoop QA commented on MAPREDUCE-7048:
--------------------------------------

| (x) *{color:red}-1 overall{color}* |
\\
\\
|| Vote || Subsystem || Runtime || Comment ||
| {color:blue}0{color} | {color:blue} reexec {color} | {color:blue}  0m 11s{color} | {color:blue}
Docker mode activated. {color} |
|| || || || {color:brown} Prechecks {color} ||
| {color:green}+1{color} | {color:green} @author {color} | {color:green}  0m  0s{color} |
{color:green} The patch does not contain any @author tags. {color} |
| {color:red}-1{color} | {color:red} test4tests {color} | {color:red}  0m  0s{color} | {color:red}
The patch doesn't appear to include any new or modified tests. Please justify why no new tests
are needed for this patch. Also please list what manual steps were performed to verify this
patch. {color} |
|| || || || {color:brown} trunk Compile Tests {color} ||
| {color:green}+1{color} | {color:green} mvninstall {color} | {color:green} 15m 13s{color}
| {color:green} trunk passed {color} |
| {color:green}+1{color} | {color:green} compile {color} | {color:green}  0m 25s{color} |
{color:green} trunk passed {color} |
| {color:green}+1{color} | {color:green} checkstyle {color} | {color:green}  0m 19s{color}
| {color:green} trunk passed {color} |
| {color:green}+1{color} | {color:green} mvnsite {color} | {color:green}  0m 31s{color} |
{color:green} trunk passed {color} |
| {color:green}+1{color} | {color:green} shadedclient {color} | {color:green}  9m 47s{color}
| {color:green} branch has no errors when building and testing our client artifacts. {color}
|
| {color:green}+1{color} | {color:green} findbugs {color} | {color:green}  0m 48s{color} |
{color:green} trunk passed {color} |
| {color:green}+1{color} | {color:green} javadoc {color} | {color:green}  0m 25s{color} |
{color:green} trunk passed {color} |
|| || || || {color:brown} Patch Compile Tests {color} ||
| {color:green}+1{color} | {color:green} mvninstall {color} | {color:green}  0m 28s{color}
| {color:green} the patch passed {color} |
| {color:green}+1{color} | {color:green} compile {color} | {color:green}  0m 24s{color} |
{color:green} the patch passed {color} |
| {color:green}+1{color} | {color:green} javac {color} | {color:green}  0m 24s{color} | {color:green}
the patch passed {color} |
| {color:green}+1{color} | {color:green} checkstyle {color} | {color:green}  0m 18s{color}
| {color:green} the patch passed {color} |
| {color:green}+1{color} | {color:green} mvnsite {color} | {color:green}  0m 28s{color} |
{color:green} the patch passed {color} |
| {color:green}+1{color} | {color:green} whitespace {color} | {color:green}  0m  0s{color}
| {color:green} The patch has no whitespace issues. {color} |
| {color:green}+1{color} | {color:green} shadedclient {color} | {color:green} 10m 34s{color}
| {color:green} patch has no errors when building and testing our client artifacts. {color}
|
| {color:green}+1{color} | {color:green} findbugs {color} | {color:green}  0m 54s{color} |
{color:green} the patch passed {color} |
| {color:green}+1{color} | {color:green} javadoc {color} | {color:green}  0m 24s{color} |
{color:green} the patch passed {color} |
|| || || || {color:brown} Other Tests {color} ||
| {color:green}+1{color} | {color:green} unit {color} | {color:green}  3m 46s{color} | {color:green}
hadoop-mapreduce-client-core in the patch passed. {color} |
| {color:green}+1{color} | {color:green} asflicense {color} | {color:green}  0m 20s{color}
| {color:green} The patch does not generate ASF License warnings. {color} |
| {color:black}{color} | {color:black} {color} | {color:black} 45m 22s{color} | {color:black}
{color} |
\\
\\
|| Subsystem || Report/Notes ||
| Docker | Client=17.05.0-ce Server=17.05.0-ce Image:yetus/hadoop:5b98639 |
| JIRA Issue | MAPREDUCE-7048 |
| JIRA Patch URL | https://issues.apache.org/jira/secure/attachment/12909612/MAPREDUCE-7048-001.patch
|
| Optional Tests |  asflicense  compile  javac  javadoc  mvninstall  mvnsite  unit  shadedclient
 findbugs  checkstyle  |
| uname | Linux 3006a323f8b0 4.4.0-43-generic #63-Ubuntu SMP Wed Oct 12 13:48:03 UTC 2016
x86_64 x86_64 x86_64 GNU/Linux |
| Build tool | maven |
| Personality | /testptch/patchprocess/precommit/personality/provided.sh |
| git revision | trunk / e5c2fdd |
| maven | version: Apache Maven 3.3.9 |
| Default Java | 1.8.0_151 |
| findbugs | v3.1.0-RC1 |
|  Test Results | https://builds.apache.org/job/PreCommit-MAPREDUCE-Build/7329/testReport/
|
| Max. process+thread count | 410 (vs. ulimit of 5500) |
| modules | C: hadoop-mapreduce-project/hadoop-mapreduce-client/hadoop-mapreduce-client-core
U: hadoop-mapreduce-project/hadoop-mapreduce-client/hadoop-mapreduce-client-core |
| Console output | https://builds.apache.org/job/PreCommit-MAPREDUCE-Build/7329/console |
| Powered by | Apache Yetus 0.8.0-SNAPSHOT   http://yetus.apache.org |


This message was automatically generated.



> AM can still crash after MAPREDUCE-7020
> ---------------------------------------
>
>                 Key: MAPREDUCE-7048
>                 URL: https://issues.apache.org/jira/browse/MAPREDUCE-7048
>             Project: Hadoop Map/Reduce
>          Issue Type: Improvement
>          Components: mr-am
>    Affects Versions: 3.1.0, 3.0.1, 2.10.0, 2.9.1, 2.8.4, 2.7.6
>            Reporter: Peter Bacsko
>            Assignee: Peter Bacsko
>            Priority: Major
>         Attachments: MAPREDUCE-7048-001.patch
>
>
> The testcase TestUberAM#testThreadDumpOnTaskTimeout was supposed to be fixed by MAPREDUCE-7020.
However, it still fails, see: https://builds.apache.org/job/PreCommit-MAPREDUCE-Build/7325/testReport/junit/org.apache.hadoop.mapreduce.v2/TestMRJobs/testThreadDumpOnTaskTimeout/
(note: other tests failed as well, but those look unrelated).
> When I tried to reproduce it locally, it failed again, although with a slightly different
error message (it was actually the same as before):
> {noformat}
> [INFO] -------------------------------------------------------
> [INFO]  T E S T S
> [INFO] -------------------------------------------------------
> [INFO] Running org.apache.hadoop.mapreduce.v2.TestUberAM
> [ERROR] Tests run: 1, Failures: 1, Errors: 0, Skipped: 0, Time elapsed: 128.192 s <<<
FAILURE! - in org.apache.hadoop.mapreduce.v2.TestUberAM
> [ERROR] testThreadDumpOnTaskTimeout(org.apache.hadoop.mapreduce.v2.TestUberAM)  Time
elapsed: 79.539 s  <<< FAILURE!
> java.lang.AssertionError: No AppMaster log found! expected:<1> but was:<2>
> 	at org.junit.Assert.fail(Assert.java:88)
> 	at org.junit.Assert.failNotEquals(Assert.java:743)
> 	at org.junit.Assert.assertEquals(Assert.java:118)
> 	at org.junit.Assert.assertEquals(Assert.java:555)
> 	at org.apache.hadoop.mapreduce.v2.TestMRJobs.testThreadDumpOnTaskTimeout(TestMRJobs.java:1228)
> 	at sun.reflect.NativeMethodAccessorImpl.invoke0(Native Method)
> 	at sun.reflect.NativeMethodAccessorImpl.invoke(NativeMethodAccessorImpl.java:62)
> 	at sun.reflect.DelegatingMethodAccessorImpl.invoke(DelegatingMethodAccessorImpl.java:43)
> 	at java.lang.reflect.Method.invoke(Method.java:498)
> 	at org.junit.runners.model.FrameworkMethod$1.runReflectiveCall(FrameworkMethod.java:47)
> 	at org.junit.internal.runners.model.ReflectiveCallable.run(ReflectiveCallable.java:12)
> 	at org.junit.runners.model.FrameworkMethod.invokeExplosively(FrameworkMethod.java:44)
> 	at org.junit.internal.runners.statements.InvokeMethod.evaluate(InvokeMethod.java:17)
> 	at org.junit.internal.runners.statements.FailOnTimeout$StatementThread.run(FailOnTimeout.java:74)
> {noformat}
> *Root cause:* {{System.exit()}} is still invoked at {{Task.statusUpdate()}}
> {noformat}
>   public void statusUpdate(TaskUmbilicalProtocol umbilical) 
>   throws IOException {
>     int retries = MAX_RETRIES;
>     while (true) {
>       try {
>         if (!umbilical.statusUpdate(getTaskID(), taskStatus).getTaskFound()) {
>           LOG.warn("Parent died.  Exiting "+taskId);
>           System.exit(66);
>         }
>         taskStatus.clearStatus();
>         return;
>         ...
> {noformat}
> At this point, the task was not found and return value of {{umbilical.statusUpdate()}}
is false. Checking whether we run in uber mode seems to solve the problem.



--
This message was sent by Atlassian JIRA
(v7.6.3#76005)

---------------------------------------------------------------------
To unsubscribe, e-mail: mapreduce-issues-unsubscribe@hadoop.apache.org
For additional commands, e-mail: mapreduce-issues-help@hadoop.apache.org


Mime
View raw message