hadoop-mapreduce-issues mailing list archives

Site index · List index
Message view « Date » · « Thread »
Top « Date » · « Thread »
From "Akira Ajisaka (JIRA)" <j...@apache.org>
Subject [jira] [Updated] (MAPREDUCE-6828) TestMiniMRChildTask is failing in branch-2 and branch-2.8 on mac
Date Thu, 05 Jan 2017 08:58:58 GMT

     [ https://issues.apache.org/jira/browse/MAPREDUCE-6828?page=com.atlassian.jira.plugin.system.issuetabpanels:all-tabpanel
]

Akira Ajisaka updated MAPREDUCE-6828:
-------------------------------------
    Priority: Minor  (was: Major)
     Summary: TestMiniMRChildTask is failing in branch-2 and branch-2.8 on mac  (was: TestMiniMRChildTask
is failing in branch-2 and branch-2.8)

Looks like this issue happens only on mac.

> TestMiniMRChildTask is failing in branch-2 and branch-2.8 on mac
> ----------------------------------------------------------------
>
>                 Key: MAPREDUCE-6828
>                 URL: https://issues.apache.org/jira/browse/MAPREDUCE-6828
>             Project: Hadoop Map/Reduce
>          Issue Type: Bug
>          Components: test
>            Reporter: Akira Ajisaka
>            Priority: Minor
>
> {noformat}
> Running org.apache.hadoop.mapred.TestMiniMRChildTask
> Tests run: 3, Failures: 3, Errors: 0, Skipped: 0, Time elapsed: 107.644 sec <<<
FAILURE! - in org.apache.hadoop.mapred.TestMiniMRChildTask
> testTaskEnv(org.apache.hadoop.mapred.TestMiniMRChildTask)  Time elapsed: 24.369 sec 
<<< FAILURE!
> java.lang.AssertionError: The environment checker job failed.
> 	at org.junit.Assert.fail(Assert.java:88)
> 	at org.junit.Assert.assertTrue(Assert.java:41)
> 	at org.apache.hadoop.mapred.TestMiniMRChildTask.runTestTaskEnv(TestMiniMRChildTask.java:550)
> 	at org.apache.hadoop.mapred.TestMiniMRChildTask.testTaskEnv(TestMiniMRChildTask.java:472)
> testTaskOldEnv(org.apache.hadoop.mapred.TestMiniMRChildTask)  Time elapsed: 18.773 sec
 <<< FAILURE!
> java.lang.AssertionError: The environment checker job failed.
> 	at org.junit.Assert.fail(Assert.java:88)
> 	at org.junit.Assert.assertTrue(Assert.java:41)
> 	at org.apache.hadoop.mapred.TestMiniMRChildTask.runTestTaskEnv(TestMiniMRChildTask.java:550)
> 	at org.apache.hadoop.mapred.TestMiniMRChildTask.testTaskOldEnv(TestMiniMRChildTask.java:496)
> testMapRedExecutionEnv(org.apache.hadoop.mapred.TestMiniMRChildTask)  Time elapsed: 23.931
sec  <<< FAILURE!
> java.lang.AssertionError: null
> 	at org.junit.Assert.fail(Assert.java:86)
> 	at org.junit.Assert.assertTrue(Assert.java:41)
> 	at org.junit.Assert.assertTrue(Assert.java:52)
> 	at org.apache.hadoop.mapred.TestMiniMRChildTask.launchTest(TestMiniMRChildTask.java:194)
> 	at org.apache.hadoop.mapred.TestMiniMRChildTask.testMapRedExecutionEnv(TestMiniMRChildTask.java:448)
> {noformat}



--
This message was sent by Atlassian JIRA
(v6.3.4#6332)

---------------------------------------------------------------------
To unsubscribe, e-mail: mapreduce-issues-unsubscribe@hadoop.apache.org
For additional commands, e-mail: mapreduce-issues-help@hadoop.apache.org


Mime
View raw message