hadoop-mapreduce-issues mailing list archives

Site index · List index
Message view « Date » · « Thread »
Top « Date » · « Thread »
From "Akira AJISAKA (JIRA)" <j...@apache.org>
Subject [jira] [Updated] (MAPREDUCE-6702) TestMiniMRChildTask.testTaskEnv and TestMiniMRChildTask.testTaskOldEnv are failing
Date Mon, 06 Jun 2016 14:11:21 GMT

     [ https://issues.apache.org/jira/browse/MAPREDUCE-6702?page=com.atlassian.jira.plugin.system.issuetabpanels:all-tabpanel
]

Akira AJISAKA updated MAPREDUCE-6702:
-------------------------------------
    Hadoop Flags: Incompatible change
    Release Note: 
<!-- markdown -->
In Hadoop 3, YARN containers do not inherit the NodeManagers' environment variables. Therefore,
if you want to inherit NodeManager's environment variables (e.g. `HADOOP_MAPRED_HOME`), you
need to set additional parameters (e.g. `mapreduce.admin.user.env` and `yarn.app.mapreduce.am.env`).

> TestMiniMRChildTask.testTaskEnv and TestMiniMRChildTask.testTaskOldEnv are failing
> ----------------------------------------------------------------------------------
>
>                 Key: MAPREDUCE-6702
>                 URL: https://issues.apache.org/jira/browse/MAPREDUCE-6702
>             Project: Hadoop Map/Reduce
>          Issue Type: Test
>          Components: client
>    Affects Versions: 3.0.0-alpha1
>            Reporter: Daniel Templeton
>            Assignee: Akira AJISAKA
>         Attachments: MAPREDUCE-6702.01.patch
>
>
> -------------------------------------------------------
>  T E S T S
> -------------------------------------------------------
> Running org.apache.hadoop.mapred.TestMiniMRChildTask
> Tests run: 3, Failures: 2, Errors: 0, Skipped: 0, Time elapsed: 92.48 sec <<<
FAILURE! - in org.apache.hadoop.mapred.TestMiniMRChildTask
> testTaskEnv(org.apache.hadoop.mapred.TestMiniMRChildTask)  Time elapsed: 21.906 sec 
<<< FAILURE!
> java.lang.AssertionError: The environment checker job failed.
> 	at org.junit.Assert.fail(Assert.java:88)
> 	at org.junit.Assert.assertTrue(Assert.java:41)
> 	at org.apache.hadoop.mapred.TestMiniMRChildTask.runTestTaskEnv(TestMiniMRChildTask.java:550)
> 	at org.apache.hadoop.mapred.TestMiniMRChildTask.testTaskEnv(TestMiniMRChildTask.java:472)
> testTaskOldEnv(org.apache.hadoop.mapred.TestMiniMRChildTask)  Time elapsed: 17.452 sec
 <<< FAILURE!
> java.lang.AssertionError: The environment checker job failed.
> 	at org.junit.Assert.fail(Assert.java:88)
> 	at org.junit.Assert.assertTrue(Assert.java:41)
> 	at org.apache.hadoop.mapred.TestMiniMRChildTask.runTestTaskEnv(TestMiniMRChildTask.java:550)
> 	at org.apache.hadoop.mapred.TestMiniMRChildTask.testTaskOldEnv(TestMiniMRChildTask.java:496)



--
This message was sent by Atlassian JIRA
(v6.3.4#6332)

---------------------------------------------------------------------
To unsubscribe, e-mail: mapreduce-issues-unsubscribe@hadoop.apache.org
For additional commands, e-mail: mapreduce-issues-help@hadoop.apache.org


Mime
View raw message