hadoop-mapreduce-issues mailing list archives

Site index · List index
Message view « Date » · « Thread »
Top « Date » · « Thread »
From "Hudson (JIRA)" <j...@apache.org>
Subject [jira] [Commented] (MAPREDUCE-6641) TestTaskAttempt fails in trunk
Date Thu, 23 Jun 2016 04:36:16 GMT

    [ https://issues.apache.org/jira/browse/MAPREDUCE-6641?page=com.atlassian.jira.plugin.system.issuetabpanels:comment-tabpanel&focusedCommentId=15345716#comment-15345716
] 

Hudson commented on MAPREDUCE-6641:
-----------------------------------

SUCCESS: Integrated in Hadoop-trunk-Commit #10003 (See [https://builds.apache.org/job/Hadoop-trunk-Commit/10003/])
MAPREDUCE-6641. TestTaskAttempt fails in trunk. Contributed by Haibo (aajisaka: rev 69c21d2db099b3a4bb612fe2876fb448471829b3)
* hadoop-mapreduce-project/hadoop-mapreduce-client/hadoop-mapreduce-client-app/src/test/java/org/apache/hadoop/mapreduce/v2/app/job/impl/TestTaskAttempt.java


> TestTaskAttempt fails in trunk
> ------------------------------
>
>                 Key: MAPREDUCE-6641
>                 URL: https://issues.apache.org/jira/browse/MAPREDUCE-6641
>             Project: Hadoop Map/Reduce
>          Issue Type: Bug
>          Components: test
>            Reporter: Tsuyoshi Ozawa
>            Assignee: Haibo Chen
>             Fix For: 3.0.0-alpha1
>
>         Attachments: mapreduce6641.001.patch, mapreduce6641.002.patch, org.apache.hadoop.mapreduce.v2.app.job.impl.TestTaskAttempt-output.txt
>
>
> {code}
> Running org.apache.hadoop.mapreduce.v2.app.job.impl.TestTaskAttempt
> Tests run: 23, Failures: 1, Errors: 0, Skipped: 0, Time elapsed: 24.917 sec <<<
FAILURE! - in org.apache.hadoop.mapreduce.v2.app.job.impl.TestTaskAttempt
> testMRAppHistoryForTAFailedInAssigned(org.apache.hadoop.mapreduce.v2.app.job.impl.TestTaskAttempt)
 Time elapsed: 12.732 sec  <<< FAILURE!
> java.lang.AssertionError: No Ta Started JH Event
>         at org.junit.Assert.fail(Assert.java:88)
>         at org.junit.Assert.assertTrue(Assert.java:41)
>         at org.apache.hadoop.mapreduce.v2.app.job.impl.TestTaskAttempt.testTaskAttemptAssignedKilledHistory(TestTaskAttempt.java:388)
>         at org.apache.hadoop.mapreduce.v2.app.job.impl.TestTaskAttempt.testMRAppHistoryForTAFailedInAssigned(TestTaskAttempt.java:177)
> {code}



--
This message was sent by Atlassian JIRA
(v6.3.4#6332)

---------------------------------------------------------------------
To unsubscribe, e-mail: mapreduce-issues-unsubscribe@hadoop.apache.org
For additional commands, e-mail: mapreduce-issues-help@hadoop.apache.org


Mime
View raw message