hadoop-mapreduce-issues mailing list archives

Site index · List index
Message view « Date » · « Thread »
Top « Date » · « Thread »
From "Akira AJISAKA (JIRA)" <j...@apache.org>
Subject [jira] [Commented] (MAPREDUCE-6702) TestMiniMRChildTask.testTaskEnv and TestMiniMRChildTask.testTaskOldEnv are failing
Date Fri, 20 May 2016 08:08:13 GMT

    [ https://issues.apache.org/jira/browse/MAPREDUCE-6702?page=com.atlassian.jira.plugin.system.issuetabpanels:comment-tabpanel&focusedCommentId=15292975#comment-15292975
] 

Akira AJISAKA commented on MAPREDUCE-6702:
------------------------------------------

{noformat}
$ which nice
/usr/bin/nice
$ export PATH=/usr/bin
$ nice -n 0 bash /Users/aajisaka/git/hadoop/hadoop-mapreduce-project/hadoop-mapreduce-client/hadoop-mapreduce-client-jobclient/target/org.apache.hadoop.mapred.TestMiniMRChildTask/org.apache.hadoop.mapred.TestMiniMRChildTask-localDir-nm-0_2/usercache/aajisaka/appcache/application_1463727368336_0001/container_1463727368336_0001_01_000002/launch_container.sh
nice: bash: No such file or directory
$ echo $?
127
{noformat}
The error message and exit code are the same.

> TestMiniMRChildTask.testTaskEnv and TestMiniMRChildTask.testTaskOldEnv are failing
> ----------------------------------------------------------------------------------
>
>                 Key: MAPREDUCE-6702
>                 URL: https://issues.apache.org/jira/browse/MAPREDUCE-6702
>             Project: Hadoop Map/Reduce
>          Issue Type: Test
>          Components: client
>    Affects Versions: 3.0.0-alpha1
>            Reporter: Daniel Templeton
>
> -------------------------------------------------------
>  T E S T S
> -------------------------------------------------------
> Running org.apache.hadoop.mapred.TestMiniMRChildTask
> Tests run: 3, Failures: 2, Errors: 0, Skipped: 0, Time elapsed: 92.48 sec <<<
FAILURE! - in org.apache.hadoop.mapred.TestMiniMRChildTask
> testTaskEnv(org.apache.hadoop.mapred.TestMiniMRChildTask)  Time elapsed: 21.906 sec 
<<< FAILURE!
> java.lang.AssertionError: The environment checker job failed.
> 	at org.junit.Assert.fail(Assert.java:88)
> 	at org.junit.Assert.assertTrue(Assert.java:41)
> 	at org.apache.hadoop.mapred.TestMiniMRChildTask.runTestTaskEnv(TestMiniMRChildTask.java:550)
> 	at org.apache.hadoop.mapred.TestMiniMRChildTask.testTaskEnv(TestMiniMRChildTask.java:472)
> testTaskOldEnv(org.apache.hadoop.mapred.TestMiniMRChildTask)  Time elapsed: 17.452 sec
 <<< FAILURE!
> java.lang.AssertionError: The environment checker job failed.
> 	at org.junit.Assert.fail(Assert.java:88)
> 	at org.junit.Assert.assertTrue(Assert.java:41)
> 	at org.apache.hadoop.mapred.TestMiniMRChildTask.runTestTaskEnv(TestMiniMRChildTask.java:550)
> 	at org.apache.hadoop.mapred.TestMiniMRChildTask.testTaskOldEnv(TestMiniMRChildTask.java:496)



--
This message was sent by Atlassian JIRA
(v6.3.4#6332)

---------------------------------------------------------------------
To unsubscribe, e-mail: mapreduce-issues-unsubscribe@hadoop.apache.org
For additional commands, e-mail: mapreduce-issues-help@hadoop.apache.org


Mime
View raw message