hadoop-mapreduce-issues mailing list archives

Site index · List index
Message view « Date » · « Thread »
Top « Date » · « Thread »
From "Akira AJISAKA (JIRA)" <j...@apache.org>
Subject [jira] [Commented] (MAPREDUCE-6702) TestMiniMRChildTask.testTaskEnv and TestMiniMRChildTask.testTaskOldEnv are failing
Date Fri, 20 May 2016 08:02:13 GMT

    [ https://issues.apache.org/jira/browse/MAPREDUCE-6702?page=com.atlassian.jira.plugin.system.issuetabpanels:comment-tabpanel&focusedCommentId=15292967#comment-15292967
] 

Akira AJISAKA commented on MAPREDUCE-6702:
------------------------------------------

In https://builds.apache.org/job/PreCommit-MAPREDUCE-Build/6514/testReport/org.apache.hadoop.mapred/TestMiniMRChildTask/testTaskEnv/
, the job fails by the following error.
{noformat}
2016-05-19 17:43:13,110 WARN  [ContainersLauncher #1] nodemanager.DefaultContainerExecutor
(DefaultContainerExecutor.java:launchContainer(245)) - Exception from container-launch with
container ID: container_1463679782449_0001_01_000002 and exit code: 127
ExitCodeException exitCode=127: nice: bash: No such file or directory

	at org.apache.hadoop.util.Shell.runCommand(Shell.java:946)
	at org.apache.hadoop.util.Shell.run(Shell.java:850)
	at org.apache.hadoop.util.Shell$ShellCommandExecutor.execute(Shell.java:1144)
	at org.apache.hadoop.yarn.server.nodemanager.DefaultContainerExecutor.launchContainer(DefaultContainerExecutor.java:227)
	at org.apache.hadoop.yarn.server.nodemanager.containermanager.launcher.ContainerLaunch.launchContainer(ContainerLaunch.java:385)
	at org.apache.hadoop.yarn.server.nodemanager.containermanager.launcher.ContainerLaunch.call(ContainerLaunch.java:281)
	at org.apache.hadoop.yarn.server.nodemanager.containermanager.launcher.ContainerLaunch.call(ContainerLaunch.java:89)
	at java.util.concurrent.FutureTask.run(FutureTask.java:266)
	at java.util.concurrent.ThreadPoolExecutor.runWorker(ThreadPoolExecutor.java:1142)
	at java.util.concurrent.ThreadPoolExecutor$Worker.run(ThreadPoolExecutor.java:617)
	at java.lang.Thread.run(Thread.java:745)
{noformat}
It looks like bash is not in the PATH.

> TestMiniMRChildTask.testTaskEnv and TestMiniMRChildTask.testTaskOldEnv are failing
> ----------------------------------------------------------------------------------
>
>                 Key: MAPREDUCE-6702
>                 URL: https://issues.apache.org/jira/browse/MAPREDUCE-6702
>             Project: Hadoop Map/Reduce
>          Issue Type: Test
>          Components: client
>    Affects Versions: 3.0.0-alpha1
>            Reporter: Daniel Templeton
>
> -------------------------------------------------------
>  T E S T S
> -------------------------------------------------------
> Running org.apache.hadoop.mapred.TestMiniMRChildTask
> Tests run: 3, Failures: 2, Errors: 0, Skipped: 0, Time elapsed: 92.48 sec <<<
FAILURE! - in org.apache.hadoop.mapred.TestMiniMRChildTask
> testTaskEnv(org.apache.hadoop.mapred.TestMiniMRChildTask)  Time elapsed: 21.906 sec 
<<< FAILURE!
> java.lang.AssertionError: The environment checker job failed.
> 	at org.junit.Assert.fail(Assert.java:88)
> 	at org.junit.Assert.assertTrue(Assert.java:41)
> 	at org.apache.hadoop.mapred.TestMiniMRChildTask.runTestTaskEnv(TestMiniMRChildTask.java:550)
> 	at org.apache.hadoop.mapred.TestMiniMRChildTask.testTaskEnv(TestMiniMRChildTask.java:472)
> testTaskOldEnv(org.apache.hadoop.mapred.TestMiniMRChildTask)  Time elapsed: 17.452 sec
 <<< FAILURE!
> java.lang.AssertionError: The environment checker job failed.
> 	at org.junit.Assert.fail(Assert.java:88)
> 	at org.junit.Assert.assertTrue(Assert.java:41)
> 	at org.apache.hadoop.mapred.TestMiniMRChildTask.runTestTaskEnv(TestMiniMRChildTask.java:550)
> 	at org.apache.hadoop.mapred.TestMiniMRChildTask.testTaskOldEnv(TestMiniMRChildTask.java:496)



--
This message was sent by Atlassian JIRA
(v6.3.4#6332)

---------------------------------------------------------------------
To unsubscribe, e-mail: mapreduce-issues-unsubscribe@hadoop.apache.org
For additional commands, e-mail: mapreduce-issues-help@hadoop.apache.org


Mime
View raw message