hadoop-mapreduce-issues mailing list archives

Site index · List index
Message view « Date » · « Thread »
Top « Date » · « Thread »
From "Eric Badger (JIRA)" <j...@apache.org>
Subject [jira] [Commented] (MAPREDUCE-6658) TestMRJobs fails
Date Wed, 23 Mar 2016 16:29:25 GMT

    [ https://issues.apache.org/jira/browse/MAPREDUCE-6658?page=com.atlassian.jira.plugin.system.issuetabpanels:comment-tabpanel&focusedCommentId=15208709#comment-15208709
] 

Eric Badger commented on MAPREDUCE-6658:
----------------------------------------

[~ajisakaa] are you sure this was broken by [YARN-4686]? I checked out trunk all the back
to the end of February and this test failed every time in the same way as you have shown above.


> TestMRJobs fails
> ----------------
>
>                 Key: MAPREDUCE-6658
>                 URL: https://issues.apache.org/jira/browse/MAPREDUCE-6658
>             Project: Hadoop Map/Reduce
>          Issue Type: Bug
>          Components: test
>            Reporter: Akira AJISAKA
>            Assignee: Eric Badger
>
> TestMRJobs#testJobWithChangePriority fails.
> {noformat}
> Running org.apache.hadoop.mapreduce.v2.TestMRJobs
> Tests run: 12, Failures: 1, Errors: 0, Skipped: 0, Time elapsed: 446.855 sec <<<
FAILURE! - in org.apache.hadoop.mapreduce.v2.TestMRJobs
> testJobWithChangePriority(org.apache.hadoop.mapreduce.v2.TestMRJobs)  Time elapsed: 21.477
sec  <<< FAILURE!
> java.lang.AssertionError: expected:<DEFAULT> but was:<HIGH>
> 	at org.junit.Assert.fail(Assert.java:88)
> 	at org.junit.Assert.failNotEquals(Assert.java:743)
> 	at org.junit.Assert.assertEquals(Assert.java:118)
> 	at org.junit.Assert.assertEquals(Assert.java:144)
> 	at org.apache.hadoop.mapreduce.v2.TestMRJobs.testJobWithChangePriority(TestMRJobs.java:276)
> {noformat}



--
This message was sent by Atlassian JIRA
(v6.3.4#6332)

Mime
View raw message