hadoop-mapreduce-issues mailing list archives

Site index · List index
Message view « Date » · « Thread »
Top « Date » · « Thread »
From "Hudson (JIRA)" <j...@apache.org>
Subject [jira] [Commented] (MAPREDUCE-6580) Test failure : TestMRJobsWithProfiler
Date Wed, 23 Mar 2016 07:08:25 GMT

    [ https://issues.apache.org/jira/browse/MAPREDUCE-6580?page=com.atlassian.jira.plugin.system.issuetabpanels:comment-tabpanel&focusedCommentId=15207986#comment-15207986
] 

Hudson commented on MAPREDUCE-6580:
-----------------------------------

FAILURE: Integrated in Hadoop-trunk-Commit #9487 (See [https://builds.apache.org/job/Hadoop-trunk-Commit/9487/])
MAPREDUCE-6580. Test failure: TestMRJobsWithProfiler. Contributed by (aajisaka: rev 0bfe5a0167f0af65f1d7a8bc251a1c404ed41316)
* hadoop-mapreduce-project/hadoop-mapreduce-client/hadoop-mapreduce-client-jobclient/src/test/java/org/apache/hadoop/mapreduce/v2/TestMRJobsWithProfiler.java


> Test failure : TestMRJobsWithProfiler
> -------------------------------------
>
>                 Key: MAPREDUCE-6580
>                 URL: https://issues.apache.org/jira/browse/MAPREDUCE-6580
>             Project: Hadoop Map/Reduce
>          Issue Type: Bug
>            Reporter: Rohith Sharma K S
>            Assignee: Eric Badger
>             Fix For: 2.8.0, 2.7.3
>
>         Attachments: MAPREDUCE-6580.001.patch
>
>
> From [https://builds.apache.org/job/PreCommit-YARN-Build/9976/artifact/patchprocess/patch-unit-hadoop-mapreduce-project_hadoop-mapreduce-client_hadoop-mapreduce-client-jobclient-jdk1.8.0_66.txt]
TestMRJobsWithProfiler fails intermittently
> {code}
> Running org.apache.hadoop.mapreduce.v2.TestMRJobsWithProfiler
> Tests run: 2, Failures: 1, Errors: 0, Skipped: 0, Time elapsed: 212.973 sec <<<
FAILURE! - in org.apache.hadoop.mapreduce.v2.TestMRJobsWithProfiler
> testDifferentProfilers(org.apache.hadoop.mapreduce.v2.TestMRJobsWithProfiler)  Time elapsed:
133.116 sec  <<< FAILURE!
> java.lang.AssertionError: expected:<4> but was:<1>
> 	at org.junit.Assert.fail(Assert.java:88)
> 	at org.junit.Assert.failNotEquals(Assert.java:743)
> 	at org.junit.Assert.assertEquals(Assert.java:118)
> 	at org.junit.Assert.assertEquals(Assert.java:555)
> 	at org.junit.Assert.assertEquals(Assert.java:542)
> 	at org.apache.hadoop.mapreduce.v2.TestMRJobsWithProfiler.testProfilerInternal(TestMRJobsWithProfiler.java:212)
> 	at org.apache.hadoop.mapreduce.v2.TestMRJobsWithProfiler.testDifferentProfilers(TestMRJobsWithProfiler.java:117)
> {code}



--
This message was sent by Atlassian JIRA
(v6.3.4#6332)

Mime
View raw message