hadoop-mapreduce-issues mailing list archives

Site index · List index
Message view « Date » · « Thread »
Top « Date » · « Thread »
From "Tsuyoshi Ozawa (JIRA)" <j...@apache.org>
Subject [jira] [Created] (MAPREDUCE-6641) TestTaskAttempt fails in trunk
Date Sun, 21 Feb 2016 01:32:18 GMT
Tsuyoshi Ozawa created MAPREDUCE-6641:
-----------------------------------------

             Summary: TestTaskAttempt fails in trunk
                 Key: MAPREDUCE-6641
                 URL: https://issues.apache.org/jira/browse/MAPREDUCE-6641
             Project: Hadoop Map/Reduce
          Issue Type: Bug
          Components: test
            Reporter: Tsuyoshi Ozawa


{code}
Running org.apache.hadoop.mapreduce.v2.app.job.impl.TestTaskAttempt
Tests run: 23, Failures: 1, Errors: 0, Skipped: 0, Time elapsed: 24.917 sec <<< FAILURE!
- in org.apache.hadoop.mapreduce.v2.app.job.impl.TestTaskAttempt
testMRAppHistoryForTAFailedInAssigned(org.apache.hadoop.mapreduce.v2.app.job.impl.TestTaskAttempt)
 Time elapsed: 12.732 sec  <<< FAILURE!
java.lang.AssertionError: No Ta Started JH Event
        at org.junit.Assert.fail(Assert.java:88)
        at org.junit.Assert.assertTrue(Assert.java:41)
        at org.apache.hadoop.mapreduce.v2.app.job.impl.TestTaskAttempt.testTaskAttemptAssignedKilledHistory(TestTaskAttempt.java:388)
        at org.apache.hadoop.mapreduce.v2.app.job.impl.TestTaskAttempt.testMRAppHistoryForTAFailedInAssigned(TestTaskAttempt.java:177)
{code}



--
This message was sent by Atlassian JIRA
(v6.3.4#6332)

Mime
View raw message