hadoop-mapreduce-issues mailing list archives

Site index · List index
Message view « Date » · « Thread »
Top « Date » · « Thread »
From "Hadoop QA (JIRA)" <j...@apache.org>
Subject [jira] [Commented] (MAPREDUCE-6555) TestMRAppMaster fails on trunk
Date Wed, 25 Nov 2015 14:07:11 GMT

    [ https://issues.apache.org/jira/browse/MAPREDUCE-6555?page=com.atlassian.jira.plugin.system.issuetabpanels:comment-tabpanel&focusedCommentId=15026816#comment-15026816
] 

Hadoop QA commented on MAPREDUCE-6555:
--------------------------------------

| (x) *{color:red}-1 overall{color}* |
\\
\\
|| Vote || Subsystem || Runtime || Comment ||
| {color:blue}0{color} | {color:blue} reexec {color} | {color:blue} 0m 0s {color} | {color:blue}
Docker mode activated. {color} |
| {color:green}+1{color} | {color:green} @author {color} | {color:green} 0m 0s {color} | {color:green}
The patch does not contain any @author tags. {color} |
| {color:green}+1{color} | {color:green} test4tests {color} | {color:green} 0m 0s {color}
| {color:green} The patch appears to include 1 new or modified test files. {color} |
| {color:green}+1{color} | {color:green} mvninstall {color} | {color:green} 8m 57s {color}
| {color:green} trunk passed {color} |
| {color:green}+1{color} | {color:green} compile {color} | {color:green} 0m 23s {color} |
{color:green} trunk passed with JDK v1.8.0_66 {color} |
| {color:green}+1{color} | {color:green} compile {color} | {color:green} 0m 25s {color} |
{color:green} trunk passed with JDK v1.7.0_85 {color} |
| {color:green}+1{color} | {color:green} checkstyle {color} | {color:green} 0m 13s {color}
| {color:green} trunk passed {color} |
| {color:green}+1{color} | {color:green} mvnsite {color} | {color:green} 0m 31s {color} |
{color:green} trunk passed {color} |
| {color:green}+1{color} | {color:green} mvneclipse {color} | {color:green} 0m 15s {color}
| {color:green} trunk passed {color} |
| {color:green}+1{color} | {color:green} findbugs {color} | {color:green} 0m 49s {color} |
{color:green} trunk passed {color} |
| {color:green}+1{color} | {color:green} javadoc {color} | {color:green} 0m 18s {color} |
{color:green} trunk passed with JDK v1.8.0_66 {color} |
| {color:green}+1{color} | {color:green} javadoc {color} | {color:green} 0m 19s {color} |
{color:green} trunk passed with JDK v1.7.0_85 {color} |
| {color:green}+1{color} | {color:green} mvninstall {color} | {color:green} 0m 28s {color}
| {color:green} the patch passed {color} |
| {color:green}+1{color} | {color:green} compile {color} | {color:green} 0m 22s {color} |
{color:green} the patch passed with JDK v1.8.0_66 {color} |
| {color:green}+1{color} | {color:green} javac {color} | {color:green} 0m 22s {color} | {color:green}
the patch passed {color} |
| {color:green}+1{color} | {color:green} compile {color} | {color:green} 0m 25s {color} |
{color:green} the patch passed with JDK v1.7.0_85 {color} |
| {color:green}+1{color} | {color:green} javac {color} | {color:green} 0m 25s {color} | {color:green}
the patch passed {color} |
| {color:green}+1{color} | {color:green} checkstyle {color} | {color:green} 0m 12s {color}
| {color:green} the patch passed {color} |
| {color:green}+1{color} | {color:green} mvnsite {color} | {color:green} 0m 30s {color} |
{color:green} the patch passed {color} |
| {color:green}+1{color} | {color:green} mvneclipse {color} | {color:green} 0m 15s {color}
| {color:green} the patch passed {color} |
| {color:green}+1{color} | {color:green} whitespace {color} | {color:green} 0m 0s {color}
| {color:green} Patch has no whitespace issues. {color} |
| {color:green}+1{color} | {color:green} findbugs {color} | {color:green} 0m 59s {color} |
{color:green} the patch passed {color} |
| {color:green}+1{color} | {color:green} javadoc {color} | {color:green} 0m 19s {color} |
{color:green} the patch passed with JDK v1.8.0_66 {color} |
| {color:green}+1{color} | {color:green} javadoc {color} | {color:green} 0m 19s {color} |
{color:green} the patch passed with JDK v1.7.0_85 {color} |
| {color:red}-1{color} | {color:red} unit {color} | {color:red} 10m 0s {color} | {color:red}
hadoop-mapreduce-client-app in the patch failed with JDK v1.8.0_66. {color} |
| {color:red}-1{color} | {color:red} unit {color} | {color:red} 10m 20s {color} | {color:red}
hadoop-mapreduce-client-app in the patch failed with JDK v1.7.0_85. {color} |
| {color:green}+1{color} | {color:green} asflicense {color} | {color:green} 0m 25s {color}
| {color:green} Patch does not generate ASF License warnings. {color} |
| {color:black}{color} | {color:black} {color} | {color:black} 37m 55s {color} | {color:black}
{color} |
\\
\\
|| Reason || Tests ||
| JDK v1.8.0_66 Failed junit tests | hadoop.mapreduce.v2.app.TestMRAppMaster |
| JDK v1.7.0_85 Failed junit tests | hadoop.mapreduce.v2.app.TestMRAppMaster |
\\
\\
|| Subsystem || Report/Notes ||
| Docker |  Image:yetus/hadoop:0ca8df7 |
| JIRA Patch URL | https://issues.apache.org/jira/secure/attachment/12774341/MAPREDUCE-6555.02.patch
|
| JIRA Issue | MAPREDUCE-6555 |
| Optional Tests |  asflicense  compile  javac  javadoc  mvninstall  mvnsite  unit  findbugs
 checkstyle  |
| uname | Linux e8afc7dd9088 3.13.0-36-lowlatency #63-Ubuntu SMP PREEMPT Wed Sep 3 21:56:12
UTC 2014 x86_64 x86_64 x86_64 GNU/Linux |
| Build tool | maven |
| Personality | /testptch/hadoop/patchprocess/precommit/personality/provided.sh |
| git revision | trunk / 177975e |
| findbugs | v3.0.0 |
| unit | https://builds.apache.org/job/PreCommit-MAPREDUCE-Build/6194/artifact/patchprocess/patch-unit-hadoop-mapreduce-project_hadoop-mapreduce-client_hadoop-mapreduce-client-app-jdk1.8.0_66.txt
|
| unit | https://builds.apache.org/job/PreCommit-MAPREDUCE-Build/6194/artifact/patchprocess/patch-unit-hadoop-mapreduce-project_hadoop-mapreduce-client_hadoop-mapreduce-client-app-jdk1.7.0_85.txt
|
| unit test logs |  https://builds.apache.org/job/PreCommit-MAPREDUCE-Build/6194/artifact/patchprocess/patch-unit-hadoop-mapreduce-project_hadoop-mapreduce-client_hadoop-mapreduce-client-app-jdk1.8.0_66.txt
https://builds.apache.org/job/PreCommit-MAPREDUCE-Build/6194/artifact/patchprocess/patch-unit-hadoop-mapreduce-project_hadoop-mapreduce-client_hadoop-mapreduce-client-app-jdk1.7.0_85.txt
|
| JDK v1.7.0_85  Test Results | https://builds.apache.org/job/PreCommit-MAPREDUCE-Build/6194/testReport/
|
| modules | C: hadoop-mapreduce-project/hadoop-mapreduce-client/hadoop-mapreduce-client-app
U: hadoop-mapreduce-project/hadoop-mapreduce-client/hadoop-mapreduce-client-app |
| Max memory used | 76MB |
| Powered by | Apache Yetus   http://yetus.apache.org |
| Console output | https://builds.apache.org/job/PreCommit-MAPREDUCE-Build/6194/console |


This message was automatically generated.



> TestMRAppMaster fails on trunk
> ------------------------------
>
>                 Key: MAPREDUCE-6555
>                 URL: https://issues.apache.org/jira/browse/MAPREDUCE-6555
>             Project: Hadoop Map/Reduce
>          Issue Type: Bug
>            Reporter: Varun Saxena
>            Assignee: Junping Du
>         Attachments: MAPREDUCE-6555.patch
>
>
> Observed in QA report of YARN-3840 
> {noformat}
> Running org.apache.hadoop.mapreduce.v2.app.TestMRAppMaster
> Tests run: 9, Failures: 1, Errors: 1, Skipped: 0, Time elapsed: 20.699 sec <<<
FAILURE! - in org.apache.hadoop.mapreduce.v2.app.TestMRAppMaster
> testMRAppMasterMidLock(org.apache.hadoop.mapreduce.v2.app.TestMRAppMaster)  Time elapsed:
0.474 sec  <<< FAILURE!
> java.lang.AssertionError: null
> 	at org.junit.Assert.fail(Assert.java:86)
> 	at org.junit.Assert.assertTrue(Assert.java:41)
> 	at org.junit.Assert.assertTrue(Assert.java:52)
> 	at org.apache.hadoop.mapreduce.v2.app.TestMRAppMaster.testMRAppMasterMidLock(TestMRAppMaster.java:174)
> testMRAppMasterSuccessLock(org.apache.hadoop.mapreduce.v2.app.TestMRAppMaster)  Time
elapsed: 0.175 sec  <<< ERROR!
> org.apache.hadoop.yarn.exceptions.YarnRuntimeException: java.io.FileNotFoundException:
File file:/home/varun/hadoop/hadoop-mapreduce-project/hadoop-mapreduce-client/hadoop-mapreduce-client-app/staging/history/done_intermediate/TestAppMasterUser/job_1317529182569_0004-1448100479292-TestAppMasterUser-%3Cmissing+job+name%3E-1448100479413-0-0-SUCCEEDED-default-1448100479292.jhist_tmp
does not exist
> 	at org.apache.hadoop.fs.RawLocalFileSystem.deprecatedGetFileStatus(RawLocalFileSystem.java:640)
> 	at org.apache.hadoop.fs.RawLocalFileSystem.getFileLinkStatusInternal(RawLocalFileSystem.java:866)
> 	at org.apache.hadoop.fs.RawLocalFileSystem.getFileStatus(RawLocalFileSystem.java:630)
> 	at org.apache.hadoop.fs.FileUtil.copy(FileUtil.java:340)
> 	at org.apache.hadoop.fs.FileUtil.copy(FileUtil.java:292)
> 	at org.apache.hadoop.fs.RawLocalFileSystem.rename(RawLocalFileSystem.java:372)
> 	at org.apache.hadoop.fs.ChecksumFileSystem.rename(ChecksumFileSystem.java:513)
> 	at org.apache.hadoop.mapreduce.jobhistory.JobHistoryEventHandler.moveTmpToDone(JobHistoryEventHandler.java:1346)
> 	at org.apache.hadoop.mapreduce.jobhistory.JobHistoryEventHandler.processDoneFiles(JobHistoryEventHandler.java:1154)
> 	at org.apache.hadoop.service.ServiceOperations.stop(ServiceOperations.java:52)
> 	at org.apache.hadoop.service.ServiceOperations.stopQuietly(ServiceOperations.java:80)
> 	at org.apache.hadoop.service.CompositeService.stop(CompositeService.java:157)
> 	at org.apache.hadoop.service.CompositeService.serviceStop(CompositeService.java:131)
> 	at org.apache.hadoop.mapreduce.v2.app.MRAppMaster.serviceStop(MRAppMaster.java:1751)
> 	at org.apache.hadoop.service.AbstractService.stop(AbstractService.java:221)
> 	at org.apache.hadoop.mapreduce.v2.app.MRAppMaster.stop(MRAppMaster.java:1247)
> 	at org.apache.hadoop.mapreduce.v2.app.TestMRAppMaster.testMRAppMasterSuccessLock(TestMRAppMaster.java:254)
> {noformat}



--
This message was sent by Atlassian JIRA
(v6.3.4#6332)

Mime
View raw message