hadoop-mapreduce-issues mailing list archives

Site index · List index
Message view « Date » · « Thread »
Top « Date » · « Thread »
From "Hadoop QA (JIRA)" <j...@apache.org>
Subject [jira] [Commented] (MAPREDUCE-6460) TestRMContainerAllocator.testAttemptNotFoundCausesRMCommunicatorException fails
Date Thu, 17 Sep 2015 18:27:05 GMT

    [ https://issues.apache.org/jira/browse/MAPREDUCE-6460?page=com.atlassian.jira.plugin.system.issuetabpanels:comment-tabpanel&focusedCommentId=14803364#comment-14803364
] 

Hadoop QA commented on MAPREDUCE-6460:
--------------------------------------

\\
\\
| (/) *{color:green}+1 overall{color}* |
\\
\\
|| Vote || Subsystem || Runtime || Comment ||
| {color:blue}0{color} | pre-patch |   6m 33s | Pre-patch trunk compilation is healthy. |
| {color:green}+1{color} | @author |   0m  0s | The patch does not contain any @author tags.
|
| {color:green}+1{color} | tests included |   0m  0s | The patch appears to include 1 new
or modified test files. |
| {color:green}+1{color} | javac |   8m 12s | There were no new javac warning messages. |
| {color:green}+1{color} | release audit |   0m 22s | The applied patch does not increase
the total number of release audit warnings. |
| {color:green}+1{color} | checkstyle |   0m 35s | There were no new checkstyle issues. |
| {color:green}+1{color} | whitespace |   0m  0s | The patch has no lines that end in whitespace.
|
| {color:green}+1{color} | install |   1m 33s | mvn install still works. |
| {color:green}+1{color} | eclipse:eclipse |   0m 32s | The patch built with eclipse:eclipse.
|
| {color:green}+1{color} | findbugs |   1m  8s | The patch does not introduce any new Findbugs
(version 3.0.0) warnings. |
| {color:green}+1{color} | mapreduce tests |   9m 10s | Tests passed in hadoop-mapreduce-client-app.
|
| | |  28m  8s | |
\\
\\
|| Subsystem || Report/Notes ||
| Patch URL | http://issues.apache.org/jira/secure/attachment/12757123/MAPREDUCE-6460.000.patch
|
| Optional Tests | javac unit findbugs checkstyle |
| git revision | trunk / 58d1a02 |
| hadoop-mapreduce-client-app test log | https://builds.apache.org/job/PreCommit-MAPREDUCE-Build/6000/artifact/patchprocess/testrun_hadoop-mapreduce-client-app.txt
|
| Test Results | https://builds.apache.org/job/PreCommit-MAPREDUCE-Build/6000/testReport/
|
| Java | 1.7.0_55 |
| uname | Linux asf905.gq1.ygridcore.net 3.13.0-36-lowlatency #63-Ubuntu SMP PREEMPT Wed Sep
3 21:56:12 UTC 2014 x86_64 x86_64 x86_64 GNU/Linux |
| Console output | https://builds.apache.org/job/PreCommit-MAPREDUCE-Build/6000/console |


This message was automatically generated.

> TestRMContainerAllocator.testAttemptNotFoundCausesRMCommunicatorException fails
> -------------------------------------------------------------------------------
>
>                 Key: MAPREDUCE-6460
>                 URL: https://issues.apache.org/jira/browse/MAPREDUCE-6460
>             Project: Hadoop Map/Reduce
>          Issue Type: Bug
>          Components: test
>            Reporter: zhihai xu
>            Assignee: zhihai xu
>         Attachments: MAPREDUCE-6460.000.patch
>
>
> TestRMContainerAllocator.testAttemptNotFoundCausesRMCommunicatorException fails with
the following logs:
> -------------------------------------------------------
>  T E S T S
> -------------------------------------------------------
> Running org.apache.hadoop.mapreduce.v2.app.rm.TestRMContainerAllocator
> Tests run: 24, Failures: 1, Errors: 0, Skipped: 0, Time elapsed: 94.525 sec <<<
FAILURE! - in org.apache.hadoop.mapreduce.v2.app.rm.TestRMContainerAllocator
> testAttemptNotFoundCausesRMCommunicatorException(org.apache.hadoop.mapreduce.v2.app.rm.TestRMContainerAllocator)
 Time elapsed: 2.606 sec  <<< FAILURE!
> java.lang.AssertionError: Expected exception: org.apache.hadoop.mapreduce.v2.app.rm.RMContainerAllocationException
> 	at org.junit.internal.runners.statements.ExpectException.evaluate(ExpectException.java:32)
> 	at org.junit.internal.runners.statements.RunBefores.evaluate(RunBefores.java:26)
> 	at org.junit.internal.runners.statements.RunAfters.evaluate(RunAfters.java:27)
> 	at org.junit.runners.ParentRunner.runLeaf(ParentRunner.java:271)
> 	at org.junit.runners.BlockJUnit4ClassRunner.runChild(BlockJUnit4ClassRunner.java:70)
> 	at org.junit.runners.BlockJUnit4ClassRunner.runChild(BlockJUnit4ClassRunner.java:50)
> 	at org.junit.runners.ParentRunner$3.run(ParentRunner.java:238)
> 	at org.junit.runners.ParentRunner$1.schedule(ParentRunner.java:63)
> 	at org.junit.runners.ParentRunner.runChildren(ParentRunner.java:236)
> 	at org.junit.runners.ParentRunner.access$000(ParentRunner.java:53)
> 	at org.junit.runners.ParentRunner$2.evaluate(ParentRunner.java:229)
> 	at org.junit.runners.ParentRunner.run(ParentRunner.java:309)
> 	at org.apache.maven.surefire.junit4.JUnit4Provider.execute(JUnit4Provider.java:264)
> 	at org.apache.maven.surefire.junit4.JUnit4Provider.executeTestSet(JUnit4Provider.java:153)
> 	at org.apache.maven.surefire.junit4.JUnit4Provider.invoke(JUnit4Provider.java:124)
> 	at org.apache.maven.surefire.booter.ForkedBooter.invokeProviderInSameClassLoader(ForkedBooter.java:200)
> 	at org.apache.maven.surefire.booter.ForkedBooter.runSuitesInProcess(ForkedBooter.java:153)
> 	at org.apache.maven.surefire.booter.ForkedBooter.main(ForkedBooter.java:103)
> Results :
> Failed tests: 
>   TestRMContainerAllocator.testAttemptNotFoundCausesRMCommunicatorException Expected
exception: org.apache.hadoop.mapreduce.v2.app.rm.RMContainerAllocationException
> Tests run: 24, Failures: 1, Errors: 0, Skipped: 0



--
This message was sent by Atlassian JIRA
(v6.3.4#6332)

Mime
View raw message