hadoop-mapreduce-issues mailing list archives

Site index · List index
Message view « Date » · « Thread »
Top « Date » · « Thread »
From "Hudson (JIRA)" <j...@apache.org>
Subject [jira] [Commented] (MAPREDUCE-6460) TestRMContainerAllocator.testAttemptNotFoundCausesRMCommunicatorException fails
Date Sat, 19 Sep 2015 10:58:04 GMT

    [ https://issues.apache.org/jira/browse/MAPREDUCE-6460?page=com.atlassian.jira.plugin.system.issuetabpanels:comment-tabpanel&focusedCommentId=14877028#comment-14877028
] 

Hudson commented on MAPREDUCE-6460:
-----------------------------------

FAILURE: Integrated in Hadoop-Hdfs-trunk #2334 (See [https://builds.apache.org/job/Hadoop-Hdfs-trunk/2334/])
MAPREDUCE-6460. TestRMContainerAllocator.testAttemptNotFoundCausesRMCommunicatorException
fails. Contributed by Zhihai Xu. (zxu: rev e3ace31e2b7e3a8dc6cf3dc044d5ef2a9aa12e29)
* hadoop-mapreduce-project/CHANGES.txt
* hadoop-mapreduce-project/hadoop-mapreduce-client/hadoop-mapreduce-client-app/src/test/java/org/apache/hadoop/mapreduce/v2/app/rm/TestRMContainerAllocator.java


> TestRMContainerAllocator.testAttemptNotFoundCausesRMCommunicatorException fails
> -------------------------------------------------------------------------------
>
>                 Key: MAPREDUCE-6460
>                 URL: https://issues.apache.org/jira/browse/MAPREDUCE-6460
>             Project: Hadoop Map/Reduce
>          Issue Type: Bug
>          Components: test
>            Reporter: zhihai xu
>            Assignee: zhihai xu
>             Fix For: 2.8.0
>
>         Attachments: MAPREDUCE-6460.000.patch
>
>
> TestRMContainerAllocator.testAttemptNotFoundCausesRMCommunicatorException fails with
the following logs:
> -------------------------------------------------------
>  T E S T S
> -------------------------------------------------------
> Running org.apache.hadoop.mapreduce.v2.app.rm.TestRMContainerAllocator
> Tests run: 24, Failures: 1, Errors: 0, Skipped: 0, Time elapsed: 94.525 sec <<<
FAILURE! - in org.apache.hadoop.mapreduce.v2.app.rm.TestRMContainerAllocator
> testAttemptNotFoundCausesRMCommunicatorException(org.apache.hadoop.mapreduce.v2.app.rm.TestRMContainerAllocator)
 Time elapsed: 2.606 sec  <<< FAILURE!
> java.lang.AssertionError: Expected exception: org.apache.hadoop.mapreduce.v2.app.rm.RMContainerAllocationException
> 	at org.junit.internal.runners.statements.ExpectException.evaluate(ExpectException.java:32)
> 	at org.junit.internal.runners.statements.RunBefores.evaluate(RunBefores.java:26)
> 	at org.junit.internal.runners.statements.RunAfters.evaluate(RunAfters.java:27)
> 	at org.junit.runners.ParentRunner.runLeaf(ParentRunner.java:271)
> 	at org.junit.runners.BlockJUnit4ClassRunner.runChild(BlockJUnit4ClassRunner.java:70)
> 	at org.junit.runners.BlockJUnit4ClassRunner.runChild(BlockJUnit4ClassRunner.java:50)
> 	at org.junit.runners.ParentRunner$3.run(ParentRunner.java:238)
> 	at org.junit.runners.ParentRunner$1.schedule(ParentRunner.java:63)
> 	at org.junit.runners.ParentRunner.runChildren(ParentRunner.java:236)
> 	at org.junit.runners.ParentRunner.access$000(ParentRunner.java:53)
> 	at org.junit.runners.ParentRunner$2.evaluate(ParentRunner.java:229)
> 	at org.junit.runners.ParentRunner.run(ParentRunner.java:309)
> 	at org.apache.maven.surefire.junit4.JUnit4Provider.execute(JUnit4Provider.java:264)
> 	at org.apache.maven.surefire.junit4.JUnit4Provider.executeTestSet(JUnit4Provider.java:153)
> 	at org.apache.maven.surefire.junit4.JUnit4Provider.invoke(JUnit4Provider.java:124)
> 	at org.apache.maven.surefire.booter.ForkedBooter.invokeProviderInSameClassLoader(ForkedBooter.java:200)
> 	at org.apache.maven.surefire.booter.ForkedBooter.runSuitesInProcess(ForkedBooter.java:153)
> 	at org.apache.maven.surefire.booter.ForkedBooter.main(ForkedBooter.java:103)
> Results :
> Failed tests: 
>   TestRMContainerAllocator.testAttemptNotFoundCausesRMCommunicatorException Expected
exception: org.apache.hadoop.mapreduce.v2.app.rm.RMContainerAllocationException
> Tests run: 24, Failures: 1, Errors: 0, Skipped: 0



--
This message was sent by Atlassian JIRA
(v6.3.4#6332)

Mime
View raw message